{"text_format":"1","workbook":"xlsx","n_sheets":21,"sheets":["GUIA PARA PREENCHIMENTO","MODELO PROPOSTA","Remunerações","Resumo","1","2","Dados Gerais","Encargos Sociais","BDI","Uniformes","EPI","SREP","Não Rel - EPI","Equip Rel","Não Rel - Depr","Não Rel - Mat Consumo","Não Rel - Mat Cons Durável","Não Rel - Serviços","Not. Demanda","Mat Cons","Mat Perm"],"not_rendered":{"charts":0,"images":8,"macros":1,"external_links":0,"defined_names":23,"comments":2,"pivot_tables":0},"unopened":[],"bounds":{"document_bytes":16777216,"sheet_cells":100000,"rows_first":2000,"rows_last":500,"rows_between":2000,"halvings":0,"cell_chars":16384,"cell_head_chars":4096},"cells_cut":0,"cells_raw":0,"read":"whole","date_system":"1900"}

{"sheet":"GUIA PARA PREENCHIMENTO","index":0,"n_rows":5,"n_cols":1,"rows_kept":5,"cut":false,"hidden":false,"merged":[]}
["GUIA PARA PREENCHIMENTO"]
[]
["1 - Preencher apenas as guias azuis:"]
[]
["2 - Recomendamos preencher somente as células com fundo azul claro. As demais possuem fórmulas e sugerimos não alterá-las."]

{"sheet":"MODELO PROPOSTA","index":1,"n_rows":109,"n_cols":2,"rows_kept":109,"cut":false,"hidden":false,"merged":[[76,1,90,9],[91,1,94,9],[56,1,61,9],[62,1,75,9],[35,1,37,4],[35,5,37,9],[49,1,51,9],[52,1,55,9],[28,1,28,4],[28,5,28,9],[31,1,32,4],[31,5,32,9],[11,1,11,9],[1,1,1,9],[4,1,4,9],[6,1,6,9],[10,1,10,9],[7,1,9,9],[27,1,27,4],[27,5,27,9],[12,1,12,9],[13,1,13,9],[14,1,14,9],[16,1,16,9],[17,1,17,9],[18,1,18,2],[19,1,20,9],[21,1,21,9],[23,1,23,9],[24,1,24,9],[25,1,25,9],[29,1,29,4],[29,5,29,9],[30,1,30,4],[30,5,30,9],[38,1,38,4],[38,5,38,9],[33,1,34,4],[33,5,34,9],[97,1,97,4],[97,5,97,9],[39,1,39,4],[39,5,39,9],[40,1,40,4],[40,5,40,9],[41,1,41,9],[43,1,43,9],[45,1,45,9],[47,1,47,9],[96,1,96,9],[44,1,44,9],[48,1,48,9],[105,1,105,9],[108,1,108,9],[98,1,98,4],[98,5,98,9],[99,1,99,4],[99,5,99,9],[103,1,103,9],[104,1,104,9],[100,1,100,9]]}
[]
[null,"MODELO DA PROPOSTA COMPLETA"]
[]
[null,"."]
[null,"I – FORMALIZAÇÃO"]
[]
[null,"PREGÃO ELETRÔNICO N. 90105/2025"]
[null,"OBJETO: Prestação de serviços continuados na área de descrição individual e registro em sistema informatizado de documentos manuscritos, impressos e audiovisuais (em qualquer suporte e formato), sob custódia do Arquivo da Câmara dos Deputados, a serem executados com regime de dedicação exclusiva de mão de obra, pelo período de 12 (doze) meses."]
{"$rows_left_out":102}
{"sheet":"Remunerações","index":2,"n_rows":36,"n_cols":15,"rows_kept":36,"cut":false,"hidden":false,"merged":[[0,1,0,10]]}
[null,"QUADRO DE REMUNERAÇÕES"]
[]
[null,null,"ITEM","POSTO DE TRABALHO","QUANTIDADE","SALÁRIO","ADICIONAL DE PERICULOSIDADE","ADICIONAL DE INSALUBRIDADE","ADICIONAL NOTURNO","OUTROS","SALÁRIO COM ADICIONAIS"]
[null,null,null,"POSTO DE TRABALHO - EQUIPE DE TRABALHO"]
[null,null,1,{"$f":"HLOOKUP($C5,'Dados Gerais'!$D$5:$H$68,6)","v":"TÉCNICO EM DESCRIÇÃO DE DOCUMENTOS DE ARQUIVO"},{"$f":"HLOOKUP($C5,'Dados Gerais'!$D$5:$H$68,10)","v":8},{"$f":"HLOOKUP($C5,'Dados Gerais'!$D$5:$H$68,8)","v":3779.26},{"$f":"HLOOKUP($C5,'Dados Gerais'!$D$5:$H$68,26)","v":0},{"$f":"HLOOKUP($C5,'Dados Gerais'!$D$5:$H$68,32)","v":0},{"$f":"HLOOKUP($C5,'Dados Gerais'!$D$5:$H$68,47)","v":0},{"$f":"HLOOKUP($C5,'Dados Gerais'!$D$5:$H$68,34)","v":0},{"$f":"SUM(F5:J5)","v":3779.26},null,null,3400.46,{"$f":"(K5-N5)/N5","v":0.11139669338854161}]
[null,null,2,{"$f":"HLOOKUP($C6,'Dados Gerais'!$D$5:$H$68,6)","v":"COORDENADOR DE DESCRIÇÃO DE DOCUMENTOS DE ARQUIVO"},{"$f":"HLOOKUP($C6,'Dados Gerais'!$D$5:$H$68,10)","v":2},{"$f":"HLOOKUP($C6,'Dados Gerais'!$D$5:$H$68,8)","v":6297.81},{"$f":"HLOOKUP($C6,'Dados Gerais'!$D$5:$H$68,26)","v":0},{"$f":"HLOOKUP($C6,'Dados Gerais'!$D$5:$H$68,32)","v":0},{"$f":"HLOOKUP($C6,'Dados Gerais'!$D$5:$H$68,47)","v":0},{"$f":"HLOOKUP($C6,'Dados Gerais'!$D$5:$H$68,34)","v":0},6297.81,null,null,5811.37,{"$f":"(K6-N6)/N6","v":8.370487509829877E-2}]
[null,null,3,{"$f":"HLOOKUP($C7,'Dados Gerais'!$D$5:$H$68,6)","v":0},{"$f":"HLOOKUP($C7,'Dados Gerais'!$D$5:$H$68,10)","v":0},{"$f":"HLOOKUP($C7,'Dados Gerais'!$D$5:$H$68,8)","v":0},{"$f":"HLOOKUP($C7,'Dados Gerais'!$D$5:$H$68,26)","v":0},{"$f":"HLOOKUP($C7,'Dados Gerais'!$D$5:$H$68,32)","v":0},{"$f":"HLOOKUP($C7,'Dados Gerais'!$D$5:$H$68,47)","v":0},{"$f":"HLOOKUP($C7,'Dados Gerais'!$D$5:$H$68,34)","v":0},0]
[null,null,4,{"$f":"HLOOKUP($C8,'Dados Gerais'!$D$5:$H$68,6)","v":0},{"$f":"HLOOKUP($C8,'Dados Gerais'!$D$5:$H$68,10)","v":0},{"$f":"HLOOKUP($C8,'Dados Gerais'!$D$5:$H$68,8)","v":0},{"$f":"HLOOKUP($C8,'Dados Gerais'!$D$5:$H$68,26)","v":0},{"$f":"HLOOKUP($C8,'Dados Gerais'!$D$5:$H$68,32)","v":0},{"$f":"HLOOKUP($C8,'Dados Gerais'!$D$5:$H$68,47)","v":0},{"$f":"HLOOKUP($C8,'Dados Gerais'!$D$5:$H$68,34)","v":0},0]
{"$rows_left_out":29}
{"sheet":"Resumo","index":3,"n_rows":55,"n_cols":9,"rows_kept":55,"cut":false,"hidden":false,"merged":[[2,1,2,6],[38,3,38,5],[40,8,41,16],[36,8,37,16],[52,3,52,5],[26,3,26,5],[42,3,42,5],[48,3,48,5]]}
[]
[]
[null,"RESUMO - TOTAIS MENSAIS - FATURA ORDINÁRIA"]
[]
[]
[null,null,"ITEM","POSTO DE TRABALHO","QUANTIDADE","PREÇO UNIT","PREÇO TOTAL (MENSAL)"]
[null,null,1,{"$f":"HLOOKUP(C7,'Dados Gerais'!$D$5:$BK$10,6)","v":"TÉCNICO EM DESCRIÇÃO DE DOCUMENTOS DE ARQUIVO"},{"$f":"HLOOKUP(C7,'Dados Gerais'!$D$5:$BK$14,10)","v":8},{"$f":"'1'!$E$112","v":10314.780000000001},{"$f":"F7*E7","v":82518.240000000005}]
[null,null,2,{"$f":"HLOOKUP(C8,'Dados Gerais'!$D$5:$BK$10,6)","v":"COORDENADOR DE DESCRIÇÃO DE DOCUMENTOS DE ARQUIVO"},{"$f":"HLOOKUP(C8,'Dados Gerais'!$D$5:$BK$14,10)","v":2},{"$f":"'2'!$E$112","v":15734.65},{"$f":"F8*E8","v":31469.3}]
{"$rows_left_out":48}
{"sheet":"1","index":4,"n_rows":112,"n_cols":8,"rows_kept":112,"cut":false,"hidden":false,"merged":[[81,1,81,3],[90,1,90,3],[1,1,1,5],[2,1,2,5],[4,1,4,2],[5,1,5,2],[7,1,7,3],[18,1,18,3],[46,3,46,5],[53,1,53,3],[63,1,63,3],[75,3,75,5]]}
[]
[null,"PLANILHA DE ESTIMATIVA DE CUSTOS"]
[null,"Padrão IN 05/2017 e IN 07/2018 - MPDG - Medição por posto presente"]
[]
[null,1,null,{"$f":"HLOOKUP($B$5,'Dados Gerais'!$D$5:$E$20,6,0)","v":"TÉCNICO EM DESCRIÇÃO DE DOCUMENTOS DE ARQUIVO"},"QUANTIDADE",{"$f":"HLOOKUP($B$5,'Dados Gerais'!$D$5:$BI$22,10)","v":8}]
[null,"CCT",null,{"$f":"HLOOKUP($B$5,'Dados Gerais'!$D$5:$E$20,15,0)","v":"SINDPD/DF X SINDESEI/DF 2025/2026 Nº DF000717/2025"},"DATA-BASE",{"$f":"HLOOKUP($B$5,'Dados Gerais'!$D$5:$BI$22,16)","v":"2025-05-01"}]
[]
[null,"MÓDULO 1 - COMPOSIÇÃO DA REMUNERAÇÃO",null,null,null,"Valor"]
{"$rows_left_out":105}
{"sheet":"2","index":5,"n_rows":112,"n_cols":8,"rows_kept":112,"cut":false,"hidden":false,"merged":[[81,1,81,3],[90,1,90,3],[1,1,1,5],[2,1,2,5],[4,1,4,2],[5,1,5,2],[7,1,7,3],[18,1,18,3],[46,3,46,5],[53,1,53,3],[63,1,63,3],[75,3,75,5]]}
[]
[null,"PLANILHA DE ESTIMATIVA DE CUSTOS"]
[null,"Padrão IN 05/2017 e IN 07/2018 - MPDG - Medição por posto presente"]
[]
[null,2,null,{"$f":"HLOOKUP($B$5,'Dados Gerais'!$D$5:$E$20,6,0)","v":"COORDENADOR DE DESCRIÇÃO DE DOCUMENTOS DE ARQUIVO"},"QUANTIDADE",{"$f":"HLOOKUP($B$5,'Dados Gerais'!$D$5:$BI$22,10)","v":2}]
[null,"CCT",null,{"$f":"HLOOKUP($B$5,'Dados Gerais'!$D$5:$E$20,15,0)","v":"SINDPD/DF X SINDESEI/DF 2025/2026 Nº DF000717/2025"},"DATA-BASE",{"$f":"HLOOKUP($B$5,'Dados Gerais'!$D$5:$BI$22,16)","v":"2025-05-01"}]
[]
[null,"MÓDULO 1 - COMPOSIÇÃO DA REMUNERAÇÃO",null,null,null,"Valor"]
{"$rows_left_out":105}
{"sheet":"Dados Gerais","index":6,"n_rows":118,"n_cols":63,"rows_kept":118,"cut":false,"hidden":false,"merged":[[2,1,2,2]]}
[]
[]
[null,"INFORMAÇÕES DE ENTRADA"]
[]
[{"$f":"HLOOKUP($B$5,'Dados Gerais'!$D$5:$BI$22,8)","v":{"$error":"#N/A"}},null,null,1,2,3,4,5,6,7,8,9,10,11,12,13,14,15,16,17,18,19,20,21,22,23,24,25,26,27,28,29,30,31,32,33,34,35,36,37,38,39,40,41,42,43,44,45,46,47,48,49,50,51,52,53,54,55,56,57,58,59,60]
[{"$f":"HLOOKUP($B$5,'Dados Gerais'!$D$5:$BI$39,25)","v":{"$error":"#N/A"}},"",null,"CARGO 1","CARGO 2","CARGO 3","CARGO 4","CARGO 5","CARGO 6","CARGO 7","CARGO 8","CARGO 9","CARGO 10","CARGO 11","CARGO 12","CARGO 13","CARGO 14","CARGO 15","CARGO 16","CARGO 17","CARGO 18","CARGO 19","CARGO 20","CARGO 21","CARGO 22","CARGO 23","CARGO 24","CARGO 25","CARGO 26","CARGO 27","CARGO 28","CARGO 29","CARGO 30","CARGO 31","CARGO 32","CARGO 33","CARGO 34","CARGO 35","CARGO 36","CARGO 37","CARGO 38","CARGO 39","CARGO 40","CARGO 41","CARGO 42","CARGO 43","CARGO 44","CARGO 45","CARGO 46","CARGO 47","CARGO 48","CARGO 49","CARGO 50","CARGO 51","CARGO 52","CARGO 53","CARGO 54","CARGO 55","CARGO 56","CARGO 57","CARGO 58","CARGO 59","CARGO 60"]
[{"$f":"HLOOKUP($B$5,'Dados Gerais'!$D$5:$BI$39,31)","v":{"$error":"#N/A"}},"INFORMAÇÕES BÁSICAS"]
[{"$f":"HLOOKUP($B$5,'Dados Gerais'!$D$5:$BI$52,46)","v":{"$error":"#N/A"}}]
{"$rows_left_out":111}
{"sheet":"Encargos Sociais","index":7,"n_rows":56,"n_cols":7,"rows_kept":56,"cut":false,"hidden":false,"merged":[[2,1,2,3],[3,1,3,4]]}
[]
[]
[]
[null,"ENCARGOS SOCIAIS SOBRE A MÃO DE OBRA"]
[null,null,null,null,"Percentuais"]
[]
[null,"Referência:"]
[null,null,"SINAPI/MPU"]
{"$rows_left_out":49}
{"sheet":"BDI","index":8,"n_rows":36,"n_cols":7,"rows_kept":36,"cut":false,"hidden":false,"merged":[[1,1,1,3],[2,1,2,4]]}
[]
[]
[null,"COMPOSIÇÃO DA TAXA DE CUSTOS INDIRETOS, TRIBUTOS E LUCRO - BDI"]
[null,"APLICAÇÃO: MÃO DE OBRA, 13º, MATERIAIS, EPC E EQUIPAMENTO DE REGISTRO DE FREQUÊNCIA",null,null,"Percentuais"]
[]
[null,"Custos Indiretos da Contratada",null,null,{"$f":"SUM(E7:E8)","v":4.4400000000000002E-2}]
[null,null,"A","Administração Central",3.9E-2,null,"* Nota 1 - O Somatório da Administração Central com o Lucro deve ser inferior a 12%"]
[null,null,"B","Seguros, Garantias e Riscos",5.4000000000000003E-3,null,"* Nota 2 - O risco previsto para o porte do contrato majorado em mais 0,20% devido ao não pagamento dos insumos componentes do custo do posto quando da ausência do mesmo."]
{"$rows_left_out":29}
{"sheet":"Uniformes","index":9,"n_rows":47,"n_cols":130,"rows_kept":47,"cut":false,"hidden":false,"merged":[[2,1,2,3],[3,1,3,7]]}
[null,null,null,null,null,null,null,null,null,null,{"$f":"K6/12","v":25.447500000000002}]
[]
[]
[null,"UNIFORMES - AQUISIÇÃO",null,null,null,null,null,null,null,null,1,null,{"$f":"K4+1","v":2},null,{"$f":"M4+1","v":3},null,{"$f":"O4+1","v":4},null,{"$f":"Q4+1","v":5},null,{"$f":"S4+1","v":6},null,{"$f":"U4+1","v":7},null,{"$f":"W4+1","v":8},null,{"$f":"Y4+1","v":9},null,{"$f":"AA4+1","v":10},null,{"$f":"AC4+1","v":11},null,{"$f":"AE4+1","v":12},null,{"$f":"AG4+1","v":13},null,{"$f":"AI4+1","v":14},null,{"$f":"AK4+1","v":15},null,{"$f":"AM4+1","v":16},null,{"$f":"AO4+1","v":17},null,{"$f":"AQ4+1","v":18},null,{"$f":"AS4+1","v":19},null,{"$f":"AU4+1","v":20},null,{"$f":"AW4+1","v":21},null,{"$f":"AY4+1","v":22},null,{"$f":"BA4+1","v":23},null,{"$f":"BC4+1","v":24},null,{"$f":"BE4+1","v":25},null,{"$f":"BG4+1","v":26},null,{"$f":"BI4+1","v":27},null,{"$f":"BK4+1","v":28},null,{"$f":"BM4+1","v":29},null,{"$f":"BO4+1","v":30},null,{"$f":"BQ4+1","v":31},null,{"$f":"BS4+1","v":32},null,{"$f":"BU4+1","v":33},null,{"$f":"BW4+1","v":34},null,{"$f":"BY4+1","v":35},null,{"$f":"CA4+1","v":36},null,{"$f":"CC4+1","v":37},null,{"$f":"CE4+1","v":38},null,{"$f":"CG4+1","v":39},null,{"$f":"CI4+1","v":40},null,{"$f":"CK4+1","v":41},null,{"$f":"CM4+1","v":42},null,{"$f":"CO4+1","v":43},null,{"$f":"CQ4+1","v":44},null,{"$f":"CS4+1","v":45},null,{"$f":"CU4+1","v":46},null,{"$f":"CW4+1","v":47},null,{"$f":"CY4+1","v":48},null,{"$f":"DA4+1","v":49},null,{"$f":"DC4+1","v":50},null,{"$f":"DE4+1","v":51},null,{"$f":"DG4+1","v":52},null,{"$f":"DI4+1","v":53},null,{"$f":"DK4+1","v":54},null,{"$f":"DM4+1","v":55},null,{"$f":"DO4+1","v":56},null,{"$f":"DQ4+1","v":57},null,{"$f":"DS4+1","v":58},null,{"$f":"DU4+1","v":59},null,{"$f":"DW4+1","v":60}]
[]
[null,null,null,null,null,null,null,null,null,null,{"$f":"ROUND(SUM(L5:L53),2)","v":305.37},null,{"$f":"ROUND(SUM(N5:N53),2)","v":305.37},null,{"$f":"ROUND(SUM(P5:P53),2)","v":0},null,{"$f":"ROUND(SUM(R5:R53),2)","v":0},null,{"$f":"ROUND(SUM(T5:T53),2)","v":0},null,{"$f":"ROUND(SUM(V5:V53),2)","v":0},null,{"$f":"ROUND(SUM(X5:X53),2)","v":0},null,{"$f":"ROUND(SUM(Z5:Z53),2)","v":0},null,{"$f":"ROUND(SUM(AB5:AB53),2)","v":0},null,{"$f":"ROUND(SUM(AD5:AD53),2)","v":0},null,{"$f":"ROUND(SUM(AF5:AF53),2)","v":0},null,{"$f":"ROUND(SUM(AH5:AH53),2)","v":0},null,{"$f":"ROUND(SUM(AJ5:AJ53),2)","v":0},null,{"$f":"ROUND(SUM(AL5:AL53),2)","v":0},null,{"$f":"ROUND(SUM(AN5:AN53),2)","v":0},null,{"$f":"ROUND(SUM(AP5:AP53),2)","v":0},null,{"$f":"ROUND(SUM(AR5:AR53),2)","v":0},null,{"$f":"ROUND(SUM(AT5:AT53),2)","v":0},null,{"$f":"ROUND(SUM(AV5:AV53),2)","v":0},null,{"$f":"ROUND(SUM(AX5:AX53),2)","v":0},null,{"$f":"ROUND(SUM(AZ5:AZ53),2)","v":0},null,{"$f":"ROUND(SUM(BB5:BB53),2)","v":0},null,{"$f":"ROUND(SUM(BD5:BD53),2)","v":0},null,{"$f":"ROUND(SUM(BF5:BF53),2)","v":0},null,{"$f":"ROUND(SUM(BH5:BH53),2)","v":0},null,{"$f":"ROUND(SUM(BJ5:BJ53),2)","v":0},null,{"$f":"ROUND(SUM(BL5:BL53),2)","v":0},null,{"$f":"ROUND(SUM(BN5:BN53),2)","v":0},null,{"$f":"ROUND(SUM(BP5:BP53),2)","v":0},null,{"$f":"ROUND(SUM(BR5:BR53),2)","v":0},null,{"$f":"ROUND(SUM(BT5:BT53),2)","v":0},null,{"$f":"ROUND(SUM(BV5:BV53),2)","v":0},null,{"$f":"ROUND(SUM(BX5:BX53),2)","v":0},null,{"$f":"ROUND(SUM(BZ5:BZ53),2)","v":0},null,{"$f":"ROUND(SUM(CB5:CB53),2)","v":0},null,{"$f":"ROUND(SUM(CD5:CD53),2)","v":0},null,{"$f":"ROUND(SUM(CF5:CF53),2)","v":0},null,{"$f":"ROUND(SUM(CH5:CH53),2)","v":0},null,{"$f":"ROUND(SUM(CJ5:CJ53),2)","v":0},null,{"$f":"ROUND(SUM(CL5:CL53),2)","v":0},null,{"$f":"ROUND(SUM(CN5:CN53),2)","v":0},null,{"$f":"ROUND(SUM(CP5:CP53),2)","v":0},null,{"$f":"ROUND(SUM(CR5:CR53),2)","v":0},null,{"$f":"ROUND(SUM(CT5:CT53),2)","v":0},null,{"$f":"ROUND(SUM(CV5:CV53),2)","v":0},null,{"$f":"ROUND(SUM(CX5:CX53),2)","v":0},null,{"$f":"ROUND(SUM(CZ5:CZ53),2)","v":0},null,{"$f":"ROUND(SUM(DB5:DB53),2)","v":0},null,{"$f":"ROUND(SUM(DD5:DD53),2)","v":0},null,{"$f":"ROUND(SUM(DF5:DF53),2)","v":0},null,{"$f":"ROUND(SUM(DH5:DH53),2)","v":0},null,{"$f":"ROUND(SUM(DJ5:DJ53),2)","v":0},null,{"$f":"ROUND(SUM(DL5:DL53),2)","v":0},null,{"$f":"ROUND(SUM(DN5:DN53),2)","v":0},null,{"$f":"ROUND(SUM(DP5:DP53),2)","v":0},null,{"$f":"ROUND(SUM(DR5:DR53),2)","v":0},null,{"$f":"ROUND(SUM(DT5:DT53),2)","v":0},null,{"$f":"ROUND(SUM(DV5:DV53),2)","v":0},null,{"$f":"ROUND(SUM(DX5:DX53),2)","v":0},null,{"$f":"ROUND(SUM(DZ5:DZ53),2)","v":0}]
[null,null,"CATEGORIAS",null,null,null,null,"QUANTIDADE"]
[null,null,null,null,null,null,null,null,null,null,{"$f":"IF($C8=K$4,1,0)","v":0},null,{"$f":"IF($C8=M$4,1,0)","v":0}]
{"$rows_left_out":40}
{"sheet":"EPI","index":10,"n_rows":66,"n_cols":128,"rows_kept":66,"cut":false,"hidden":false,"merged":[[2,1,2,3],[3,1,3,5]]}
[]
[null,null,null,null,null,null,null,null,{"$f":"I6/12","v":63.436666666666667},null,{"$f":"K6/12","v":35.451666666666668}]
[]
[null,"EQUIPAMENTOS DE PROTEÇÃO INDIVIDUAL - AQUISIÇÃO",null,null,null,null,null,null,1,null,{"$f":"I4+1","v":2},null,{"$f":"K4+1","v":3},null,{"$f":"M4+1","v":4},null,{"$f":"O4+1","v":5},null,{"$f":"Q4+1","v":6},null,{"$f":"S4+1","v":7},null,{"$f":"U4+1","v":8},null,{"$f":"W4+1","v":9},null,{"$f":"Y4+1","v":10},null,{"$f":"AA4+1","v":11},null,{"$f":"AC4+1","v":12},null,{"$f":"AE4+1","v":13},null,{"$f":"AG4+1","v":14},null,{"$f":"AI4+1","v":15},null,{"$f":"AK4+1","v":16},null,{"$f":"AM4+1","v":17},null,{"$f":"AO4+1","v":18},null,{"$f":"AQ4+1","v":19},null,{"$f":"AS4+1","v":20},null,{"$f":"AU4+1","v":21},null,{"$f":"AW4+1","v":22},null,{"$f":"AY4+1","v":23},null,{"$f":"BA4+1","v":24},null,{"$f":"BC4+1","v":25},null,{"$f":"BE4+1","v":26},null,{"$f":"BG4+1","v":27},null,{"$f":"BI4+1","v":28},null,{"$f":"BK4+1","v":29},null,{"$f":"BM4+1","v":30},null,{"$f":"BO4+1","v":31},null,{"$f":"BQ4+1","v":32},null,{"$f":"BS4+1","v":33},null,{"$f":"BU4+1","v":34},null,{"$f":"BW4+1","v":35},null,{"$f":"BY4+1","v":36},null,{"$f":"CA4+1","v":37},null,{"$f":"CC4+1","v":38},null,{"$f":"CE4+1","v":39},null,{"$f":"CG4+1","v":40},null,{"$f":"CI4+1","v":41},null,{"$f":"CK4+1","v":42},null,{"$f":"CM4+1","v":43},null,{"$f":"CO4+1","v":44},null,{"$f":"CQ4+1","v":45},null,{"$f":"CS4+1","v":46},null,{"$f":"CU4+1","v":47},null,{"$f":"CW4+1","v":48},null,{"$f":"CY4+1","v":49},null,{"$f":"DA4+1","v":50},null,{"$f":"DC4+1","v":51},null,{"$f":"DE4+1","v":52},null,{"$f":"DG4+1","v":53},null,{"$f":"DI4+1","v":54},null,{"$f":"DK4+1","v":55},null,{"$f":"DM4+1","v":56},null,{"$f":"DO4+1","v":57},null,{"$f":"DQ4+1","v":58},null,{"$f":"DS4+1","v":59},null,{"$f":"DU4+1","v":60}]
[]
[null,null,null,null,null,null,null,null,{"$f":"ROUND(SUM(J5:J102),2)","v":761.24},null,{"$f":"ROUND(SUM(L5:L102),2)","v":425.42},null,{"$f":"ROUND(SUM(N5:N102),2)","v":0},null,{"$f":"ROUND(SUM(P5:P102),2)","v":0},null,{"$f":"ROUND(SUM(R5:R102),2)","v":0},null,{"$f":"ROUND(SUM(T5:T102),2)","v":0},null,{"$f":"ROUND(SUM(V5:V102),2)","v":0},null,{"$f":"ROUND(SUM(X5:X102),2)","v":0},null,{"$f":"ROUND(SUM(Z5:Z102),2)","v":0},null,{"$f":"ROUND(SUM(AB5:AB102),2)","v":0},null,{"$f":"ROUND(SUM(AD5:AD102),2)","v":0},null,{"$f":"ROUND(SUM(AF5:AF102),2)","v":0},null,{"$f":"ROUND(SUM(AH5:AH102),2)","v":0},null,{"$f":"ROUND(SUM(AJ5:AJ102),2)","v":0},null,{"$f":"ROUND(SUM(AL5:AL102),2)","v":0},null,{"$f":"ROUND(SUM(AN5:AN102),2)","v":0},null,{"$f":"ROUND(SUM(AP5:AP102),2)","v":0},null,{"$f":"ROUND(SUM(AR5:AR102),2)","v":0},null,{"$f":"ROUND(SUM(AT5:AT102),2)","v":0},null,{"$f":"ROUND(SUM(AV5:AV102),2)","v":0},null,{"$f":"ROUND(SUM(AX5:AX102),2)","v":0},null,{"$f":"ROUND(SUM(AZ5:AZ102),2)","v":0},null,{"$f":"ROUND(SUM(BB5:BB102),2)","v":0},null,{"$f":"ROUND(SUM(BD5:BD102),2)","v":0},null,{"$f":"ROUND(SUM(BF5:BF102),2)","v":0},null,{"$f":"ROUND(SUM(BH5:BH102),2)","v":0},null,{"$f":"ROUND(SUM(BJ5:BJ102),2)","v":0},null,{"$f":"ROUND(SUM(BL5:BL102),2)","v":0},null,{"$f":"ROUND(SUM(BN5:BN102),2)","v":0},null,{"$f":"ROUND(SUM(BP5:BP102),2)","v":0},null,{"$f":"ROUND(SUM(BR5:BR102),2)","v":0},null,{"$f":"ROUND(SUM(BT5:BT102),2)","v":0},null,{"$f":"ROUND(SUM(BV5:BV102),2)","v":0},null,{"$f":"ROUND(SUM(BX5:BX102),2)","v":0},null,{"$f":"ROUND(SUM(BZ5:BZ102),2)","v":0},null,{"$f":"ROUND(SUM(CB5:CB102),2)","v":0},null,{"$f":"ROUND(SUM(CD5:CD102),2)","v":0},null,{"$f":"ROUND(SUM(CF5:CF102),2)","v":0},null,{"$f":"ROUND(SUM(CH5:CH102),2)","v":0},null,{"$f":"ROUND(SUM(CJ5:CJ102),2)","v":0},null,{"$f":"ROUND(SUM(CL5:CL102),2)","v":0},null,{"$f":"ROUND(SUM(CN5:CN102),2)","v":0},null,{"$f":"ROUND(SUM(CP5:CP102),2)","v":0},null,{"$f":"ROUND(SUM(CR5:CR102),2)","v":0},null,{"$f":"ROUND(SUM(CT5:CT102),2)","v":0},null,{"$f":"ROUND(SUM(CV5:CV102),2)","v":0},null,{"$f":"ROUND(SUM(CX5:CX102),2)","v":0},null,{"$f":"ROUND(SUM(CZ5:CZ102),2)","v":0},null,{"$f":"ROUND(SUM(DB5:DB102),2)","v":0},null,{"$f":"ROUND(SUM(DD5:DD102),2)","v":0},null,{"$f":"ROUND(SUM(DF5:DF102),2)","v":0},null,{"$f":"ROUND(SUM(DH5:DH102),2)","v":0},null,{"$f":"ROUND(SUM(DJ5:DJ102),2)","v":0},null,{"$f":"ROUND(SUM(DL5:DL102),2)","v":0},null,{"$f":"ROUND(SUM(DN5:DN102),2)","v":0},null,{"$f":"ROUND(SUM(DP5:DP102),2)","v":0},null,{"$f":"ROUND(SUM(DR5:DR102),2)","v":0},null,{"$f":"ROUND(SUM(DT5:DT102),2)","v":0},null,{"$f":"ROUND(SUM(DV5:DV102),2)","v":0},null,{"$f":"ROUND(SUM(DX5:DX102),2)","v":0}]
[null,null,"CATEGORIAS",null,null,"QUANTIDADE"]
[null,null,null,null,null,null,null,null,{"$f":"IF($C8=I$4,1,0)","v":0}]
{"$rows_left_out":59}
{"sheet":"SREP","index":11,"n_rows":75,"n_cols":15,"rows_kept":75,"cut":false,"hidden":false,"merged":[[2,1,2,3],[3,1,3,14]]}
[]
[]
[]
[null,"SISTEMA DE REGISTRO ELETRÔNICO DE PRESENÇA - SREP"]
[]
[]
[null,null,"PAGAMENTO DA DEPRECIAÇÃO"]
[null,null,"ITEM","DESCRIÇÃO","QUANT ANUAL","CONTA SIAFI","VALOR DE AQ.","% RESIDUAL","VIDA ÚTIL","DEP. MENSAL","CUSTO TOTAL","BDI (%)","PREÇO TOTAL","FONTE","REFERÊNCIA"]
{"$rows_left_out":68}
{"sheet":"Não Rel - EPI","index":12,"n_rows":32,"n_cols":15,"rows_kept":32,"cut":false,"hidden":true,"merged":[[2,1,2,4],[3,1,3,11]]}
[]
[]
[]
[null,"EPIS NÃO RELACIONADOS DIRETAMENTE A UM POSTO DE TRABALHO - AQUISIÇÃO"]
[]
[]
[null,null,null,"ITEM","DESCRIÇÃO","QUANT ANUAL","UNIDADE","CUSTO UNITÁRIO","CUSTO ANUAL","BDI (%)","PREÇO TOTAL","FONTE"]
[]
{"$rows_left_out":25}
{"sheet":"Equip Rel","index":13,"n_rows":80,"n_cols":136,"rows_kept":80,"cut":false,"hidden":true,"merged":[[9,1,9,3],[10,1,10,14]]}
[null,null,"CÂMARA DOS DEPUTADOS"]
[null,null,"DEPARTAMENTO TÉCNICO"]
[null,null,"Coordenação de Planejamento e Gestão"]
[]
[null,null,"Data:",{"$f":"'Dados Gerais'!#REF!","v":{"$error":"#REF!"}}]
[null,null,"Processo:",{"$f":"'Dados Gerais'!#REF!","v":{"$error":"#REF!"}}]
[null,null,"Objeto:",{"$f":"'Dados Gerais'!#REF!","v":{"$error":"#REF!"}}]
[]
{"$rows_left_out":73}
{"sheet":"Não Rel - Depr","index":14,"n_rows":95,"n_cols":15,"rows_kept":95,"cut":false,"hidden":true,"merged":[[2,1,2,3],[3,1,3,14]]}
[]
[]
[]
[null,"EQUIPAMENTOS NÃO RELACIONADOS DIRETAMENTE A UM POSTO DE TRABALHO - PAGAMENTO DA DEPRECIAÇÃO / MANUTENÇÃO"]
[]
[]
[null,null,"PAGAMENTO DA DEPRECIAÇÃO"]
[null,null,"ITEM","DESCRIÇÃO","QUANT ANUAL","CONTA SIAFI","VALOR DE AQ.","% RESIDUAL","VIDA ÚTIL","DEP. MENSAL","CUSTO TOTAL","BDI (%)","PREÇO TOTAL","FONTE","REFERÊNCIA"]
{"$rows_left_out":88}
{"sheet":"Não Rel - Mat Consumo","index":15,"n_rows":50,"n_cols":14,"rows_kept":50,"cut":false,"hidden":true,"merged":[[2,1,2,4],[3,1,3,13]]}
[]
[]
[]
[null,"MATERIAIS NÃO RELACIONADOS DIRETAMENTE A UM POSTO DE TRABALHO - AQUISIÇÃO SOB DEMANDA"]
[]
[]
[null,null,"ITEM","CÓDIGO","DESCRIÇÃO","QUANT MENSAL","QUANT ANUAL","UNIDADE","CUSTO UNITÁRIO","CUSTO TOTAL","BDI (%)","PREÇO TOTAL","FONTE","REFERÊNCIA"]
[]
{"$rows_left_out":43}
{"sheet":"Não Rel - Mat Cons Durável","index":16,"n_rows":36,"n_cols":14,"rows_kept":36,"cut":false,"hidden":true,"merged":[[2,1,2,4],[3,1,3,13]]}
[]
[]
[]
[null,"MATERIAIS DE CONSUMO PERMANENTE NÃO RELACIONADOS DIRETAMENTE A UM POSTO DE TRABALHO - AQUISIÇÃO SOB DEMANDA"]
[]
[]
[null,null,"ITEM","CÓDIGO","DESCRIÇÃO","ESTOQUE INICIAL","QUANT ANUAL","UNIDADE","CUSTO UNITÁRIO","CUSTO TOTAL","BDI (%)","PREÇO TOTAL","FONTE","REFERÊNCIA"]
[]
{"$rows_left_out":29}
{"sheet":"Não Rel - Serviços","index":17,"n_rows":11,"n_cols":13,"rows_kept":11,"cut":false,"hidden":true,"merged":[[1,1,1,4],[2,1,2,12]]}
[]
[]
[null,"SERVIÇOS NÃO RELACIONADOS DIRETAMENTE A UM POSTO DE TRABALHO - AQUISIÇÃO SOB DEMANDA"]
[]
[]
[null,null,"ITEM","CÓDIGO","DESCRIÇÃO","QUANT ANUAL","UNIDADE","CUSTO UNITÁRIO","CUSTO TOTAL","BDI (%)","PREÇO TOTAL","FONTE","REFERÊNCIA"]
[]
[null,null,1,null,"SERVIÇOS DE DESINSETIZAÇÃO E DESRATIZAÇÃO (58.367,55 m²)",4,"aplicações",null,{"$f":"H8*F8","v":0},{"$f":"BDI!E17","v":0},{"$f":"ROUND(I8*(1+J8),2)","v":0},"Cotação"]
{"$rows_left_out":4}
{"sheet":"Not. Demanda","index":18,"n_rows":59,"n_cols":8,"rows_kept":59,"cut":false,"hidden":true,"merged":[[9,1,9,3],[10,1,10,7]]}
[null,null,"CÂMARA DOS DEPUTADOS"]
[null,null,"DEPARTAMENTO TÉCNICO"]
[null,null,"Coordenação de Planejamento e Gestão"]
[]
[null,null,"Data:",{"$f":"'Dados Gerais'!#REF!","v":{"$error":"#REF!"}}]
[null,null,"Processo:",{"$f":"'Dados Gerais'!#REF!","v":{"$error":"#REF!"}}]
[null,null,"Objeto:",{"$f":"'Dados Gerais'!#REF!","v":{"$error":"#REF!"}}]
[]
{"$rows_left_out":52}
{"sheet":"Mat Cons","index":19,"n_rows":28,"n_cols":128,"rows_kept":28,"cut":false,"hidden":true,"merged":[[9,1,9,3],[10,1,10,5]]}
[null,null,"CÂMARA DOS DEPUTADOS"]
[null,null,"DEPARTAMENTO TÉCNICO"]
[null,null,"Coordenação de Planejamento e Gestão"]
[]
[null,null,"Data:",{"$f":"'Dados Gerais'!#REF!","v":{"$error":"#REF!"}}]
[null,null,"Processo:",{"$f":"'Dados Gerais'!#REF!","v":{"$error":"#REF!"}}]
[null,null,"Objeto:",{"$f":"'Dados Gerais'!#REF!","v":{"$error":"#REF!"}}]
[]
{"$rows_left_out":21}
{"sheet":"Mat Perm","index":20,"n_rows":113,"n_cols":136,"rows_kept":113,"cut":false,"hidden":true,"merged":[[9,1,9,3],[10,1,10,14]]}
[null,null,"CÂMARA DOS DEPUTADOS"]
[null,null,"DEPARTAMENTO TÉCNICO"]
[null,null,"Coordenação de Planejamento e Gestão"]
[]
[null,null,"Data:",{"$f":"'Dados Gerais'!#REF!","v":{"$error":"#REF!"}}]
[null,null,"Processo:",{"$f":"'Dados Gerais'!#REF!","v":{"$error":"#REF!"}}]
[null,null,"Objeto:",{"$f":"'Dados Gerais'!#REF!","v":{"$error":"#REF!"}}]
[]
{"$rows_left_out":105}