{"text_format":"1","workbook":"xlsx","n_sheets":28,"sheets":["GUIA PARA PREENCHIMENTO","MODELO PROPOSTA","Remunerações","Resumo","1","2","3","4","5","6","7","8","9","Dados Gerais","Encargos Sociais","BDI","Uniformes","EPI","SREP","Não Rel - EPI","Equip Rel","Não Rel - Depr","Não Rel - Mat Consumo","Não Rel - Mat Cons Durável","Não Rel - Serviços","Not. Demanda","Mat Cons","Mat Perm"],"not_rendered":{"charts":0,"images":9,"macros":1,"external_links":0,"defined_names":38,"comments":0,"pivot_tables":0},"unopened":[],"bounds":{"document_bytes":16777216,"sheet_cells":100000,"rows_first":2000,"rows_last":500,"rows_between":2000,"halvings":0,"cell_chars":16384,"cell_head_chars":4096},"cells_cut":0,"cells_raw":0,"read":"whole","date_system":"1900"}

{"sheet":"GUIA PARA PREENCHIMENTO","index":0,"n_rows":5,"n_cols":1,"rows_kept":5,"cut":false,"hidden":false,"merged":[]}
["GUIA PARA PREENCHIMENTO"]
[]
["1 - Preencher apenas as guias azuis:"]
[]
["2 - Recomendamos preencher somente as células com fundo azul claro. As demais possuem fórmulas e sugerimos não alterá-las."]

{"sheet":"MODELO PROPOSTA","index":1,"n_rows":83,"n_cols":2,"rows_kept":83,"cut":false,"hidden":false,"merged":[[68,1,68,9],[77,1,77,9],[78,1,78,9],[79,1,79,9],[82,1,82,9],[70,1,75,9],[54,1,55,9],[67,1,67,4],[67,5,67,9],[57,1,57,9],[60,1,60,9],[62,1,62,9],[64,1,64,9],[65,1,65,4],[65,5,65,9],[66,1,66,4],[66,5,66,9],[58,1,59,9],[45,1,45,9],[48,1,48,9],[50,1,50,9],[51,1,51,9],[52,1,52,9],[35,1,35,9],[41,6,41,10],[42,1,42,9],[43,1,43,9],[44,1,44,9],[36,1,40,9],[31,1,31,4],[31,5,31,9],[32,1,32,4],[32,5,32,9],[33,1,33,4],[33,5,33,9],[28,1,28,4],[28,5,28,9],[29,1,29,4],[29,5,29,9],[30,1,30,4],[30,5,30,9],[27,1,27,4],[27,5,27,9],[12,1,12,9],[13,1,13,9],[14,1,14,9],[16,1,16,9],[17,1,17,9],[18,1,18,2],[19,1,20,9],[21,1,21,9],[23,1,23,9],[24,1,24,9],[25,1,25,9],[11,1,11,9],[1,1,1,9],[4,1,4,9],[6,1,6,9],[10,1,10,9],[7,1,9,9]]}
[]
[null,"MODELO DA PROPOSTA COMPLETA"]
[]
[null,"."]
[null,"I – FORMALIZAÇÃO"]
[]
[null,"PREGÃO ELETRÔNICO N. 90026/2024"]
[null,"OBJETO: Prestação de serviços continuados de limpeza e conservação, a serem executados com regime de dedicação exclusiva de mão de obra, com fornecimento de materiais e equipamentos, e prestação de serviços de controle de vetores, em prédios administrativos da Câmara dos Deputados, pelo período de 30 (trinta) meses."]
[]
[]
[null,"LICITANTE: _____________________________________________________"]
[null,"CNPJ: ________________________________________________________"]
[null,"ENDEREÇO COMPLETO: _________________________________________"]
[null,"TELEFONE:_____________________________________________________"]
[null,"E-MAIL: ________________________________________________________"]
[]
[null,"Apresentamos nossa proposta para o item único da presente licitação, de acordo com as disposições do Edital."]
[null,"Decorre do conteúdo da presente proposta a explicitação do seguinte PREÇO DE JULGAMENTO (GLOBAL) PARA O ITEM ÚNICO, REFERENTE AO PERÍODO DE TRINTA MESES:"]
[null,{"$f":"Resumo!#REF!","v":{"$error":"#REF!"}}]
[null,{"$f":"Extenso_Valor(B19)","v":{"$error":"#VALUE!"}}]
[]
[null,"(por extenso)"]
[]
[null,"No valor proposto estão incluídos todos os custos e todas as despesas, diretas e indiretas, para a execução dos serviços objeto da licitação, em conformidade com as especificações e demais condições e exigências constantes do Edital."]
[null,"Informamos que eventuais rubricas dispostas em Acordo ou Convenção Coletiva de Trabalho que não se relacionem ao custo direto da venda do serviço, tais como “Participação nos Resultados” e “Abono substitutivo de Participação nos Resultados”, serão consideradas nos custos indiretos da proposta."]
[null,"O prazo de validade da presente proposta é de ______ (por extenso) dias. (observado o disposto no Título 4 do Edital)."]
[]
[null,"Convenção coletiva de trabalho ou a norma coletiva a que estamos obrigados:"]
[null,"Data-Base:"]
[null,"Número do Registro SRT:"]
[null,"Regime de tributação da empresa:"]
[null,"Empresa é beneficiada pela desoneração da folha de pagamento instituída pela Lei n. 12.546, de 2001, alterada pela Lei n. 13.161, de 2015?"]
[null,"Empresa adere ao PAT (Programa de Alimentação do Trabalhador)?"]
[null,"(Se adere ao PAT): Os valores do auxílio-alimentação apresentados na presente proposta correspondem somente aos efetivamente pagos pelas empresas aos empregados?"]
[]
[null,"DECLARAÇÕES"]
[null,"Declaramos que seremos responsáveis pelo descarte ambientalmente responsável de qualquer resíduo do serviço a ser prestado, objeto desta licitação – incluindo consumíveis, peças usadas, embalagens – e que temos conhecimento da legislação ambiental sobre o descarte de materiais, em especial a Lei n. 9.605/1998 e a Lei n. 12.305/2010, além da NBR 10.004."]
[]
[]
[]
[]
[]
[null,"A SEREM PRESTADAS SOMENTE NA HIPÓTESE DE LICITANTE MICROEMPRESA OU EMPRESA DE PEQUENO PORTE, EM CONFORMIDADE COM OS ARTIGOS 17, 18, 30 E 31 DA LEI COMPLEMENTAR N. 123, de 2006, E O ACÓRDÃO TCU 2798/2010-PLENÁRIO"]
[null,"Declaramos que:"]
[null,"a)   em se tratando dos serviços vedados descritos no artigo 17 da Lei Complementar n. 123, de 2006, notadamente os descritos no inciso XII (cessão ou locação de mão de obra), ressalvados os serviços listados nos parágrafos 5o-B a 5o-E do artigo 18 da referida Lei, a proposta apresentada não contempla qualquer benefício tributário referente ao SIMPLES NACIONAL, conforme os itens 4.20 e 4.21 do Edital;"]
[null,"b)   na hipótese de contratação desta Microempresa ou Empresa de Pequeno Porte inscrita no SIMPLES NACIONAL e executora de atividade vedada, ficamos sujeitos à exclusão obrigatória no SIMPLES NACIONAL a contar do mês seguinte ao da contratação, em consequência do que dispõem o artigo 17, inciso XII e o artigo 31, inciso II da Lei Complementar n, 123/2006, devendo entregar à Câmara dos Deputados, à título de comprovação, cópia de ofício – com comprovante de entrega e recebimento, que comunique a assinatura do contrato de prestação de serviços mediante cessão de mão de obra e encaminhado pela contratada à Receita Federal do Brasil até o último dia útil do mês subsequente ao da contratação, consoante artigo 30, § 1º, inciso II da Lei Complementar n. 123/2006."]
[]
[]
[null,"A SEREM PRESTADAS SOMENTE NA HIPÓTESE DE LICITANTE BENEFICIADA PELA DESONERAÇÃO DA FOLHA DE PAGAMENTO INSTITUÍDA PELA LEI N. 12.546/2011, ALTERADA PELA LEI N. 13.161/2015. "]
[]
[null,"Declaramos, sob as penas da Lei, que:"]
[null,"a)   recolhemos a contribuição previdenciária incidente sobre o valor da receita bruta, em substituição às contribuições previdenciárias incidentes sobre a folha de pagamento, previstas nos incisos I e III do caput do artigo 22 da Lei n. 8.212/1991, na forma do caput do artigo 7º (ou 8º) da Lei n. 12.546/2011, alterada pela Lei n. 13.161/2015;"]
[null,"b)   temos ciência que nossa manifestação, conforme alínea “a” anterior, será remetida à Receita Federal do Brasil e que, em caso de constatação de falsidade, estará sujeita às sanções administrativas cabíveis, sem prejuízo do encaminhamento dos documentos ao Ministério Público para apuração de eventual responsabilidade criminal desta declarante."]
[]
[null,"A SEREM PRESTADAS SOMENTE PARA A LICITANTE QUE SEJA A ATUAL TITULAR DO CONTRATO QUE SERÁ SUCEDIDO PELA CONTRATAÇÃO DECORRENTE DO PREGÃO EM EPÍGRAFE, NA HIPÓTESE DE HAVER SALÁRIO(S) PRATICADO(S) NO CONTRATO VIGENTE SUPERIOR(ES) AOS MÍNIMOS FIXADOS NO EDITAL E QUE TENHA OPTADO POR TOMAR COMO BASE EM SEUS LANCES E NA PRESENTE PROPOSTA DE PREÇOS SALÁRIO(S) FIXADO(S) NESTE EDITAL:"]
[]
[]
[null,"Declaramos que:"]
[null,"a) estamos cientes de que deveremos apresentar à Câmara dos Deputados, no prazo improrrogável de 60 (sessenta) dias, contado da data de início da vigência do contrato, a convenção ou o acordo coletivo de trabalho, entabulado com a participação do sindicato dos trabalhadores, em que se autoriza a redução salarial, na forma do art. 7°, VI, da Constituição Federal, considerado, ainda, o disposto no subitem 10.9.2.1 do Título 10 da minuta do Termo de Contrato anexa;"]
[]
[null,"b)  estamos cientes de que, na hipótese de não cumprirmos o disposto no teor da declaração da alínea anterior (“a”) e não logrado êxito na contratação de remanescente, sendo necessária a realização de nova licitação, caso participemos do certame, deveremos tomar como base em nossos lances e em nossa proposta de preços o(s) salário(s) maior(es), absorvendo ou acrescentando eventual diferença no BDI, sob pena de desclassificação."]
[]
[null,"É OBRIGATÓRIA A COMPROVAÇÃO A QUE SE REFERE O ITEM 4.3 DO TÍTULO 4 DO TERMO DE REFERÊNCIA (referente ao valor do Fator Acidentário de Prevenção (FAP))."]
[]
[null,"DADOS PARA ASSINATURA DO CONTRATO"]
[null,"Nome do signatário"]
[null,"Cargo"]
[null,"Qualificação\n(naturalidade e domicílio)"]
[null,"OBS.: O signatário deve possuir poderes de administração estabelecidos em contrato social e/ou possuir procuração com poderes para assinar contratos em nome da empresa. \nA documentação comprobatória deverá ser encaminhada quando da assinatura do contrato."]
[]
[null,"\nMODALIDADE DE GARANTIA\nDe acordo com o disposto no Termo de Referência anexo ao Edital, informamos que, caso o objeto nos seja adjudicado, optaremos pela seguinte modalidade de garantia de execução do contrato (artigos 96 e seguintes da Lei 14.133/2021):\n____________________________________\n"]
[]
[]
[]
[]
[]
[]
[null,"Brasília,     de                     de 2024."]
[]
[null,"Assinatura do representante legal da empresa"]
[]
[]
[null,"Nome do representante legal da empresa"]

{"sheet":"Remunerações","index":2,"n_rows":53,"n_cols":12,"rows_kept":53,"cut":false,"hidden":false,"merged":[[0,1,0,10]]}
[null,"QUADRO DE REMUNERAÇÕES"]
[]
[null,null,"ITEM","POSTO DE TRABALHO","QUANTIDADE","SALÁRIO","ADICIONAL DE PERICULOSIDADE","ADICIONAL DE INSALUBRIDADE","ADICIONAL NOTURNO","OUTROS","SALÁRIO COM ADICIONAIS"]
[null,null,null,"POSTO DE TRABALHO - EQUIPE DE TRABALHO"]
[null,null,1,{"$f":"HLOOKUP($C5,'Dados Gerais'!$D$5:$L$68,6)","v":"ENCARREGADO GERAL"},{"$f":"HLOOKUP($C5,'Dados Gerais'!$D$5:$L$68,10)","v":1},{"$f":"HLOOKUP($C5,'Dados Gerais'!$D$5:$L$68,8)","v":7744.91},{"$f":"HLOOKUP($C5,'Dados Gerais'!$D$5:$L$68,26)","v":0},{"$f":"HLOOKUP($C5,'Dados Gerais'!$D$5:$L$68,31)","v":0},{"$f":"HLOOKUP($C5,'Dados Gerais'!$D$5:$L$68,46)","v":0},{"$f":"HLOOKUP($C5,'Dados Gerais'!$D$5:$L$68,33)","v":0},{"$f":"SUM(F5:J5)","v":7744.91}]
[null,null,2,{"$f":"HLOOKUP($C6,'Dados Gerais'!$D$5:$L$68,6)","v":"ENCARREGADO SETORIAL"},{"$f":"HLOOKUP($C6,'Dados Gerais'!$D$5:$L$68,10)","v":2},{"$f":"HLOOKUP($C6,'Dados Gerais'!$D$5:$L$68,8)","v":4428.78},{"$f":"HLOOKUP($C6,'Dados Gerais'!$D$5:$L$68,26)","v":0},{"$f":"HLOOKUP($C6,'Dados Gerais'!$D$5:$L$68,31)","v":0},{"$f":"HLOOKUP($C6,'Dados Gerais'!$D$5:$L$68,46)","v":0},{"$f":"HLOOKUP($C6,'Dados Gerais'!$D$5:$L$68,33)","v":0},{"$f":"SUM(F6:J6)","v":4428.78}]
[null,null,3,{"$f":"HLOOKUP($C7,'Dados Gerais'!$D$5:$L$68,6)","v":"ENCARREGADO DE SERVIÇO"},{"$f":"HLOOKUP($C7,'Dados Gerais'!$D$5:$L$68,10)","v":12},{"$f":"HLOOKUP($C7,'Dados Gerais'!$D$5:$L$68,8)","v":3483.45},{"$f":"HLOOKUP($C7,'Dados Gerais'!$D$5:$L$68,26)","v":0},{"$f":"HLOOKUP($C7,'Dados Gerais'!$D$5:$L$68,31)","v":0},{"$f":"HLOOKUP($C7,'Dados Gerais'!$D$5:$L$68,46)","v":0},{"$f":"HLOOKUP($C7,'Dados Gerais'!$D$5:$L$68,33)","v":0},3483.45]
[null,null,4,{"$f":"HLOOKUP($C8,'Dados Gerais'!$D$5:$L$68,6)","v":"AUXILIAR DE ENCARREGADO"},{"$f":"HLOOKUP($C8,'Dados Gerais'!$D$5:$L$68,10)","v":1},{"$f":"HLOOKUP($C8,'Dados Gerais'!$D$5:$L$68,8)","v":2598.63},{"$f":"HLOOKUP($C8,'Dados Gerais'!$D$5:$L$68,26)","v":0},{"$f":"HLOOKUP($C8,'Dados Gerais'!$D$5:$L$68,31)","v":0},{"$f":"HLOOKUP($C8,'Dados Gerais'!$D$5:$L$68,46)","v":0},{"$f":"HLOOKUP($C8,'Dados Gerais'!$D$5:$L$68,33)","v":0},{"$f":"SUM(F8:J8)","v":2598.63}]
[null,null,5,{"$f":"HLOOKUP($C9,'Dados Gerais'!$D$5:$L$68,6)","v":"ALMOXARIFE"},{"$f":"HLOOKUP($C9,'Dados Gerais'!$D$5:$L$68,10)","v":2},{"$f":"HLOOKUP($C9,'Dados Gerais'!$D$5:$L$68,8)","v":3035.66},{"$f":"HLOOKUP($C9,'Dados Gerais'!$D$5:$L$68,26)","v":0},{"$f":"HLOOKUP($C9,'Dados Gerais'!$D$5:$L$68,31)","v":0},{"$f":"HLOOKUP($C9,'Dados Gerais'!$D$5:$L$68,46)","v":0},{"$f":"HLOOKUP($C9,'Dados Gerais'!$D$5:$L$68,33)","v":0},3035.66]
[null,null,6,{"$f":"HLOOKUP($C10,'Dados Gerais'!$D$5:$L$68,6)","v":"SERVENTE"},{"$f":"HLOOKUP($C10,'Dados Gerais'!$D$5:$L$68,10)","v":189},{"$f":"HLOOKUP($C10,'Dados Gerais'!$D$5:$L$68,8)","v":2017.21},{"$f":"HLOOKUP($C10,'Dados Gerais'!$D$5:$L$68,26)","v":0},{"$f":"HLOOKUP($C10,'Dados Gerais'!$D$5:$L$68,31)","v":0},{"$f":"HLOOKUP($C10,'Dados Gerais'!$D$5:$L$68,46)","v":0},{"$f":"HLOOKUP($C10,'Dados Gerais'!$D$5:$L$68,33)","v":0},{"$f":"SUM(F10:J10)","v":2017.21}]
[null,null,7,{"$f":"HLOOKUP($C11,'Dados Gerais'!$D$5:$L$68,6)","v":0},{"$f":"HLOOKUP($C11,'Dados Gerais'!$D$5:$L$68,10)","v":0},{"$f":"HLOOKUP($C11,'Dados Gerais'!$D$5:$L$68,8)","v":0},{"$f":"HLOOKUP($C11,'Dados Gerais'!$D$5:$L$68,26)","v":0},{"$f":"HLOOKUP($C11,'Dados Gerais'!$D$5:$L$68,31)","v":0},{"$f":"HLOOKUP($C11,'Dados Gerais'!$D$5:$L$68,46)","v":0},{"$f":"HLOOKUP($C11,'Dados Gerais'!$D$5:$L$68,33)","v":0},0]
[null,null,8,{"$f":"HLOOKUP($C12,'Dados Gerais'!$D$5:$L$68,6)","v":0},{"$f":"HLOOKUP($C12,'Dados Gerais'!$D$5:$L$68,10)","v":0},{"$f":"HLOOKUP($C12,'Dados Gerais'!$D$5:$L$68,8)","v":0},{"$f":"HLOOKUP($C12,'Dados Gerais'!$D$5:$L$68,26)","v":0},{"$f":"HLOOKUP($C12,'Dados Gerais'!$D$5:$L$68,31)","v":0},{"$f":"HLOOKUP($C12,'Dados Gerais'!$D$5:$L$68,46)","v":0},{"$f":"HLOOKUP($C12,'Dados Gerais'!$D$5:$L$68,33)","v":0},0]
[null,null,9,{"$f":"HLOOKUP($C13,'Dados Gerais'!$D$5:$L$68,6)","v":0},{"$f":"HLOOKUP($C13,'Dados Gerais'!$D$5:$L$68,10)","v":0},{"$f":"HLOOKUP($C13,'Dados Gerais'!$D$5:$L$68,8)","v":0},{"$f":"HLOOKUP($C13,'Dados Gerais'!$D$5:$L$68,26)","v":0},{"$f":"HLOOKUP($C13,'Dados Gerais'!$D$5:$L$68,31)","v":0},{"$f":"HLOOKUP($C13,'Dados Gerais'!$D$5:$L$68,46)","v":0},{"$f":"HLOOKUP($C13,'Dados Gerais'!$D$5:$L$68,33)","v":0},0]
[]
[null,null,null,"TOTAL DE POSTOS",{"$f":"SUM(E5:E14)","v":207}]
[]
[]
[]
[]
[]
[]
[]
[]
[]
[]
[]
[]
[]
[]
[]
[]
[]
[]
[]
[]
[]
[]
[]
[]
[]
[]
[]
[]
[]
[]
[]
[]
[]
[]
[]
[]
[]
[null,null,null,null,null,null,null,null,null,null,null,{"$f":"SUM(L8:L51)","v":0}]

{"sheet":"Resumo","index":3,"n_rows":103,"n_cols":12,"rows_kept":103,"cut":false,"hidden":false,"merged":[[2,1,2,8],[36,1,36,8],[19,1,19,8],[96,3,96,7],[107,10,108,18],[90,10,95,18],[75,3,75,7],[100,3,100,7],[86,3,86,7],[64,1,64,8],[92,3,92,7]]}
[]
[]
[null,"RESUMO - TOTAIS MENSAIS - FATURA ORDINÁRIA (SEM O 13º E SEM OS ITENS SOB DEMANDA)"]
[]
[]
[null,null,"ITEM","POSTO DE TRABALHO","QUANTIDADE","PREÇO UNIT       (SEM O 13º)","DESTAQUE DO 13º","PREÇO POR EMPREGADO","PREÇO TOTAL (MENSAL)"]
[null,null,1,{"$f":"HLOOKUP(C7,'Dados Gerais'!$D$5:$BK$10,6)","v":"ENCARREGADO GERAL"},{"$f":"HLOOKUP(C7,'Dados Gerais'!$D$5:$BK$14,10)","v":1},{"$f":"'1'!$E$116","v":16684.928068999998},0,{"$f":"G7+F7","v":16684.928068999998},{"$f":"H7*E7","v":16684.928068999998}]
[null,null,2,{"$f":"HLOOKUP(C8,'Dados Gerais'!$D$5:$BK$10,6)","v":"ENCARREGADO SETORIAL"},{"$f":"HLOOKUP(C8,'Dados Gerais'!$D$5:$BK$14,10)","v":2},{"$f":"'2'!$E$116","v":10221.059494000001},0,10221.059494000001,20442.118988000002]
[null,null,3,{"$f":"HLOOKUP(C9,'Dados Gerais'!$D$5:$BK$10,6)","v":"ENCARREGADO DE SERVIÇO"},{"$f":"HLOOKUP(C9,'Dados Gerais'!$D$5:$BK$14,10)","v":12},{"$f":"'3'!$E$115","v":8419.0496359999997},0,8419.0496359999997,101028.595632]
[null,null,4,{"$f":"HLOOKUP(C10,'Dados Gerais'!$D$5:$BK$10,6)","v":"AUXILIAR DE ENCARREGADO"},{"$f":"HLOOKUP(C10,'Dados Gerais'!$D$5:$BK$14,10)","v":1},{"$f":"'4'!$E$115","v":6734.2150789999996},0,{"$f":"G10+F10","v":6734.2150789999996},{"$f":"H10*E10","v":6734.2150789999996}]
[null,null,5,{"$f":"HLOOKUP(C11,'Dados Gerais'!$D$5:$BK$10,6)","v":"ALMOXARIFE"},{"$f":"HLOOKUP(C11,'Dados Gerais'!$D$5:$BK$14,10)","v":2},{"$f":"'5'!$E$115","v":7502.078978999999},0,7502.078978999999,15004.157957999998]
[null,null,6,{"$f":"HLOOKUP(C12,'Dados Gerais'!$D$5:$BK$10,6)","v":"SERVENTE"},{"$f":"HLOOKUP(C12,'Dados Gerais'!$D$5:$BK$14,10)","v":189},{"$f":"'6'!$E$115","v":5564.3360950000015},0,5564.3360950000015,1051659.5219550002]
[null,null,7,{"$f":"HLOOKUP(C13,'Dados Gerais'!$D$5:$BK$10,6)","v":0},{"$f":"HLOOKUP(C13,'Dados Gerais'!$D$5:$BK$14,10)","v":0},{"$f":"'7'!$E$115","v":0},0,{"$f":"G13+F13","v":0},{"$f":"H13*E13","v":0}]
[null,null,8,{"$f":"HLOOKUP(C14,'Dados Gerais'!$D$5:$BK$10,6)","v":0},{"$f":"HLOOKUP(C14,'Dados Gerais'!$D$5:$BK$14,10)","v":0},{"$f":"'8'!$E$115","v":0},0,0,0]
[null,null,9,{"$f":"HLOOKUP(C15,'Dados Gerais'!$D$5:$BK$10,6)","v":0},{"$f":"HLOOKUP(C15,'Dados Gerais'!$D$5:$BK$14,10)","v":0},{"$f":"'9'!$E$115","v":0},0,0,0]
[]
[null,null,null,"TOTAL MENSAL - SALÁRIOS",null,null,null,null,{"$f":"SUM(I7:I16)","v":1211553.5376810003}]
[]
[]
[null,"RESUMO - TOTAIS MENSAIS - DESTAQUE DO 13º SALÁRIO"]
[]
[]
[null,null,"ITEM","POSTO DE TRABALHO","QUANTIDADE","PREÇO UNIT       (SEM O 13º)","DESTAQUE DO 13º","PREÇO POR EMPREGADO","PREÇO TOTAL (MENSAL)"]
[null,null,1,{"$f":"HLOOKUP(C24,'Dados Gerais'!$D$5:$BK$10,6)","v":"ENCARREGADO GERAL"},{"$f":"HLOOKUP(C24,'Dados Gerais'!$D$5:$BK$14,10)","v":1},0,{"$f":"G41","v":1132.6399999999999},{"$f":"G24+F24","v":1132.6399999999999},{"$f":"H24*E24","v":1132.6399999999999}]
[null,null,2,{"$f":"HLOOKUP(C25,'Dados Gerais'!$D$5:$BK$10,6)","v":"ENCARREGADO SETORIAL"},{"$f":"HLOOKUP(C25,'Dados Gerais'!$D$5:$BK$14,10)","v":2},0,{"$f":"G42","v":647.68000000000006},{"$f":"G25+F25","v":647.68000000000006},1295.3600000000001]
[null,null,3,{"$f":"HLOOKUP(C26,'Dados Gerais'!$D$5:$BK$10,6)","v":"ENCARREGADO DE SERVIÇO"},{"$f":"HLOOKUP(C26,'Dados Gerais'!$D$5:$BK$14,10)","v":12},0,{"$f":"G43","v":483.05000000000007},483.05000000000007,5796.6]
[null,null,4,{"$f":"HLOOKUP(C27,'Dados Gerais'!$D$5:$BK$10,6)","v":"AUXILIAR DE ENCARREGADO"},{"$f":"HLOOKUP(C27,'Dados Gerais'!$D$5:$BK$14,10)","v":1},0,360.36,{"$f":"G27+F27","v":360.36},{"$f":"H27*E27","v":360.36}]
[null,null,5,{"$f":"HLOOKUP(C28,'Dados Gerais'!$D$5:$BK$10,6)","v":"ALMOXARIFE"},{"$f":"HLOOKUP(C28,'Dados Gerais'!$D$5:$BK$14,10)","v":2},0,420.96000000000004,420.96000000000004,841.92000000000007]
[null,null,6,{"$f":"HLOOKUP(C29,'Dados Gerais'!$D$5:$BK$10,6)","v":"SERVENTE"},{"$f":"HLOOKUP(C29,'Dados Gerais'!$D$5:$BK$14,10)","v":189},0,279.73,279.73,52868.97]
[null,null,7,{"$f":"HLOOKUP(C30,'Dados Gerais'!$D$5:$BK$10,6)","v":0},{"$f":"HLOOKUP(C30,'Dados Gerais'!$D$5:$BK$14,10)","v":0},0,0,{"$f":"G30+F30","v":0},{"$f":"H30*E30","v":0}]
[null,null,8,{"$f":"HLOOKUP(C31,'Dados Gerais'!$D$5:$BK$10,6)","v":0},{"$f":"HLOOKUP(C31,'Dados Gerais'!$D$5:$BK$14,10)","v":0},0,0,0,0]
[null,null,9,{"$f":"HLOOKUP(C32,'Dados Gerais'!$D$5:$BK$10,6)","v":0},{"$f":"HLOOKUP(C32,'Dados Gerais'!$D$5:$BK$14,10)","v":0},0,0,0,0]
[]
[null,null,null,"TOTAL MENSAL - DESTAQUE DO 13º",null,null,null,null,{"$f":"SUM(I24:I33)","v":62295.850000000006}]
[]
[]
[null,"RESUMO - TOTAIS MENSAIS - FATURA ORDINÁRIA TOTAL"]
[]
[]
[null,null,"ITEM","POSTO DE TRABALHO","QUANTIDADE","PREÇO UNIT       (SEM O 13º)","DESTAQUE DO 13º","PREÇO POR EMPREGADO","PREÇO TOTAL (MENSAL)"]
[null,null,1,{"$f":"HLOOKUP(C41,'Dados Gerais'!$D$5:$BK$10,6)","v":"ENCARREGADO GERAL"},{"$f":"HLOOKUP(C41,'Dados Gerais'!$D$5:$BK$14,10)","v":1},{"$f":"F7","v":16684.928068999998},{"$f":"'1'!$E$117","v":1132.6399999999999},{"$f":"G41+F41","v":17817.568068999997},{"$f":"H41*E41","v":17817.568068999997},null,{"$f":"I41/$I$51","v":1.3987185801797397E-2},{"$f":"$I$62*K41","v":3359.358910592332}]
[null,null,2,{"$f":"HLOOKUP(C42,'Dados Gerais'!$D$5:$BK$10,6)","v":"ENCARREGADO SETORIAL"},{"$f":"HLOOKUP(C42,'Dados Gerais'!$D$5:$BK$14,10)","v":2},{"$f":"F8","v":10221.059494000001},{"$f":"'2'!$E$117","v":647.68000000000006},10868.739494000001,21737.478988000003,null,1.7064402745109723E-2,4098.426533259757]
[null,null,3,{"$f":"HLOOKUP(C43,'Dados Gerais'!$D$5:$BK$10,6)","v":"ENCARREGADO DE SERVIÇO"},{"$f":"HLOOKUP(C43,'Dados Gerais'!$D$5:$BK$14,10)","v":12},8419.0496359999997,{"$f":"'3'!$E$116","v":483.05000000000007},8902.099635999999,106825.19563199999,null,8.3860145999262628E-2,20141.029989749288]
[null,null,4,{"$f":"HLOOKUP(C44,'Dados Gerais'!$D$5:$BK$10,6)","v":"AUXILIAR DE ENCARREGADO"},{"$f":"HLOOKUP(C44,'Dados Gerais'!$D$5:$BK$14,10)","v":1},6734.2150789999996,{"$f":"'4'!$E$116","v":360.36},{"$f":"G44+F44","v":7094.5750789999993},{"$f":"H44*E44","v":7094.5750789999993},null,{"$f":"I44/$I$51","v":5.5693986648731155E-3},{"$f":"$I$62*K44","v":1337.6249730720167}]
[null,null,5,{"$f":"HLOOKUP(C45,'Dados Gerais'!$D$5:$BK$10,6)","v":"ALMOXARIFE"},{"$f":"HLOOKUP(C45,'Dados Gerais'!$D$5:$BK$14,10)","v":2},7502.078978999999,{"$f":"'5'!$E$116","v":420.96000000000004},7923.038978999999,15846.077957999998,null,1.2439522373086228E-2,2987.6503336482383]
[null,null,6,{"$f":"HLOOKUP(C46,'Dados Gerais'!$D$5:$BK$10,6)","v":"SERVENTE"},{"$f":"HLOOKUP(C46,'Dados Gerais'!$D$5:$BK$14,10)","v":189},5564.3360950000015,{"$f":"'6'!$E$116","v":279.73},5844.066095000002,1104528.4919550004,null,0.86707934441587098,208249.94842634507]
[null,null,7,{"$f":"HLOOKUP(C47,'Dados Gerais'!$D$5:$BK$10,6)","v":0},{"$f":"HLOOKUP(C47,'Dados Gerais'!$D$5:$BK$14,10)","v":0},0,{"$f":"'7'!$E$116","v":0},{"$f":"G47+F47","v":0},{"$f":"H47*E47","v":0},null,0,0]
[null,null,8,{"$f":"HLOOKUP(C48,'Dados Gerais'!$D$5:$BK$10,6)","v":0},{"$f":"HLOOKUP(C48,'Dados Gerais'!$D$5:$BK$14,10)","v":0},0,{"$f":"'8'!$E$116","v":0},0,0,null,0,0]
[null,null,9,{"$f":"HLOOKUP(C49,'Dados Gerais'!$D$5:$BK$10,6)","v":0},{"$f":"HLOOKUP(C49,'Dados Gerais'!$D$5:$BK$14,10)","v":0},0,{"$f":"'9'!$E$116","v":0},0,0,null,0,0]
[]
[null,null,null,"TOTAL MENSAL - SALÁRIOS",null,null,null,null,{"$f":"SUM(I41:I50)","v":1273849.3876810004}]
[]
[null,null,"ITEM","DESCRIÇÃO",null,null,null,null,"PREÇO TOTAL (MENSAL)",null,null,{"$f":"SUM(L8:L51)","v":240174.03916666671}]
[null,null,"EQUIP","EQUIPAMENTOS NÃO RELACIONADOS DIRETAMENTE A UM POSTO DE TRABALHO",null,null,null,null,{"$f":"'Não Rel - Depr'!M60","v":0}]
[null,null,"HEXTRA","HORAS EXTRAS",null,null,null,null,{"$f":"'Não Rel - Depr'!M60","v":0}]
[null,null,"HNOT","ADICIONAL DE HORAS NOTURNAS (SOB DEMANDA)",null,null,null,null,0]
[null,null,"SREP","SISTEMA DE REGISTRO ELETRÔNICO DE PRESENÇA - SREP",null,null,null,null,{"$f":"SREP!$M$46","v":1218.79}]
[null,null,"EPI - N.REL","EQUIPAMENTOS DE PROTEÇÃO INDIVIDUAL NÃO RELACIONADOS DIRETAMENTE A UM POSTO DE TRABALHO",null,null,null,null,{"$f":"'Não Rel - EPI'!K29","v":2863.645}]
[null,null,"EQUIP - N.REL","EQUIPAMENTOS NÃO RELACIONADAS DIRETAMENTE A UM POSTO DE TRABALHO",null,null,null,null,{"$f":"'Não Rel - Depr'!M61","v":2961.79}]
[null,null,"MAT ","MATERIAIS NÃO RELACIONADOS DIRETAMENTE A UM POSTO DE TRABALHO",null,null,null,null,{"$f":"'Não Rel - Mat Consumo'!L52","v":229430.89166666669}]
[null,null,"MAT CONS DURAVEL","MATERIAIS DE CONSUMO DURÁVEL NÃO RELACIONADOS DIRETAMENTE A UM POSTO DE TRABALHO",null,null,null,null,{"$f":"'Não Rel - Mat Cons Durável'!M33","v":3698.9225000000001}]
[null,null,null,"TOTAL MENSAL",null,null,null,null,{"$f":"SUM(I54:I61)","v":240174.03916666668},null,{"$f":"(I62+I51)*12","v":18168281.122172005}]
[]
[]
[null,"RESUMO - TOTAL MENSAL - SOB DEMANDA"]
[]
[]
[null,null,"ITEM","DESCRIÇÃO",null,null,null,null,"PREÇO TOTAL (MENSAL)",null,null,{"$f":"SUM(L39:L67)","v":480348.07833333343}]
[null,null,"EQUIP","EQUIPAMENTOS NÃO RELACIONADOS DIRETAMENTE A UM POSTO DE TRABALHO",null,null,null,null,{"$f":"'Não Rel - Depr'!M91","v":0}]
[null,null,"HEXTRA","HORAS EXTRAS",null,null,null,null,{"$f":"'Não Rel - Depr'!M91","v":0}]
[null,null,"HNOT","ADICIONAL DE HORAS NOTURNAS (SOB DEMANDA)",null,null,null,null,0]
[null,null,"SERV. SOB DEMANDA","SERVIÇOS DE DESINSETIZAÇÃO E DESRATIZAÇÃO",null,null,null,null,{"$f":"'Não Rel - Serviços'!K10","v":3255.2075}]
[]
[null,null,null,"TOTAL MENSAL",null,null,null,null,{"$f":"SUM(I69:I73)","v":3255.2075}]
[]
[null,null,null,"TOTAL MENSAL - FATURA ORDINÁRIA - SERVIÇOS DE LIMPEZA E CONSERVAÇÃO"]
[null,null,null,"DESCRIÇÃO",null,null,null,"VALOR"]
[null,null,null,"Postos de Trabalho - Inclusive 13º Salário",null,null,null,{"$f":"I51","v":1273849.3876810004}]
[null,null,null,"Adicional de Horas Noturnas",null,null,null,{"$f":"I56","v":0}]
[null,null,null,"Sistema de Registro Eletrônico de Presença - SREP",null,null,null,{"$f":"I57","v":1218.79}]
[null,null,null,"Equipamentos de Proteção Individual não relacionados diretamente a um posto de trabalho",null,null,null,{"$f":"I58","v":2863.645}]
[null,null,null,"Equipamentos não relacionadas diretamente a um posto de trabalho",null,null,null,{"$f":"I59","v":2961.79}]
[null,null,null,"Materiais de consumo não relacionados diretamente a um posto de trabalho",null,null,null,{"$f":"$I$60","v":229430.89166666669}]
[null,null,null,"Materiais de consumo duráveis não relacionados diretamente a um posto de trabalho",null,null,null,{"$f":"$I$61","v":3698.9225000000001}]
[null,null,null,null,null,null,"TOTAL MENSAL DA CONTRATAÇÃO - FATURA ORDINÁRIA",{"$f":"SUM(H78:H84)","v":1514023.4268476672}]
[]
[null,null,null,"TOTAL MENSAL - SOB DEMANDA - SERVIÇOS DE LIMPEZA E CONSERVAÇÃO"]
[null,null,null,"DESCRIÇÃO",null,null,null,"VALOR"]
[]
[null,null,null,"Serviços de desinsetização e desratização",null,null,null,{"$f":"I74","v":3255.2075}]
[null,null,null,null,null,null,"TOTAL MENSAL DA CONTRATAÇÃO - SOB DEMANDA",{"$f":"H90","v":3255.2075}]
[]
[null,null,null,"TOTAL MENSAL - SERVIÇOS DE LIMPEZA E CONSERVAÇÃO (FATURA ORDINÁRIA + SOB DEMANDA)"]
[]
[null,null,null,null,null,null,"VALOR MENSAL",{"$f":"H85+H91","v":1517278.6343476672}]
[]
[null,null,null,"TOTAL ANUAL - SERVIÇOS DE LIMPEZA E CONSERVAÇÃO"]
[]
[null,null,null,null,null,null,"12 x TOTAL MENSAL",{"$f":"12*H95","v":18207343.612172008}]
[]
[null,null,null,"TOTAL GLOBAL (30 MESES) - SERVIÇOS DE LIMPEZA E CONSERVAÇÃO"]
[]
[null,null,null,null,null,null,"30 x TOTAL MENSAL",{"$f":"30*H95","v":45518359.030430019}]

{"sheet":"1","index":4,"n_rows":119,"n_cols":12,"rows_kept":119,"cut":false,"hidden":false,"merged":[[106,1,106,3],[1,1,1,5],[2,1,2,5],[7,1,7,3],[17,1,17,3],[4,1,4,2],[46,1,46,3],[56,1,56,3],[74,1,74,3],[83,1,83,3],[5,1,5,2],[39,3,39,5],[68,3,68,5]]}
[]
[null,"PLANILHA DE ESTIMATIVA DE CUSTOS"]
[null,"Padrão IN 05/2017 e IN 07/2018 - MPDG"]
[]
[null,1,null,{"$f":"HLOOKUP($B$5,'Dados Gerais'!$D$5:$BK$20,6)","v":"ENCARREGADO GERAL"},"QUANTIDADE",{"$f":"HLOOKUP($B$5,'Dados Gerais'!$D$5:$BK$20,10)","v":1}]
[null,"CCT",null,{"$f":"HLOOKUP($B$5,'Dados Gerais'!$D$5:$BK$20,15)","v":"SEAC/DF X SINDISERVIÇOS/DF 2024/2024 Nº DF000012/2024"},"DATA-BASE",{"$f":"HLOOKUP($B$5,'Dados Gerais'!$D$5:$BK$20,16)","v":"2024-01-01"}]
[]
[null,"MÓDULO 1 - COMPOSIÇÃO DA REMUNERAÇÃO",null,null,null,"Valor"]
[null,null,"A","Salário-Base",null,{"$f":"HLOOKUP($B$5,'Dados Gerais'!$D$5:$BK$20,8)","v":7744.91}]
[null,null,"B","Adicional de Periculosidade",null,{"$f":"HLOOKUP($B$5,'Dados Gerais'!$D$5:$BK$37,25)","v":0}]
[null,null,"C","Adicional de Insalubridade",null,{"$f":"HLOOKUP($B$5,'Dados Gerais'!$D$5:$BK$37,31)","v":0}]
[null,null,"D","Adicional Noturno",null,{"$f":"HLOOKUP($B$5,'Dados Gerais'!$D$5:$BK$50,46)","v":0},null,"* Nota 1 - O Módulo 1 refere-se ao valor mensal devido ao empregado pela prestação do serviço no período de 12 meses."]
[null,null,"E","Adicional de Hora Extra",null,{"$f":"HLOOKUP($B$5,'Dados Gerais'!$D$5:$BK$67,63)","v":0},null,"* Nota 2 - O adicional de hora extra no feriado trabalhado foi suprimido pela Lei 13.467/17"]
[null,null,"F","Outros (especificar)",null,{"$f":"HLOOKUP($B$5,'Dados Gerais'!$D$5:$BK$59,33)","v":0},null,"* Nota 3 - ART. 7º, § 2º, DA LEI Nº 605/49.Sendo mensalista o obreiro, o adicional noturno pago de forma fixa já é considerado integrado para os efeitos do pagamento do repouso semanal remunerado, nos termos do art. 7º, § 2º, da Lei nº 605/49."]
[]
[null,null,null,"TOTAL DA REMUNERAÇÃO",null,{"$f":"SUM(F9:F14)","v":7744.91}]
[]
[null,"MÓDULO 2 - ENCARGOS E BENEFÍCIOS ANUAIS, MENSAIS E DIÁRIOS",null,null,"Percentuais","Valor"]
[null,"Submódulo 2.1 - 13º Salário, Férias e Adicional de Férias"]
[null,null,"A","13º Salário - Calculado no Módulo 7 - Destacado",0,{"$f":"ROUND(E20*F$16,2)","v":0}]
[null,null,"B","Férias e Adicional de Férias",{"$f":"'Encargos Sociais'!E31","v":3.0300000000000001E-2},{"$f":"ROUND(E21*F$16,2)","v":234.67},null,"* Nota 1 - Provisiona-se, mensalmente, o proporcional a 1/12 dos valores referentes a gratificação natalina, férias e adicional de férias."]
[null,null,null,null,null,null,null,"* Nota 2 - O adicional de férias contido no Submódulo 2.1 corresponde a 1/3 da remuneração que, por sua vez, é dividida por 12 contome Nota 1."]
[null,"Submódulo 2.2 - Encargos Previdenciários (GPS), Fundo de Garantia por Tempo de Serviço (FGTS) e Outras Contribuições"]
[null,null,"A","INSS (art. 22, inciso I, Lei nº 8.212/91)",{"$f":"'Encargos Sociais'!E14","v":0.2},{"$f":"ROUND(E24*($F$16+$F$41+$F$73),2)","v":1767.7}]
[null,null,"B","Salário Educação (art. 3º, inciso I, Decreto nº 87.043/82)",{"$f":"'Encargos Sociais'!E15","v":2.5000000000000001E-2},{"$f":"ROUND(E25*($F$16+$F$41+$F$73),2)","v":220.96}]
[null,null,"C","SAT/RAT (art. 22, II, Lei 8.212/91 e Anexo V, Decreto 6.042/07) - Enquadramento 8211-3/00",{"$f":"'Encargos Sociais'!E16","v":0.03},265.14999999999998]
[null,null,"D","SESC ou SESI (art. 30, Lei nº 8.036/90 e art. 1º, Lei 8.154/90)",{"$f":"'Encargos Sociais'!E17","v":1.4999999999999999E-2},132.58000000000001]
[null,null,"E","SENAI ou SENAC (Decreto nº 2.318/86)",{"$f":"'Encargos Sociais'!E18","v":0.01},88.38]
[null,null,"F","SEBRAE (§ 3º, art. 8º, Lei 8.029/90, alterada pela Lei nº 8.154/90)",{"$f":"'Encargos Sociais'!E19","v":6.0000000000000001E-3},53.03]
[null,null,"G","INCRA (art. 1º, I, Decreto Lei 1.146/70 e Lei 7.787, de 30/06/89)",{"$f":"'Encargos Sociais'!E20","v":2E-3},17.68,null,"* Nota 1 - Os percentuais dos encargos previdenciários, do FGTS e demais contribuições são estabelecidos por legislação vigente."]
[null,null,"H","FGTS (Lei Complementar nº 110/01 e art. 30, Lei nº 8.036/90)",{"$f":"'Encargos Sociais'!E21","v":0.08},707.08,null,"* Nota 2 - O SAT, a depender do grau de risco do serviço, irá variar entre 1%, para risco leve, de 2%, para risco médio, e de 3% para risco grave."]
[null,null,"I","SECONCI (Convenções Coletivas de Trabalho da construção)",{"$f":"'Encargos Sociais'!E22","v":0},0,null,"* Nota 3 - Os percentuais do Submódulo 2.2 incidem sobre o Módulo 1 e o Submódulo 2.1."]
[]
[null,"Submódulo 2.3 - Benefícios Mensais e Diários"]
[null,null,"A","Auxílio Transporte",null,{"$f":"HLOOKUP($B$5,'Dados Gerais'!$D$5:$BK$93,82)","v":0}]
[null,null,"B","Auxílio Alimentação",null,{"$f":"HLOOKUP($B$5,'Dados Gerais'!$D$5:$BK$93,89)","v":1012.8}]
[null,null,"C","Assistência Médica e Familiar",null,{"$f":"HLOOKUP($B$5,'Dados Gerais'!$D$5:$BK$101,97)","v":0}]
[null,null,"D","Outros (Seguro de vida e auxílio funeral e auxílio odontológico)",null,{"$f":"HLOOKUP($B$5,'Dados Gerais'!$D$5:$BK$118,114)","v":0},null,"* Nota 1 - O valor informado deverá ser o custo real do benefício (descontado o valor eventualmente pago pelo empregado)."]
[null,null,null,null,null,null,null,"* Nota 2 - Observar a previsão dos benefícios contidos em Acordos, Convenções e Dissídios Coletivos de Trabalho e o disposto no art. 6º da IN 5/2017"]
[null,null,null,"QUADRO-RESUMO DO MÓDULO 2"]
[null,null,null,"2.1 - 13º Salário, Férias e Adicional de Férias - 13º Destacado - Calculado no Módulo 7 ",{"$f":"SUM(E20:E21)","v":3.0300000000000001E-2},{"$f":"F20+F21","v":234.67}]
[null,null,null,"2.2 - Encargos Previdenciários (GPS), Fundo de Garantia por Tempo de Serviço (FGTS) e Contribuições",{"$f":"SUM(E24:E32)","v":0.36800000000000005},{"$f":"SUM(F24:F32)","v":3252.56}]
[null,null,null,"2.3 - Benefícios Mensais e Diários",null,{"$f":"SUM(F35:F38)","v":1012.8}]
[]
[null,null,null,"TOTAL DOS ENCARGOS E BENEFÍCIOS",null,{"$f":"SUM(F41:F43)","v":4500.03}]
[]
[null,"MÓDULO 3 - PREVISÃO PARA RESCISÃO",null,null,"Percentuais","Valor"]
[null,null,"A","Aviso Prévio Indenizado (Art. 7º, inciso XXI, da CF/1988 e arts. 477, 487, §1º, e 491 da CLT)",{"$f":"'Encargos Sociais'!E36","v":8.3000000000000001E-3},{"$f":"ROUND(E48*$F$16,2)","v":64.28}]
[null,null,"B","Incidência do FGTS sobre o Aviso Prévio Indenizado (Súmula 305 TST)",{"$f":"'Encargos Sociais'!E37","v":6.9999999999999999E-4},5.42,null,"* Nota 1 - Adotou-se os parâmetros do estudo do STF (http://www.stf.jus.br/arquivo/cms/sobrestfestudosci/anexo/encargos_sociais_03102007.pdf), onde 5% do pessoal é demitido pelo empregador no decurso do contrato (para estes, considerou-se o aviso prévio indenizado). Desprezou-se as demissões por justa causa e os pedidos de demissão."]
[null,null,"C","Multa do FGTS e Contribuição Social sobre o Aviso Prévio Indenizado (Art. 18, §1º, da Lei 8.036/1990 e art. 1º da LC nº 110/2001)",{"$f":"'Encargos Sociais'!E38","v":3.8E-3},29.43,null,"* Nota 2 - No cálculo do percentual, considerou-se 36 dias, correspondendo à metade da duração média dos contratos (2 anos)"]
[null,null,"D","Aviso Prévio Trabalhado (Art. 488, parágrafo único, CLT)",{"$f":"'Encargos Sociais'!E39","v":1.2E-2},92.94,null,"* Nota 3 - Incide sobre a Remuneração + 13º salário (1/12) + Férias (1/12) + Adicional de Férias (1/36) x 50% multa (40% para o empregado e 10% de contribuição social) x 8% FGTS"]
[null,null,"E","Incidência de GPS, FGTS e outras contribuições sobre o Aviso Prévio Trabalhado",{"$f":"'Encargos Sociais'!E40","v":4.4000000000000003E-3},34.08,null,"* Nota 4 - Os 95% restantes do cálculo, a um prazo médio de contrato de 4 anos. Assim, calcula-se 7 dias para o 1º ano de contrato e mais 3 dias para os 3 anos seguintes."]
[null,null,"F","Multa do FGTS e Contribuição Social sobre o Aviso Prévio Trabalhado",{"$f":"'Encargos Sociais'!E41","v":3.44E-2},266.42,null,null,null,null,null,{"$f":"SUM(L8:L51)","v":0}]
[]
[null,null,null,"TOTAL DE PREVISÃO PARA RESCISÃO",null,{"$f":"SUM(F48:F53)","v":492.57}]
[]
[null,"MÓDULO 4 - CUSTO DO PROFISSIONAL AUSENTE",null,null,"Percentuais","Valor"]
[null,"Submódulo 4.1 - Ausências Legais"]
[null,null,"A","Férias (Arts. 129 e 130, inc. I, da CLT)",{"$f":"'Encargos Sociais'!E25","v":9.0899999999999995E-2},{"$f":"ROUND(E59*$F$16,2)","v":704.01},null,"* Nota 1 - As alíneas “A” a “F” referem-se somente ao custo que será pago ao repositor pelos dias \ntrabalhados quando da necessidade de substituir a mão de obra alocada na prestação do serviço."]
[null,null,"B","Ausências Legais (Arts. 131 e 473 da CLT)",{"$f":"'Encargos Sociais'!E26","v":7.9000000000000008E-3},61.18,null,"* Nota 2 - Adotou-se a estimativa do SINAPI de 2 dias por ano."]
[null,null,"C","Licença-Paternidade (Art. 7º, XIX, e art. 10, §1º, do ADCT, CF/1988 e Art. 1º, II, da Lei 11.770/2008)",{"$f":"'Encargos Sociais'!E27","v":8.0000000000000004E-4},6.2,null,"* Nota 3 - Utilizada a proporção de 50% para homens, 5 dias de afastamento, e a probabilidade de um trabalhador requerer a Licença Paternidade em 5,22%, conforme SINAPI (citando dados da PNAD 2015)"]
[null,null,"D","Ausência por Acidente de Trabalho (Art. 131, III, da CLT)",{"$f":"'Encargos Sociais'!E28","v":8.9999999999999998E-4},6.97,null,"* Nota 4 - Utilzada a estatística de 1,96% dos contribuintes beneficiados com a emissão do auxílio, conforme Anuário Estatístico da Previdência Social. Afastamento de 15 dias a cargo da empresa."]
[null,null,"E","Afastamento Maternidade (Art. 71 da Lei nº 8.213/1991)",{"$f":"'Encargos Sociais'!E29","v":3.3E-3},25.56,null,"* Nota 5 - Utilizada a proporção de 50% para mulheres, 180 dias de afastamento, e a probabilidade de uma trabalhadora requerer a Licença Maternidade em 4,91%, conforme SINAPI (citando dados do IBGE 2016)"]
[null,null,"F","Auxílio Enfermidade - Doença (Art. 59 da Lei nº 8.213/1991)",{"$f":"'Encargos Sociais'!E30","v":7.1000000000000004E-3},54.99,null,"* Nota 6 - Utilizada a estatística de 3,37% dos contribuintes beneficiados com o auxílio, conforme Anuário Estatístico da Previdência Social de 2015 (acrescidos de 2 dias ao ano, para os quais o trabalhador nem requer o benefício da Previdência - conforme SINAPI)"]
[]
[null,"Submódulo 4.2 - Intrajornada"]
[null,null,"A","Intervalo para repouso ou alimentação",{"$f":"'Encargos Sociais'!E33","v":0},{"$f":"ROUND(E67*$F$16,2)","v":0}]
[]
[null,null,null,"QUADRO-RESUMO DO MÓDULO 4",null,"Valor"]
[null,null,null,"4.1 - Ausências Legais",{"$f":"SUM(E59:E64)","v":0.11089999999999998},{"$f":"ROUND(E70*$F$16,2)","v":858.91}]
[null,null,null,"4.2 - Intrajornada",{"$f":"E67","v":0},{"$f":"ROUND(E71*$F$16,2)","v":0}]
[]
[null,null,null,"TOTAL DE PREVISÃO PARA RESCISÃO E INTERVALO INTRAJORNADA",null,{"$f":"SUM(F70:F71)","v":858.91}]
[]
[null,"MÓDULO 5 - INSUMOS DIVERSOS",null,null,null,"Valor"]
[null,null,"A","Uniformes - aquisição",null,{"$f":"ROUND(HLOOKUP($B$5,Uniformes!L4:EA88,3)/12,2)","v":114.45}]
[null,null,"B","Materiais de consumo relacionados ao posto - aquisição",null,{"$f":"ROUND(HLOOKUP(B5,'Mat Cons'!I11:DX13,3)/12,2)","v":0}]
[null,null,"C","Materiais permanentes relacionados ao posto - remuneração da sua depreciação / manutenção",null,{"$f":"HLOOKUP(B5,'Mat Perm'!Q11:EF13,3)","v":0}]
[null,null,"D","Equipamentos relacionados ao posto - remuneração da sua depreciação / manutenção",null,{"$f":"HLOOKUP(B5,'Equip Rel'!Q11:EF13,3)","v":0}]
[null,null,"E","Equipamentos de Proteção Individual - EPI - aquisição",null,{"$f":"ROUND(HLOOKUP(B5,EPI!J4:DY6,3)/12,2)","v":0.14000000000000001}]
[]
[null,null,null,"TOTAL DE INSUMOS DIVERSOS",null,{"$f":"SUM(F76:F81)","v":114.59},null,"* Nota - Valores mensais por empregado"]
[]
[null,"MÓDULO 6 - CUSTOS INDIRETOS, TRIBUTOS E LUCRO - BDI",null,null,"Percentuais","Valor"]
[null,null,"A","Custos Indiretos",{"$f":"BDI!E6","v":2.7000000000000003E-2}]
[null,null,"A.1","Administração Central",{"$f":"BDI!E7","v":2.1600000000000001E-2}]
[null,null,"A.2","Seguros, Garantias e Riscos",{"$f":"BDI!E8","v":5.4000000000000003E-3}]
[null,null,"B","Lucro",{"$f":"BDI!E10","v":3.3399999999999999E-2}]
[null,null,"C","Tributos",{"$f":"SUM(E90:E91)","v":0.124}]
[null,null,"C.1","Tributos Federais (COFINS, PIS e CPRB)",{"$f":"BDI!E18","v":7.3999999999999996E-2}]
[null,null,"C.2","Tributos Distritais (ISS)",{"$f":"BDI!E23","v":0.05},null,null,"* Nota - Utilizou-se o indicado pelo Sindicato da Arquitetura e da Engenharia (Sinaenco, 2008, p. 22), que adota um percentual redutor de 20% no cálculo dos custos tributários relativos às contribuições PIS e COFINS"]
[null,null,"D","Despesas Financeiras",{"$f":"BDI!E13","v":4.4669210982628549E-3}]
[]
[null,null,null,"TOTAL DE BDI",{"$f":"BDI!E26","v":0.21690000000000001},{"$f":"E94*E102","v":2973.9180689999998}]
[]
[null,null,null,"QUADRO-RESUMO DO CUSTO MENSAL POR EMPREGADO - SEM O 13º","Valor"]
[null,null,null,"Módulo 1 - Composição da Remuneração",{"$f":"F16","v":7744.91}]
[null,null,null,"Módulo 2 - Encargos e Benefícios Anuais, Mensais e Diários",{"$f":"F45","v":4500.03}]
[null,null,null,"Módulo 3 - Provisão para Rescisão",{"$f":"F55","v":492.57}]
[null,null,null,"Módulo 4 - Custo de Reposição do Profissional Ausente",{"$f":"F73","v":858.91}]
[null,null,null,"Módulo 5 - Insumos Diversos",{"$f":"F82","v":114.59}]
[null,null,null,"SUBTOTAL (A+B+C+D+E)",{"$f":"SUM(E97:E101)","v":13711.009999999998}]
[null,null,null,"Módulo 6 - Custos Indiretos, Tributos e Lucro",{"$f":"F94","v":2973.9180689999998}]
[]
[null,null,null,"TOTAL DO POSTO",{"$f":"SUM(E102:E103)","v":16684.928068999998}]
[]
[null,"MÓDULO 7 - DESTAQUE DO MÓDULO 2 - 13º SALÁRIO",null,null,"Percentuais","Valor"]
[null,null,"A","13º Salário",{"$f":"'Encargos Sociais'!E32","v":8.3299999999999999E-2},{"$f":"ROUND(E108*F$16,2)","v":645.15}]
[null,null,"B","Encargos Sociais sobre o 13º Salário - Taxa calculada no SUBMÓDULO 2.2",{"$f":"SUM($E$24:$E$32)","v":0.36800000000000005},{"$f":"ROUND(E109*$F$108,2)","v":237.42},null,"* Nota 1 - Provisiona-se, mensalmente, o proporcional a 1/12 dos valores referentes a gratificação natalina e adicional de férias."]
[null,null,"C","Reincidência de férias sobre o 13º Salário",{"$f":"E59","v":9.0899999999999995E-2},{"$f":"ROUND(E110*$F$108,2)","v":58.64}]
[null,null,"D","BDI sobre o 13º Salário - Taxa calculada no MÓDULO 6",{"$f":"E94","v":0.21690000000000001},{"$f":"ROUND(E111*($F$108+$F$109),2)","v":191.43}]
[]
[null,null,null,"TOTAL DO DESTAQUE DO 13º SALÁRIO",null,{"$f":"SUM(F108:F111)","v":1132.6399999999999}]
[]
[null,null,null,"QUADRO-RESUMO DO CUSTO MENSAL POR EMPREGADO","Valor"]
[null,null,null,"Custo total - sem o 13º Salário",{"$f":"E105","v":16684.928068999998}]
[null,null,null,"Destaque do 13º Salário (valor mensal)",{"$f":"F113","v":1132.6399999999999}]
[]
[null,null,null,"TOTAL DO POSTO",{"$f":"E116+E117","v":17817.568068999997}]

{"sheet":"2","index":5,"n_rows":119,"n_cols":12,"rows_kept":119,"cut":false,"hidden":false,"merged":[[17,1,17,3],[106,1,106,3],[39,3,39,5],[46,1,46,3],[56,1,56,3],[68,3,68,5],[74,1,74,3],[83,1,83,3],[1,1,1,5],[2,1,2,5],[4,1,4,2],[5,1,5,2],[7,1,7,3]]}
[]
[null,"PLANILHA DE ESTIMATIVA DE CUSTOS"]
[null,"Padrão IN 05/2017 e IN 07/2018 - MPDG"]
[]
[null,2,null,{"$f":"HLOOKUP($B$5,'Dados Gerais'!$D$5:$BK$20,6)","v":"ENCARREGADO SETORIAL"},"QUANTIDADE",{"$f":"HLOOKUP($B$5,'Dados Gerais'!$D$5:$BK$20,10)","v":2}]
[null,"CCT",null,{"$f":"HLOOKUP($B$5,'Dados Gerais'!$D$5:$BK$20,15)","v":"SEAC/DF X SINDISERVIÇOS/DF 2024/2024 Nº DF000012/2024"},"DATA-BASE",{"$f":"HLOOKUP($B$5,'Dados Gerais'!$D$5:$BK$20,16)","v":"2024-01-01"}]
[]
[null,"MÓDULO 1 - COMPOSIÇÃO DA REMUNERAÇÃO",null,null,null,"Valor"]
[null,null,"A","Salário-Base",null,{"$f":"HLOOKUP($B$5,'Dados Gerais'!$D$5:$BK$20,8)","v":4428.78}]
[null,null,"B","Adicional de Periculosidade",null,{"$f":"HLOOKUP($B$5,'Dados Gerais'!$D$5:$BK$37,25)","v":0}]
[null,null,"C","Adicional de Insalubridade",null,{"$f":"HLOOKUP($B$5,'Dados Gerais'!$D$5:$BK$37,31)","v":0}]
[null,null,"D","Adicional Noturno",null,{"$f":"HLOOKUP($B$5,'Dados Gerais'!$D$5:$BK$50,46)","v":0},null,"* Nota 1 - O Módulo 1 refere-se ao valor mensal devido ao empregado pela prestação do serviço no período de 12 meses."]
[null,null,"E","Adicional de Hora Extra",null,{"$f":"HLOOKUP($B$5,'Dados Gerais'!$D$5:$BK$67,63)","v":0},null,"* Nota 2 - O adicional de hora extra no feriado trabalhado foi suprimido pela Lei 13.467/17"]
[null,null,"F","Outros (especificar)",null,{"$f":"HLOOKUP($B$5,'Dados Gerais'!$D$5:$BK$59,33)","v":0},null,"* Nota 3 - ART. 7º, § 2º, DA LEI Nº 605/49.Sendo mensalista o obreiro, o adicional noturno pago de forma fixa já é considerado integrado para os efeitos do pagamento do repouso semanal remunerado, nos termos do art. 7º, § 2º, da Lei nº 605/49."]
[]
[null,null,null,"TOTAL DA REMUNERAÇÃO",null,{"$f":"SUM(F9:F14)","v":4428.78}]
[]
[null,"MÓDULO 2 - ENCARGOS E BENEFÍCIOS ANUAIS, MENSAIS E DIÁRIOS",null,null,"Percentuais","Valor"]
[null,"Submódulo 2.1 - 13º Salário, Férias e Adicional de Férias"]
[null,null,"A","13º Salário - Calculado no Módulo 7 - Destacado",0,{"$f":"ROUND(E20*F$16,2)","v":0}]
[null,null,"B","Férias e Adicional de Férias",{"$f":"'Encargos Sociais'!E31","v":3.0300000000000001E-2},{"$f":"ROUND(E21*F$16,2)","v":134.19},null,"* Nota 1 - Provisiona-se, mensalmente, o proporcional a 1/12 dos valores referentes a gratificação natalina, férias e adicional de férias."]
[null,null,null,null,null,null,null,"* Nota 2 - O adicional de férias contido no Submódulo 2.1 corresponde a 1/3 da remuneração que, por sua vez, é dividida por 12 contome Nota 1."]
[null,"Submódulo 2.2 - Encargos Previdenciários (GPS), Fundo de Garantia por Tempo de Serviço (FGTS) e Outras Contribuições"]
[null,null,"A","INSS (art. 22, inciso I, Lei nº 8.212/91)",{"$f":"'Encargos Sociais'!E14","v":0.2},{"$f":"ROUND(E24*($F$16+$F$41+$F$73),2)","v":1010.82}]
[null,null,"B","Salário Educação (art. 3º, inciso I, Decreto nº 87.043/82)",{"$f":"'Encargos Sociais'!E15","v":2.5000000000000001E-2},{"$f":"ROUND(E25*($F$16+$F$41+$F$73),2)","v":126.35}]
[null,null,"C","SAT/RAT (art. 22, II, Lei 8.212/91 e Anexo V, Decreto 6.042/07) - Enquadramento 8211-3/00",{"$f":"'Encargos Sociais'!E16","v":0.03},151.62]
[null,null,"D","SESC ou SESI (art. 30, Lei nº 8.036/90 e art. 1º, Lei 8.154/90)",{"$f":"'Encargos Sociais'!E17","v":1.4999999999999999E-2},75.81]
[null,null,"E","SENAI ou SENAC (Decreto nº 2.318/86)",{"$f":"'Encargos Sociais'!E18","v":0.01},50.54]
[null,null,"F","SEBRAE (§ 3º, art. 8º, Lei 8.029/90, alterada pela Lei nº 8.154/90)",{"$f":"'Encargos Sociais'!E19","v":6.0000000000000001E-3},30.32]
[null,null,"G","INCRA (art. 1º, I, Decreto Lei 1.146/70 e Lei 7.787, de 30/06/89)",{"$f":"'Encargos Sociais'!E20","v":2E-3},10.11,null,"* Nota 1 - Os percentuais dos encargos previdenciários, do FGTS e demais contribuições são estabelecidos por legislação vigente."]
[null,null,"H","FGTS (Lei Complementar nº 110/01 e art. 30, Lei nº 8.036/90)",{"$f":"'Encargos Sociais'!E21","v":0.08},404.33,null,"* Nota 2 - O SAT, a depender do grau de risco do serviço, irá variar entre 1%, para risco leve, de 2%, para risco médio, e de 3% para risco grave."]
[null,null,"I","SECONCI (Convenções Coletivas de Trabalho da construção)",{"$f":"'Encargos Sociais'!E22","v":0},0,null,"* Nota 3 - Os percentuais do Submódulo 2.2 incidem sobre o Módulo 1 e o Submódulo 2.1."]
[]
[null,"Submódulo 2.3 - Benefícios Mensais e Diários"]
[null,null,"A","Auxílio Transporte",null,{"$f":"HLOOKUP($B$5,'Dados Gerais'!$D$5:$BK$93,82)","v":75.96999999999997}]
[null,null,"B","Auxílio Alimentação",null,{"$f":"HLOOKUP($B$5,'Dados Gerais'!$D$5:$BK$93,89)","v":1012.8}]
[null,null,"C","Assistência Médica e Familiar",null,{"$f":"HLOOKUP($B$5,'Dados Gerais'!$D$5:$BK$101,97)","v":0}]
[null,null,"D","Outros (Seguro de vida e auxílio funeral e auxílio odontológico)",null,{"$f":"HLOOKUP($B$5,'Dados Gerais'!$D$5:$BK$118,114)","v":0},null,"* Nota 1 - O valor informado deverá ser o custo real do benefício (descontado o valor eventualmente pago pelo empregado)."]
[null,null,null,null,null,null,null,"* Nota 2 - Observar a previsão dos benefícios contidos em Acordos, Convenções e Dissídios Coletivos de Trabalho e o disposto no art. 6º da IN 5/2017"]
[null,null,null,"QUADRO-RESUMO DO MÓDULO 2"]
[null,null,null,"2.1 - 13º Salário, Férias e Adicional de Férias - 13º Destacado - Calculado no Módulo 7 ",{"$f":"SUM(E20:E21)","v":3.0300000000000001E-2},{"$f":"F20+F21","v":134.19}]
[null,null,null,"2.2 - Encargos Previdenciários (GPS), Fundo de Garantia por Tempo de Serviço (FGTS) e Contribuições",{"$f":"SUM(E24:E32)","v":0.36800000000000005},{"$f":"SUM(F24:F32)","v":1859.8999999999996}]
[null,null,null,"2.3 - Benefícios Mensais e Diários",null,{"$f":"SUM(F35:F38)","v":1088.77}]
[]
[null,null,null,"TOTAL DOS ENCARGOS E BENEFÍCIOS",null,{"$f":"SUM(F41:F43)","v":3082.8599999999997}]
[]
[null,"MÓDULO 3 - PREVISÃO PARA RESCISÃO",null,null,"Percentuais","Valor"]
[null,null,"A","Aviso Prévio Indenizado (Art. 7º, inciso XXI, da CF/1988 e arts. 477, 487, §1º, e 491 da CLT)",{"$f":"'Encargos Sociais'!E36","v":8.3000000000000001E-3},{"$f":"ROUND(E48*$F$16,2)","v":36.76}]
[null,null,"B","Incidência do FGTS sobre o Aviso Prévio Indenizado (Súmula 305 TST)",{"$f":"'Encargos Sociais'!E37","v":6.9999999999999999E-4},3.1,null,"* Nota 1 - Adotou-se os parâmetros do estudo do STF (http://www.stf.jus.br/arquivo/cms/sobrestfestudosci/anexo/encargos_sociais_03102007.pdf), onde 5% do pessoal é demitido pelo empregador no decurso do contrato (para estes, considerou-se o aviso prévio indenizado). Desprezou-se as demissões por justa causa e os pedidos de demissão."]
[null,null,"C","Multa do FGTS e Contribuição Social sobre o Aviso Prévio Indenizado (Art. 18, §1º, da Lei 8.036/1990 e art. 1º da LC nº 110/2001)",{"$f":"'Encargos Sociais'!E38","v":3.8E-3},16.829999999999998,null,"* Nota 2 - No cálculo do percentual, considerou-se 36 dias, correspondendo à metade da duração média dos contratos (2 anos)"]
[null,null,"D","Aviso Prévio Trabalhado (Art. 488, parágrafo único, CLT)",{"$f":"'Encargos Sociais'!E39","v":1.2E-2},53.15,null,"* Nota 3 - Incide sobre a Remuneração + 13º salário (1/12) + Férias (1/12) + Adicional de Férias (1/36) x 50% multa (40% para o empregado e 10% de contribuição social) x 8% FGTS"]
[null,null,"E","Incidência de GPS, FGTS e outras contribuições sobre o Aviso Prévio Trabalhado",{"$f":"'Encargos Sociais'!E40","v":4.4000000000000003E-3},19.489999999999998,null,"* Nota 4 - Os 95% restantes do cálculo, a um prazo médio de contrato de 4 anos. Assim, calcula-se 7 dias para o 1º ano de contrato e mais 3 dias para os 3 anos seguintes."]
[null,null,"F","Multa do FGTS e Contribuição Social sobre o Aviso Prévio Trabalhado",{"$f":"'Encargos Sociais'!E41","v":3.44E-2},152.35,null,null,null,null,null,{"$f":"SUM(L8:L51)","v":0}]
[]
[null,null,null,"TOTAL DE PREVISÃO PARA RESCISÃO",null,{"$f":"SUM(F48:F53)","v":281.68}]
[]
[null,"MÓDULO 4 - CUSTO DO PROFISSIONAL AUSENTE",null,null,"Percentuais","Valor"]
[null,"Submódulo 4.1 - Ausências Legais"]
[null,null,"A","Férias (Arts. 129 e 130, inc. I, da CLT)",{"$f":"'Encargos Sociais'!E25","v":9.0899999999999995E-2},{"$f":"ROUND(E59*$F$16,2)","v":402.58},null,"* Nota 1 - As alíneas “A” a “F” referem-se somente ao custo que será pago ao repositor pelos dias \ntrabalhados quando da necessidade de substituir a mão de obra alocada na prestação do serviço."]
[null,null,"B","Ausências Legais (Arts. 131 e 473 da CLT)",{"$f":"'Encargos Sociais'!E26","v":7.9000000000000008E-3},34.99,null,"* Nota 2 - Adotou-se a estimativa do SINAPI de 2 dias por ano."]
[null,null,"C","Licença-Paternidade (Art. 7º, XIX, e art. 10, §1º, do ADCT, CF/1988 e Art. 1º, II, da Lei 11.770/2008)",{"$f":"'Encargos Sociais'!E27","v":8.0000000000000004E-4},3.54,null,"* Nota 3 - Utilizada a proporção de 50% para homens, 5 dias de afastamento, e a probabilidade de um trabalhador requerer a Licença Paternidade em 5,22%, conforme SINAPI (citando dados da PNAD 2015)"]
[null,null,"D","Ausência por Acidente de Trabalho (Art. 131, III, da CLT)",{"$f":"'Encargos Sociais'!E28","v":8.9999999999999998E-4},3.99,null,"* Nota 4 - Utilzada a estatística de 1,96% dos contribuintes beneficiados com a emissão do auxílio, conforme Anuário Estatístico da Previdência Social. Afastamento de 15 dias a cargo da empresa."]
[null,null,"E","Afastamento Maternidade (Art. 71 da Lei nº 8.213/1991)",{"$f":"'Encargos Sociais'!E29","v":3.3E-3},14.61,null,"* Nota 5 - Utilizada a proporção de 50% para mulheres, 180 dias de afastamento, e a probabilidade de uma trabalhadora requerer a Licença Maternidade em 4,91%, conforme SINAPI (citando dados do IBGE 2016)"]
[null,null,"F","Auxílio Enfermidade - Doença (Art. 59 da Lei nº 8.213/1991)",{"$f":"'Encargos Sociais'!E30","v":7.1000000000000004E-3},31.44,null,"* Nota 6 - Utilizada a estatística de 3,37% dos contribuintes beneficiados com o auxílio, conforme Anuário Estatístico da Previdência Social de 2015 (acrescidos de 2 dias ao ano, para os quais o trabalhador nem requer o benefício da Previdência - conforme SINAPI)"]
[]
[null,"Submódulo 4.2 - Intrajornada"]
[null,null,"A","Intervalo para repouso ou alimentação",{"$f":"'Encargos Sociais'!E33","v":0},{"$f":"ROUND(E67*$F$16,2)","v":0}]
[]
[null,null,null,"QUADRO-RESUMO DO MÓDULO 4",null,"Valor"]
[null,null,null,"4.1 - Ausências Legais",{"$f":"SUM(E59:E64)","v":0.11089999999999998},{"$f":"ROUND(E70*$F$16,2)","v":491.15}]
[null,null,null,"4.2 - Intrajornada",{"$f":"E67","v":0},{"$f":"ROUND(E71*$F$16,2)","v":0}]
[]
[null,null,null,"TOTAL DE PREVISÃO PARA RESCISÃO E INTERVALO INTRAJORNADA",null,{"$f":"SUM(F70:F71)","v":491.15}]
[]
[null,"MÓDULO 5 - INSUMOS DIVERSOS",null,null,null,"Valor"]
[null,null,"A","Uniformes - aquisição",null,{"$f":"ROUND(HLOOKUP($B$5,Uniformes!L4:EA88,3)/12,2)","v":114.45}]
[null,null,"B","Materiais de consumo relacionados ao posto - aquisição",null,{"$f":"ROUND(HLOOKUP(B5,'Mat Cons'!I11:DX13,3)/12,2)","v":0}]
[null,null,"C","Materiais permanentes relacionados ao posto - remuneração da sua depreciação / manutenção",null,{"$f":"HLOOKUP(B5,'Mat Perm'!Q11:EF13,3)","v":0}]
[null,null,"D","Equipamentos relacionados ao posto - remuneração da sua depreciação / manutenção",null,{"$f":"HLOOKUP(B5,'Equip Rel'!Q11:EF13,3)","v":0}]
[null,null,"E","Equipamentos de Proteção Individual - EPI - aquisição",null,{"$f":"ROUND(HLOOKUP(B5,EPI!J4:DY6,3)/12,2)","v":0.34}]
[]
[null,null,null,"TOTAL DE INSUMOS DIVERSOS",null,{"$f":"SUM(F76:F81)","v":114.79},null,"* Nota - Valores mensais por empregado"]
[]
[null,"MÓDULO 6 - CUSTOS INDIRETOS, TRIBUTOS E LUCRO - BDI",null,null,"Percentuais","Valor"]
[null,null,"A","Custos Indiretos",{"$f":"BDI!E6","v":2.7000000000000003E-2}]
[null,null,"A.1","Administração Central",{"$f":"BDI!E7","v":2.1600000000000001E-2}]
[null,null,"A.2","Seguros, Garantias e Riscos",{"$f":"BDI!E8","v":5.4000000000000003E-3}]
[null,null,"B","Lucro",{"$f":"BDI!E10","v":3.3399999999999999E-2}]
[null,null,"C","Tributos",{"$f":"SUM(E90:E91)","v":0.124}]
[null,null,"C.1","Tributos Federais (COFINS, PIS e CPRB)",{"$f":"BDI!E18","v":7.3999999999999996E-2}]
[null,null,"C.2","Tributos Distritais (ISS)",{"$f":"BDI!E23","v":0.05},null,null,"* Nota - Utilizou-se o indicado pelo Sindicato da Arquitetura e da Engenharia (Sinaenco, 2008, p. 22), que adota um percentual redutor de 20% no cálculo dos custos tributários relativos às contribuições PIS e COFINS"]
[null,null,"D","Despesas Financeiras",{"$f":"BDI!E13","v":4.4669210982628549E-3}]
[]
[null,null,null,"TOTAL DE BDI",{"$f":"BDI!E26","v":0.21690000000000001},{"$f":"E94*E102","v":1821.7994940000001}]
[]
[null,null,null,"QUADRO-RESUMO DO CUSTO MENSAL POR EMPREGADO - SEM O 13º","Valor"]
[null,null,null,"Módulo 1 - Composição da Remuneração",{"$f":"F16","v":4428.78}]
[null,null,null,"Módulo 2 - Encargos e Benefícios Anuais, Mensais e Diários",{"$f":"F45","v":3082.8599999999997}]
[null,null,null,"Módulo 3 - Provisão para Rescisão",{"$f":"F55","v":281.68}]
[null,null,null,"Módulo 4 - Custo de Reposição do Profissional Ausente",{"$f":"F73","v":491.15}]
[null,null,null,"Módulo 5 - Insumos Diversos",{"$f":"F82","v":114.79}]
[null,null,null,"SUBTOTAL (A+B+C+D+E)",{"$f":"SUM(E97:E101)","v":8399.26}]
[null,null,null,"Módulo 6 - Custos Indiretos, Tributos e Lucro",{"$f":"F94","v":1821.7994940000001}]
[]
[null,null,null,"TOTAL DO POSTO",{"$f":"SUM(E102:E103)","v":10221.059494000001}]
[]
[null,"MÓDULO 7 - DESTAQUE DO MÓDULO 2 - 13º SALÁRIO",null,null,"Percentuais","Valor"]
[null,null,"A","13º Salário",{"$f":"'Encargos Sociais'!E32","v":8.3299999999999999E-2},{"$f":"ROUND(E108*F$16,2)","v":368.92}]
[null,null,"B","Encargos Sociais sobre o 13º Salário - Taxa calculada no SUBMÓDULO 2.2",{"$f":"SUM($E$24:$E$32)","v":0.36800000000000005},{"$f":"ROUND(E109*$F$108,2)","v":135.76},null,"* Nota 1 - Provisiona-se, mensalmente, o proporcional a 1/12 dos valores referentes a gratificação natalina e adicional de férias."]
[null,null,"C","Reincidência de férias sobre o 13º Salário",{"$f":"E59","v":9.0899999999999995E-2},{"$f":"ROUND(E110*$F$108,2)","v":33.53}]
[null,null,"D","BDI sobre o 13º Salário - Taxa calculada no MÓDULO 6",{"$f":"E94","v":0.21690000000000001},{"$f":"ROUND(E111*($F$108+$F$109),2)","v":109.47}]
[]
[null,null,null,"TOTAL DO DESTAQUE DO 13º SALÁRIO",null,{"$f":"SUM(F108:F111)","v":647.68000000000006}]
[]
[null,null,null,"QUADRO-RESUMO DO CUSTO MENSAL POR EMPREGADO","Valor"]
[null,null,null,"Custo total - sem o 13º Salário",{"$f":"E105","v":10221.059494000001}]
[null,null,null,"Destaque do 13º Salário (valor mensal)",{"$f":"F113","v":647.68000000000006}]
[]
[null,null,null,"TOTAL DO POSTO",{"$f":"E116+E117","v":10868.739494000001}]

{"sheet":"3","index":6,"n_rows":118,"n_cols":12,"rows_kept":118,"cut":false,"hidden":false,"merged":[[17,1,17,3],[106,1,106,3],[39,3,39,5],[46,1,46,3],[56,1,56,3],[68,3,68,5],[74,1,74,3],[83,1,83,3],[1,1,1,5],[2,1,2,5],[4,1,4,2],[5,1,5,2],[7,1,7,3]]}
[]
[null,"PLANILHA DE ESTIMATIVA DE CUSTOS"]
[null,"Padrão IN 05/2017 e IN 07/2018 - MPDG"]
[]
[null,3,null,{"$f":"HLOOKUP($B$5,'Dados Gerais'!$D$5:$BK$20,6)","v":"ENCARREGADO DE SERVIÇO"},"QUANTIDADE",{"$f":"HLOOKUP($B$5,'Dados Gerais'!$D$5:$BK$20,10)","v":12}]
[null,"CCT",null,{"$f":"HLOOKUP($B$5,'Dados Gerais'!$D$5:$BK$20,15)","v":"SEAC/DF X SINDISERVIÇOS/DF 2024/2024 Nº DF000012/2024"},"DATA-BASE",{"$f":"HLOOKUP($B$5,'Dados Gerais'!$D$5:$BK$20,16)","v":"2024-01-01"}]
[]
[null,"MÓDULO 1 - COMPOSIÇÃO DA REMUNERAÇÃO",null,null,null,"Valor"]
[null,null,"A","Salário-Base",null,{"$f":"HLOOKUP($B$5,'Dados Gerais'!$D$5:$BK$20,8)","v":3483.45}]
[null,null,"B","Adicional de Periculosidade",null,{"$f":"HLOOKUP($B$5,'Dados Gerais'!$D$5:$BK$37,25)","v":0}]
[null,null,"C","Adicional de Insalubridade",null,{"$f":"HLOOKUP($B$5,'Dados Gerais'!$D$5:$BK$37,31)","v":0}]
[null,null,"D","Adicional Noturno",null,{"$f":"HLOOKUP($B$5,'Dados Gerais'!$D$5:$BK$50,46)","v":0},null,"* Nota 1 - O Módulo 1 refere-se ao valor mensal devido ao empregado pela prestação do serviço no período de 12 meses."]
[null,null,"E","Adicional de Hora Extra",null,{"$f":"HLOOKUP($B$5,'Dados Gerais'!$D$5:$BK$67,63)","v":0},null,"* Nota 2 - O adicional de hora extra no feriado trabalhado foi suprimido pela Lei 13.467/17"]
[null,null,"F","Outros (especificar)",null,{"$f":"HLOOKUP($B$5,'Dados Gerais'!$D$5:$BK$59,33)","v":0},null,"* Nota 3 - ART. 7º, § 2º, DA LEI Nº 605/49.Sendo mensalista o obreiro, o adicional noturno pago de forma fixa já é considerado integrado para os efeitos do pagamento do repouso semanal remunerado, nos termos do art. 7º, § 2º, da Lei nº 605/49."]
[]
[null,null,null,"TOTAL DA REMUNERAÇÃO",null,{"$f":"SUM(F9:F14)","v":3483.45}]
[]
[null,"MÓDULO 2 - ENCARGOS E BENEFÍCIOS ANUAIS, MENSAIS E DIÁRIOS",null,null,"Percentuais","Valor"]
[null,"Submódulo 2.1 - 13º Salário, Férias e Adicional de Férias"]
[null,null,"A","13º Salário - Calculado no Módulo 7 - Destacado",0,{"$f":"ROUND(E20*F$16,2)","v":0}]
[null,null,"B","Férias e Adicional de Férias",{"$f":"'Encargos Sociais'!E31","v":3.0300000000000001E-2},{"$f":"ROUND(E21*F$16,2)","v":105.55},null,"* Nota 1 - Provisiona-se, mensalmente, o proporcional a 1/12 dos valores referentes a gratificação natalina, férias e adicional de férias."]
[null,null,null,null,null,null,null,"* Nota 2 - O adicional de férias contido no Submódulo 2.1 corresponde a 1/3 da remuneração que, por sua vez, é dividida por 12 contome Nota 1."]
[null,"Submódulo 2.2 - Encargos Previdenciários (GPS), Fundo de Garantia por Tempo de Serviço (FGTS) e Outras Contribuições"]
[null,null,"A","INSS (art. 22, inciso I, Lei nº 8.212/91)",{"$f":"'Encargos Sociais'!E14","v":0.2},{"$f":"ROUND(E24*($F$16+$F$41+$F$73),2)","v":795.06}]
[null,null,"B","Salário Educação (art. 3º, inciso I, Decreto nº 87.043/82)",{"$f":"'Encargos Sociais'!E15","v":2.5000000000000001E-2},{"$f":"ROUND(E25*($F$16+$F$41+$F$73),2)","v":99.38}]
[null,null,"C","SAT/RAT (art. 22, II, Lei 8.212/91 e Anexo V, Decreto 6.042/07) - Enquadramento 8211-3/00",{"$f":"'Encargos Sociais'!E16","v":0.03},119.26]
[null,null,"D","SESC ou SESI (art. 30, Lei nº 8.036/90 e art. 1º, Lei 8.154/90)",{"$f":"'Encargos Sociais'!E17","v":1.4999999999999999E-2},59.63]
[null,null,"E","SENAI ou SENAC (Decreto nº 2.318/86)",{"$f":"'Encargos Sociais'!E18","v":0.01},39.75]
[null,null,"F","SEBRAE (§ 3º, art. 8º, Lei 8.029/90, alterada pela Lei nº 8.154/90)",{"$f":"'Encargos Sociais'!E19","v":6.0000000000000001E-3},23.85]
[null,null,"G","INCRA (art. 1º, I, Decreto Lei 1.146/70 e Lei 7.787, de 30/06/89)",{"$f":"'Encargos Sociais'!E20","v":2E-3},7.95,null,"* Nota 1 - Os percentuais dos encargos previdenciários, do FGTS e demais contribuições são estabelecidos por legislação vigente."]
[null,null,"H","FGTS (Lei Complementar nº 110/01 e art. 30, Lei nº 8.036/90)",{"$f":"'Encargos Sociais'!E21","v":0.08},318.02,null,"* Nota 2 - O SAT, a depender do grau de risco do serviço, irá variar entre 1%, para risco leve, de 2%, para risco médio, e de 3% para risco grave."]
[null,null,"I","SECONCI (Convenções Coletivas de Trabalho da construção)",{"$f":"'Encargos Sociais'!E22","v":0},0,null,"* Nota 3 - Os percentuais do Submódulo 2.2 incidem sobre o Módulo 1 e o Submódulo 2.1."]
[]
[null,"Submódulo 2.3 - Benefícios Mensais e Diários"]
[null,null,"A","Auxílio Transporte",null,{"$f":"HLOOKUP($B$5,'Dados Gerais'!$D$5:$BK$93,82)","v":132.69}]
[null,null,"B","Auxílio Alimentação",null,{"$f":"HLOOKUP($B$5,'Dados Gerais'!$D$5:$BK$93,89)","v":1012.8}]
[null,null,"C","Assistência Médica e Familiar",null,{"$f":"HLOOKUP($B$5,'Dados Gerais'!$D$5:$BK$101,97)","v":0}]
[null,null,"D","Outros (Seguro de vida e auxílio funeral e auxílio odontológico)",null,{"$f":"HLOOKUP($B$5,'Dados Gerais'!$D$5:$BK$118,114)","v":0},null,"* Nota 1 - O valor informado deverá ser o custo real do benefício (descontado o valor eventualmente pago pelo empregado)."]
[null,null,null,null,null,null,null,"* Nota 2 - Observar a previsão dos benefícios contidos em Acordos, Convenções e Dissídios Coletivos de Trabalho e o disposto no art. 6º da IN 5/2017"]
[null,null,null,"QUADRO-RESUMO DO MÓDULO 2"]
[null,null,null,"2.1 - 13º Salário, Férias e Adicional de Férias - 13º Destacado - Calculado no Módulo 7 ",{"$f":"SUM(E20:E21)","v":3.0300000000000001E-2},{"$f":"F20+F21","v":105.55}]
[null,null,null,"2.2 - Encargos Previdenciários (GPS), Fundo de Garantia por Tempo de Serviço (FGTS) e Contribuições",{"$f":"SUM(E24:E32)","v":0.36800000000000005},{"$f":"SUM(F24:F32)","v":1462.8999999999999}]
[null,null,null,"2.3 - Benefícios Mensais e Diários",null,{"$f":"SUM(F35:F38)","v":1145.49}]
[]
[null,null,null,"TOTAL DOS ENCARGOS E BENEFÍCIOS",null,{"$f":"SUM(F41:F43)","v":2713.9399999999996}]
[]
[null,"MÓDULO 3 - PREVISÃO PARA RESCISÃO",null,null,"Percentuais","Valor"]
[null,null,"A","Aviso Prévio Indenizado (Art. 7º, inciso XXI, da CF/1988 e arts. 477, 487, §1º, e 491 da CLT)",{"$f":"'Encargos Sociais'!E36","v":8.3000000000000001E-3},{"$f":"ROUND(E48*$F$16,2)","v":28.91}]
[null,null,"B","Incidência do FGTS sobre o Aviso Prévio Indenizado (Súmula 305 TST)",{"$f":"'Encargos Sociais'!E37","v":6.9999999999999999E-4},2.44,null,"* Nota 1 - Adotou-se os parâmetros do estudo do STF (http://www.stf.jus.br/arquivo/cms/sobrestfestudosci/anexo/encargos_sociais_03102007.pdf), onde 5% do pessoal é demitido pelo empregador no decurso do contrato (para estes, considerou-se o aviso prévio indenizado). Desprezou-se as demissões por justa causa e os pedidos de demissão."]
[null,null,"C","Multa do FGTS e Contribuição Social sobre o Aviso Prévio Indenizado (Art. 18, §1º, da Lei 8.036/1990 e art. 1º da LC nº 110/2001)",{"$f":"'Encargos Sociais'!E38","v":3.8E-3},13.24,null,"* Nota 2 - No cálculo do percentual, considerou-se 36 dias, correspondendo à metade da duração média dos contratos (2 anos)"]
[null,null,"D","Aviso Prévio Trabalhado (Art. 488, parágrafo único, CLT)",{"$f":"'Encargos Sociais'!E39","v":1.2E-2},41.8,null,"* Nota 3 - Incide sobre a Remuneração + 13º salário (1/12) + Férias (1/12) + Adicional de Férias (1/36) x 50% multa (40% para o empregado e 10% de contribuição social) x 8% FGTS"]
[null,null,"E","Incidência de GPS, FGTS e outras contribuições sobre o Aviso Prévio Trabalhado",{"$f":"'Encargos Sociais'!E40","v":4.4000000000000003E-3},15.33,null,"* Nota 4 - Os 95% restantes do cálculo, a um prazo médio de contrato de 4 anos. Assim, calcula-se 7 dias para o 1º ano de contrato e mais 3 dias para os 3 anos seguintes."]
[null,null,"F","Multa do FGTS e Contribuição Social sobre o Aviso Prévio Trabalhado",{"$f":"'Encargos Sociais'!E41","v":3.44E-2},119.83,null,null,null,null,null,{"$f":"SUM(L8:L51)","v":0}]
[]
[null,null,null,"TOTAL DE PREVISÃO PARA RESCISÃO",null,{"$f":"SUM(F48:F53)","v":221.55}]
[]
[null,"MÓDULO 4 - CUSTO DO PROFISSIONAL AUSENTE",null,null,"Percentuais","Valor"]
[null,"Submódulo 4.1 - Ausências Legais"]
[null,null,"A","Férias (Arts. 129 e 130, inc. I, da CLT)",{"$f":"'Encargos Sociais'!E25","v":9.0899999999999995E-2},{"$f":"ROUND(E59*$F$16,2)","v":316.64999999999998},null,"* Nota 1 - As alíneas “A” a “F” referem-se somente ao custo que será pago ao repositor pelos dias \ntrabalhados quando da necessidade de substituir a mão de obra alocada na prestação do serviço."]
[null,null,"B","Ausências Legais (Arts. 131 e 473 da CLT)",{"$f":"'Encargos Sociais'!E26","v":7.9000000000000008E-3},27.52,null,"* Nota 2 - Adotou-se a estimativa do SINAPI de 2 dias por ano."]
[null,null,"C","Licença-Paternidade (Art. 7º, XIX, e art. 10, §1º, do ADCT, CF/1988 e Art. 1º, II, da Lei 11.770/2008)",{"$f":"'Encargos Sociais'!E27","v":8.0000000000000004E-4},2.79,null,"* Nota 3 - Utilizada a proporção de 50% para homens, 5 dias de afastamento, e a probabilidade de um trabalhador requerer a Licença Paternidade em 5,22%, conforme SINAPI (citando dados da PNAD 2015)"]
[null,null,"D","Ausência por Acidente de Trabalho (Art. 131, III, da CLT)",{"$f":"'Encargos Sociais'!E28","v":8.9999999999999998E-4},3.14,null,"* Nota 4 - Utilzada a estatística de 1,96% dos contribuintes beneficiados com a emissão do auxílio, conforme Anuário Estatístico da Previdência Social. Afastamento de 15 dias a cargo da empresa."]
[null,null,"E","Afastamento Maternidade (Art. 71 da Lei nº 8.213/1991)",{"$f":"'Encargos Sociais'!E29","v":3.3E-3},11.5,null,"* Nota 5 - Utilizada a proporção de 50% para mulheres, 180 dias de afastamento, e a probabilidade de uma trabalhadora requerer a Licença Maternidade em 4,91%, conforme SINAPI (citando dados do IBGE 2016)"]
[null,null,"F","Auxílio Enfermidade - Doença (Art. 59 da Lei nº 8.213/1991)",{"$f":"'Encargos Sociais'!E30","v":7.1000000000000004E-3},24.73,null,"* Nota 6 - Utilizada a estatística de 3,37% dos contribuintes beneficiados com o auxílio, conforme Anuário Estatístico da Previdência Social de 2015 (acrescidos de 2 dias ao ano, para os quais o trabalhador nem requer o benefício da Previdência - conforme SINAPI)"]
[]
[null,"Submódulo 4.2 - Intrajornada"]
[null,null,"A","Intervalo para repouso ou alimentação",{"$f":"'Encargos Sociais'!E33","v":0},{"$f":"ROUND(E67*$F$16,2)","v":0}]
[]
[null,null,null,"QUADRO-RESUMO DO MÓDULO 4",null,"Valor"]
[null,null,null,"4.1 - Ausências Legais",{"$f":"SUM(E59:E64)","v":0.11089999999999998},{"$f":"ROUND(E70*$F$16,2)","v":386.31}]
[null,null,null,"4.2 - Intrajornada",{"$f":"E67","v":0},{"$f":"ROUND(E71*$F$16,2)","v":0}]
[]
[null,null,null,"TOTAL DE PREVISÃO PARA RESCISÃO E INTERVALO INTRAJORNADA",null,{"$f":"SUM(F70:F71)","v":386.31}]
[]
[null,"MÓDULO 5 - INSUMOS DIVERSOS",null,null,null,"Valor"]
[null,null,"A","Uniformes - aquisição",null,{"$f":"ROUND(HLOOKUP($B$5,Uniformes!L4:EA6,3)/12,2)","v":112.85}]
[null,null,"B","Materiais de consumo relacionados ao posto - aquisição",null,{"$f":"ROUND(HLOOKUP(B5,'Mat Cons'!I11:DX13,3)/12,2)","v":0}]
[null,null,"C","Materiais permanentes relacionados ao posto - remuneração da sua depreciação / manutenção",null,{"$f":"HLOOKUP(B5,'Mat Perm'!Q11:EF13,3)","v":0}]
[null,null,"D","Equipamentos relacionados ao posto - remuneração da sua depreciação / manutenção",null,{"$f":"HLOOKUP(B5,'Equip Rel'!Q11:EF13,3)","v":0}]
[null,null,"E","Equipamentos de Proteção Individual - EPI - aquisição",null,{"$f":"ROUND(HLOOKUP(B5,EPI!J4:DY6,3)/12,2)","v":0.34}]
[]
[null,null,null,"TOTAL DE INSUMOS DIVERSOS",null,{"$f":"SUM(F76:F81)","v":113.19},null,"* Nota - Valores mensais por empregado"]
[]
[null,"MÓDULO 6 - CUSTOS INDIRETOS, TRIBUTOS E LUCRO - BDI",null,null,"Percentuais","Valor"]
[null,null,"A","Custos Indiretos",{"$f":"BDI!E6","v":2.7000000000000003E-2}]
[null,null,"A.1","Administração Central",{"$f":"BDI!E7","v":2.1600000000000001E-2}]
[null,null,"A.2","Seguros, Garantias e Riscos",{"$f":"BDI!E8","v":5.4000000000000003E-3}]
[null,null,"B","Lucro",{"$f":"BDI!E10","v":3.3399999999999999E-2}]
[null,null,"C","Tributos",{"$f":"SUM(E90:E91)","v":0.124}]
[null,null,"C.1","Tributos Federais (COFINS, PIS e CPRB)",{"$f":"BDI!E18","v":7.3999999999999996E-2}]
[null,null,"C.2","Tributos Distritais (ISS)",{"$f":"BDI!E23","v":0.05},null,null,"* Nota - Utilizou-se o indicado pelo Sindicato da Arquitetura e da Engenharia (Sinaenco, 2008, p. 22), que adota um percentual redutor de 20% no cálculo dos custos tributários relativos às contribuições PIS e COFINS"]
[null,null,"D","Despesas Financeiras",{"$f":"BDI!E13","v":4.4669210982628549E-3}]
[]
[null,null,null,"TOTAL DE BDI",{"$f":"BDI!E26","v":0.21690000000000001},{"$f":"E94*E102","v":1500.6096359999999}]
[]
[null,null,null,"QUADRO-RESUMO DO CUSTO MENSAL POR EMPREGADO - SEM O 13º","Valor"]
[null,null,null,"Módulo 1 - Composição da Remuneração",{"$f":"F16","v":3483.45}]
[null,null,null,"Módulo 2 - Encargos e Benefícios Anuais, Mensais e Diários",{"$f":"F45","v":2713.9399999999996}]
[null,null,null,"Módulo 3 - Provisão para Rescisão",{"$f":"F55","v":221.55}]
[null,null,null,"Módulo 4 - Custo de Reposição do Profissional Ausente",{"$f":"F73","v":386.31}]
[null,null,null,"Módulo 5 - Insumos Diversos",{"$f":"F82","v":113.19}]
[null,null,null,"SUBTOTAL (A+B+C+D+E)",{"$f":"SUM(E97:E101)","v":6918.44}]
[null,null,null,"Módulo 6 - Custos Indiretos, Tributos e Lucro",{"$f":"F94","v":1500.6096359999999}]
[]
[null,null,null,"TOTAL DO POSTO",{"$f":"SUM(E102:E103)","v":8419.0496359999997}]
[]
[null,"MÓDULO 7 - DESTAQUE DO MÓDULO 2 - 13º SALÁRIO",null,null,"Percentuais","Valor"]
[null,null,"A","13º Salário",{"$f":"'Encargos Sociais'!E32","v":8.3299999999999999E-2},{"$f":"ROUND(E108*F$16,2)","v":290.17}]
[null,null,"B","Encargos Sociais sobre o 13º Salário - Taxa calculada no SUBMÓDULO 2.2",{"$f":"SUM($E$24:$E$32)","v":0.36800000000000005},{"$f":"ROUND(E109*$F$108,2)","v":106.78},null,"* Nota 1 - Provisiona-se, mensalmente, o proporcional a 1/12 dos valores referentes a gratificação natalina e adicional de férias."]
[null,null,"C","BDI sobre o 13º Salário - Taxa calculada no MÓDULO 6",{"$f":"E94","v":0.21690000000000001},{"$f":"ROUND(E110*($F$108+$F$109),2)","v":86.1}]
[]
[null,null,null,"TOTAL DO DESTAQUE DO 13º SALÁRIO",null,{"$f":"SUM(F108:F110)","v":483.05000000000007}]
[]
[null,null,null,"QUADRO-RESUMO DO CUSTO MENSAL POR EMPREGADO","Valor"]
[null,null,null,"Custo total - sem o 13º Salário",{"$f":"E105","v":8419.0496359999997}]
[null,null,null,"Destaque do 13º Salário (valor mensal)",{"$f":"F112","v":483.05000000000007}]
[]
[null,null,null,"TOTAL DO POSTO",{"$f":"E115+E116","v":8902.099635999999}]

{"sheet":"4","index":7,"n_rows":118,"n_cols":12,"rows_kept":118,"cut":false,"hidden":false,"merged":[[17,1,17,3],[106,1,106,3],[39,3,39,5],[46,1,46,3],[56,1,56,3],[68,3,68,5],[74,1,74,3],[83,1,83,3],[1,1,1,5],[2,1,2,5],[4,1,4,2],[5,1,5,2],[7,1,7,3]]}
[]
[null,"PLANILHA DE ESTIMATIVA DE CUSTOS"]
[null,"Padrão IN 05/2017 e IN 07/2018 - MPDG"]
[]
[null,4,null,{"$f":"HLOOKUP($B$5,'Dados Gerais'!$D$5:$BK$20,6)","v":"AUXILIAR DE ENCARREGADO"},"QUANTIDADE",{"$f":"HLOOKUP($B$5,'Dados Gerais'!$D$5:$BK$20,10)","v":1}]
[null,"CCT",null,{"$f":"HLOOKUP($B$5,'Dados Gerais'!$D$5:$BK$20,15)","v":"SEAC/DF X SINDISERVIÇOS/DF 2024/2024 Nº DF000012/2024"},"DATA-BASE",{"$f":"HLOOKUP($B$5,'Dados Gerais'!$D$5:$BK$20,16)","v":"2024-01-01"}]
[]
[null,"MÓDULO 1 - COMPOSIÇÃO DA REMUNERAÇÃO",null,null,null,"Valor"]
[null,null,"A","Salário-Base",null,{"$f":"HLOOKUP($B$5,'Dados Gerais'!$D$5:$BK$20,8)","v":2598.63}]
[null,null,"B","Adicional de Periculosidade",null,{"$f":"HLOOKUP($B$5,'Dados Gerais'!$D$5:$BK$37,25)","v":0}]
[null,null,"C","Adicional de Insalubridade",null,{"$f":"HLOOKUP($B$5,'Dados Gerais'!$D$5:$BK$37,31)","v":0}]
[null,null,"D","Adicional Noturno",null,{"$f":"HLOOKUP($B$5,'Dados Gerais'!$D$5:$BK$50,46)","v":0},null,"* Nota 1 - O Módulo 1 refere-se ao valor mensal devido ao empregado pela prestação do serviço no período de 12 meses."]
[null,null,"E","Adicional de Hora Extra",null,{"$f":"HLOOKUP($B$5,'Dados Gerais'!$D$5:$BK$67,63)","v":0},null,"* Nota 2 - O adicional de hora extra no feriado trabalhado foi suprimido pela Lei 13.467/17"]
[null,null,"F","Outros (especificar)",null,{"$f":"HLOOKUP($B$5,'Dados Gerais'!$D$5:$BK$59,33)","v":0},null,"* Nota 3 - ART. 7º, § 2º, DA LEI Nº 605/49.Sendo mensalista o obreiro, o adicional noturno pago de forma fixa já é considerado integrado para os efeitos do pagamento do repouso semanal remunerado, nos termos do art. 7º, § 2º, da Lei nº 605/49."]
[]
[null,null,null,"TOTAL DA REMUNERAÇÃO",null,{"$f":"SUM(F9:F14)","v":2598.63}]
[]
[null,"MÓDULO 2 - ENCARGOS E BENEFÍCIOS ANUAIS, MENSAIS E DIÁRIOS",null,null,"Percentuais","Valor"]
[null,"Submódulo 2.1 - 13º Salário, Férias e Adicional de Férias"]
[null,null,"A","13º Salário - Calculado no Módulo 7 - Destacado",0,{"$f":"ROUND(E20*F$16,2)","v":0}]
[null,null,"B","Férias e Adicional de Férias",{"$f":"'Encargos Sociais'!E31","v":3.0300000000000001E-2},{"$f":"ROUND(E21*F$16,2)","v":78.739999999999995},null,"* Nota 1 - Provisiona-se, mensalmente, o proporcional a 1/12 dos valores referentes a gratificação natalina, férias e adicional de férias."]
[null,null,null,null,null,null,null,"* Nota 2 - O adicional de férias contido no Submódulo 2.1 corresponde a 1/3 da remuneração que, por sua vez, é dividida por 12 contome Nota 1."]
[null,"Submódulo 2.2 - Encargos Previdenciários (GPS), Fundo de Garantia por Tempo de Serviço (FGTS) e Outras Contribuições"]
[null,null,"A","INSS (art. 22, inciso I, Lei nº 8.212/91)",{"$f":"'Encargos Sociais'!E14","v":0.2},{"$f":"ROUND(E24*($F$16+$F$41+$F$73),2)","v":593.11}]
[null,null,"B","Salário Educação (art. 3º, inciso I, Decreto nº 87.043/82)",{"$f":"'Encargos Sociais'!E15","v":2.5000000000000001E-2},{"$f":"ROUND(E25*($F$16+$F$41+$F$73),2)","v":74.14}]
[null,null,"C","SAT/RAT (art. 22, II, Lei 8.212/91 e Anexo V, Decreto 6.042/07) - Enquadramento 8211-3/00",{"$f":"'Encargos Sociais'!E16","v":0.03},88.97]
[null,null,"D","SESC ou SESI (art. 30, Lei nº 8.036/90 e art. 1º, Lei 8.154/90)",{"$f":"'Encargos Sociais'!E17","v":1.4999999999999999E-2},44.48]
[null,null,"E","SENAI ou SENAC (Decreto nº 2.318/86)",{"$f":"'Encargos Sociais'!E18","v":0.01},29.66]
[null,null,"F","SEBRAE (§ 3º, art. 8º, Lei 8.029/90, alterada pela Lei nº 8.154/90)",{"$f":"'Encargos Sociais'!E19","v":6.0000000000000001E-3},17.79]
[null,null,"G","INCRA (art. 1º, I, Decreto Lei 1.146/70 e Lei 7.787, de 30/06/89)",{"$f":"'Encargos Sociais'!E20","v":2E-3},5.93,null,"* Nota 1 - Os percentuais dos encargos previdenciários, do FGTS e demais contribuições são estabelecidos por legislação vigente."]
[null,null,"H","FGTS (Lei Complementar nº 110/01 e art. 30, Lei nº 8.036/90)",{"$f":"'Encargos Sociais'!E21","v":0.08},237.24,null,"* Nota 2 - O SAT, a depender do grau de risco do serviço, irá variar entre 1%, para risco leve, de 2%, para risco médio, e de 3% para risco grave."]
[null,null,"I","SECONCI (Convenções Coletivas de Trabalho da construção)",{"$f":"'Encargos Sociais'!E22","v":0},0,null,"* Nota 3 - Os percentuais do Submódulo 2.2 incidem sobre o Módulo 1 e o Submódulo 2.1."]
[]
[null,"Submódulo 2.3 - Benefícios Mensais e Diários"]
[null,null,"A","Auxílio Transporte",null,{"$f":"HLOOKUP($B$5,'Dados Gerais'!$D$5:$BK$93,82)","v":185.78}]
[null,null,"B","Auxílio Alimentação",null,{"$f":"HLOOKUP($B$5,'Dados Gerais'!$D$5:$BK$93,89)","v":1012.8}]
[null,null,"C","Assistência Médica e Familiar",null,{"$f":"HLOOKUP($B$5,'Dados Gerais'!$D$5:$BK$101,97)","v":0}]
[null,null,"D","Outros (Seguro de vida e auxílio funeral e auxílio odontológico)",null,{"$f":"HLOOKUP($B$5,'Dados Gerais'!$D$5:$BK$118,114)","v":0},null,"* Nota 1 - O valor informado deverá ser o custo real do benefício (descontado o valor eventualmente pago pelo empregado)."]
[null,null,null,null,null,null,null,"* Nota 2 - Observar a previsão dos benefícios contidos em Acordos, Convenções e Dissídios Coletivos de Trabalho e o disposto no art. 6º da IN 5/2017"]
[null,null,null,"QUADRO-RESUMO DO MÓDULO 2"]
[null,null,null,"2.1 - 13º Salário, Férias e Adicional de Férias - 13º Destacado - Calculado no Módulo 7 ",{"$f":"SUM(E20:E21)","v":3.0300000000000001E-2},{"$f":"F20+F21","v":78.739999999999995}]
[null,null,null,"2.2 - Encargos Previdenciários (GPS), Fundo de Garantia por Tempo de Serviço (FGTS) e Contribuições",{"$f":"SUM(E24:E32)","v":0.36800000000000005},{"$f":"SUM(F24:F32)","v":1091.32}]
[null,null,null,"2.3 - Benefícios Mensais e Diários",null,{"$f":"SUM(F35:F38)","v":1198.58}]
[]
[null,null,null,"TOTAL DOS ENCARGOS E BENEFÍCIOS",null,{"$f":"SUM(F41:F43)","v":2368.64}]
[]
[null,"MÓDULO 3 - PREVISÃO PARA RESCISÃO",null,null,"Percentuais","Valor"]
[null,null,"A","Aviso Prévio Indenizado (Art. 7º, inciso XXI, da CF/1988 e arts. 477, 487, §1º, e 491 da CLT)",{"$f":"'Encargos Sociais'!E36","v":8.3000000000000001E-3},{"$f":"ROUND(E48*$F$16,2)","v":21.57}]
[null,null,"B","Incidência do FGTS sobre o Aviso Prévio Indenizado (Súmula 305 TST)",{"$f":"'Encargos Sociais'!E37","v":6.9999999999999999E-4},1.82,null,"* Nota 1 - Adotou-se os parâmetros do estudo do STF (http://www.stf.jus.br/arquivo/cms/sobrestfestudosci/anexo/encargos_sociais_03102007.pdf), onde 5% do pessoal é demitido pelo empregador no decurso do contrato (para estes, considerou-se o aviso prévio indenizado). Desprezou-se as demissões por justa causa e os pedidos de demissão."]
[null,null,"C","Multa do FGTS e Contribuição Social sobre o Aviso Prévio Indenizado (Art. 18, §1º, da Lei 8.036/1990 e art. 1º da LC nº 110/2001)",{"$f":"'Encargos Sociais'!E38","v":3.8E-3},9.8699999999999992,null,"* Nota 2 - No cálculo do percentual, considerou-se 36 dias, correspondendo à metade da duração média dos contratos (2 anos)"]
[null,null,"D","Aviso Prévio Trabalhado (Art. 488, parágrafo único, CLT)",{"$f":"'Encargos Sociais'!E39","v":1.2E-2},31.18,null,"* Nota 3 - Incide sobre a Remuneração + 13º salário (1/12) + Férias (1/12) + Adicional de Férias (1/36) x 50% multa (40% para o empregado e 10% de contribuição social) x 8% FGTS"]
[null,null,"E","Incidência de GPS, FGTS e outras contribuições sobre o Aviso Prévio Trabalhado",{"$f":"'Encargos Sociais'!E40","v":4.4000000000000003E-3},11.43,null,"* Nota 4 - Os 95% restantes do cálculo, a um prazo médio de contrato de 4 anos. Assim, calcula-se 7 dias para o 1º ano de contrato e mais 3 dias para os 3 anos seguintes."]
[null,null,"F","Multa do FGTS e Contribuição Social sobre o Aviso Prévio Trabalhado",{"$f":"'Encargos Sociais'!E41","v":3.44E-2},89.39,null,null,null,null,null,{"$f":"SUM(L8:L51)","v":0}]
[]
[null,null,null,"TOTAL DE PREVISÃO PARA RESCISÃO",null,{"$f":"SUM(F48:F53)","v":165.26}]
[]
[null,"MÓDULO 4 - CUSTO DO PROFISSIONAL AUSENTE",null,null,"Percentuais","Valor"]
[null,"Submódulo 4.1 - Ausências Legais"]
[null,null,"A","Férias (Arts. 129 e 130, inc. I, da CLT)",{"$f":"'Encargos Sociais'!E25","v":9.0899999999999995E-2},{"$f":"ROUND(E59*$F$16,2)","v":236.22},null,"* Nota 1 - As alíneas “A” a “F” referem-se somente ao custo que será pago ao repositor pelos dias \ntrabalhados quando da necessidade de substituir a mão de obra alocada na prestação do serviço."]
[null,null,"B","Ausências Legais (Arts. 131 e 473 da CLT)",{"$f":"'Encargos Sociais'!E26","v":7.9000000000000008E-3},20.53,null,"* Nota 2 - Adotou-se a estimativa do SINAPI de 2 dias por ano."]
[null,null,"C","Licença-Paternidade (Art. 7º, XIX, e art. 10, §1º, do ADCT, CF/1988 e Art. 1º, II, da Lei 11.770/2008)",{"$f":"'Encargos Sociais'!E27","v":8.0000000000000004E-4},2.08,null,"* Nota 3 - Utilizada a proporção de 50% para homens, 5 dias de afastamento, e a probabilidade de um trabalhador requerer a Licença Paternidade em 5,22%, conforme SINAPI (citando dados da PNAD 2015)"]
[null,null,"D","Ausência por Acidente de Trabalho (Art. 131, III, da CLT)",{"$f":"'Encargos Sociais'!E28","v":8.9999999999999998E-4},2.34,null,"* Nota 4 - Utilzada a estatística de 1,96% dos contribuintes beneficiados com a emissão do auxílio, conforme Anuário Estatístico da Previdência Social. Afastamento de 15 dias a cargo da empresa."]
[null,null,"E","Afastamento Maternidade (Art. 71 da Lei nº 8.213/1991)",{"$f":"'Encargos Sociais'!E29","v":3.3E-3},8.58,null,"* Nota 5 - Utilizada a proporção de 50% para mulheres, 180 dias de afastamento, e a probabilidade de uma trabalhadora requerer a Licença Maternidade em 4,91%, conforme SINAPI (citando dados do IBGE 2016)"]
[null,null,"F","Auxílio Enfermidade - Doença (Art. 59 da Lei nº 8.213/1991)",{"$f":"'Encargos Sociais'!E30","v":7.1000000000000004E-3},18.45,null,"* Nota 6 - Utilizada a estatística de 3,37% dos contribuintes beneficiados com o auxílio, conforme Anuário Estatístico da Previdência Social de 2015 (acrescidos de 2 dias ao ano, para os quais o trabalhador nem requer o benefício da Previdência - conforme SINAPI)"]
[]
[null,"Submódulo 4.2 - Intrajornada"]
[null,null,"A","Intervalo para repouso ou alimentação",{"$f":"'Encargos Sociais'!E33","v":0},{"$f":"ROUND(E67*$F$16,2)","v":0}]
[]
[null,null,null,"QUADRO-RESUMO DO MÓDULO 4",null,"Valor"]
[null,null,null,"4.1 - Ausências Legais",{"$f":"SUM(E59:E64)","v":0.11089999999999998},{"$f":"ROUND(E70*$F$16,2)","v":288.19}]
[null,null,null,"4.2 - Intrajornada",{"$f":"E67","v":0},{"$f":"ROUND(E71*$F$16,2)","v":0}]
[]
[null,null,null,"TOTAL DE PREVISÃO PARA RESCISÃO E INTERVALO INTRAJORNADA",null,{"$f":"SUM(F70:F71)","v":288.19}]
[]
[null,"MÓDULO 5 - INSUMOS DIVERSOS",null,null,null,"Valor"]
[null,null,"A","Uniformes - aquisição",null,{"$f":"ROUND(HLOOKUP($B$5,Uniformes!L4:EA6,3)/12,2)","v":112.85}]
[null,null,"B","Materiais de consumo relacionados ao posto - aquisição",null,{"$f":"ROUND(HLOOKUP(B5,'Mat Cons'!I11:DX13,3)/12,2)","v":0}]
[null,null,"C","Materiais permanentes relacionados ao posto - remuneração da sua depreciação / manutenção",null,{"$f":"HLOOKUP(B5,'Mat Perm'!Q11:EF13,3)","v":0}]
[null,null,"D","Equipamentos relacionados ao posto - remuneração da sua depreciação / manutenção",null,{"$f":"HLOOKUP(B5,'Equip Rel'!Q11:EF13,3)","v":0}]
[null,null,"E","Equipamentos de Proteção Individual - EPI - aquisição",null,{"$f":"ROUND(HLOOKUP(B5,EPI!J4:DY6,3)/12,2)","v":0.34}]
[]
[null,null,null,"TOTAL DE INSUMOS DIVERSOS",null,{"$f":"SUM(F76:F81)","v":113.19},null,"* Nota - Valores mensais por empregado"]
[]
[null,"MÓDULO 6 - CUSTOS INDIRETOS, TRIBUTOS E LUCRO - BDI",null,null,"Percentuais","Valor"]
[null,null,"A","Custos Indiretos",{"$f":"BDI!E6","v":2.7000000000000003E-2}]
[null,null,"A.1","Administração Central",{"$f":"BDI!E7","v":2.1600000000000001E-2}]
[null,null,"A.2","Seguros, Garantias e Riscos",{"$f":"BDI!E8","v":5.4000000000000003E-3}]
[null,null,"B","Lucro",{"$f":"BDI!E10","v":3.3399999999999999E-2}]
[null,null,"C","Tributos",{"$f":"SUM(E90:E91)","v":0.124}]
[null,null,"C.1","Tributos Federais (COFINS, PIS e CPRB)",{"$f":"BDI!E18","v":7.3999999999999996E-2}]
[null,null,"C.2","Tributos Distritais (ISS)",{"$f":"BDI!E23","v":0.05},null,null,"* Nota - Utilizou-se o indicado pelo Sindicato da Arquitetura e da Engenharia (Sinaenco, 2008, p. 22), que adota um percentual redutor de 20% no cálculo dos custos tributários relativos às contribuições PIS e COFINS"]
[null,null,"D","Despesas Financeiras",{"$f":"BDI!E13","v":4.4669210982628549E-3}]
[]
[null,null,null,"TOTAL DE BDI",{"$f":"BDI!E26","v":0.21690000000000001},{"$f":"E94*E102","v":1200.305079}]
[]
[null,null,null,"QUADRO-RESUMO DO CUSTO MENSAL POR EMPREGADO - SEM O 13º","Valor"]
[null,null,null,"Módulo 1 - Composição da Remuneração",{"$f":"F16","v":2598.63}]
[null,null,null,"Módulo 2 - Encargos e Benefícios Anuais, Mensais e Diários",{"$f":"F45","v":2368.64}]
[null,null,null,"Módulo 3 - Provisão para Rescisão",{"$f":"F55","v":165.26}]
[null,null,null,"Módulo 4 - Custo de Reposição do Profissional Ausente",{"$f":"F73","v":288.19}]
[null,null,null,"Módulo 5 - Insumos Diversos",{"$f":"F82","v":113.19}]
[null,null,null,"SUBTOTAL (A+B+C+D+E)",{"$f":"SUM(E97:E101)","v":5533.91}]
[null,null,null,"Módulo 6 - Custos Indiretos, Tributos e Lucro",{"$f":"F94","v":1200.305079}]
[]
[null,null,null,"TOTAL DO POSTO",{"$f":"SUM(E102:E103)","v":6734.2150789999996}]
[]
[null,"MÓDULO 7 - DESTAQUE DO MÓDULO 2 - 13º SALÁRIO",null,null,"Percentuais","Valor"]
[null,null,"A","13º Salário",{"$f":"'Encargos Sociais'!E32","v":8.3299999999999999E-2},{"$f":"ROUND(E108*F$16,2)","v":216.47}]
[null,null,"B","Encargos Sociais sobre o 13º Salário - Taxa calculada no SUBMÓDULO 2.2",{"$f":"SUM($E$24:$E$32)","v":0.36800000000000005},{"$f":"ROUND(E109*$F$108,2)","v":79.66},null,"* Nota 1 - Provisiona-se, mensalmente, o proporcional a 1/12 dos valores referentes a gratificação natalina e adicional de férias."]
[null,null,"C","BDI sobre o 13º Salário - Taxa calculada no MÓDULO 6",{"$f":"E94","v":0.21690000000000001},{"$f":"ROUND(E110*($F$108+$F$109),2)","v":64.23}]
[]
[null,null,null,"TOTAL DO DESTAQUE DO 13º SALÁRIO",null,{"$f":"SUM(F108:F110)","v":360.36}]
[]
[null,null,null,"QUADRO-RESUMO DO CUSTO MENSAL POR EMPREGADO","Valor"]
[null,null,null,"Custo total - sem o 13º Salário",{"$f":"E105","v":6734.2150789999996}]
[null,null,null,"Destaque do 13º Salário (valor mensal)",{"$f":"F112","v":360.36}]
[]
[null,null,null,"TOTAL DO POSTO",{"$f":"E115+E116","v":7094.5750789999993}]

{"sheet":"5","index":8,"n_rows":118,"n_cols":12,"rows_kept":118,"cut":false,"hidden":false,"merged":[[17,1,17,3],[106,1,106,3],[39,3,39,5],[46,1,46,3],[56,1,56,3],[68,3,68,5],[74,1,74,3],[83,1,83,3],[1,1,1,5],[2,1,2,5],[4,1,4,2],[5,1,5,2],[7,1,7,3]]}
[]
[null,"PLANILHA DE ESTIMATIVA DE CUSTOS"]
[null,"Padrão IN 05/2017 e IN 07/2018 - MPDG"]
[]
[null,5,null,{"$f":"HLOOKUP($B$5,'Dados Gerais'!$D$5:$BK$20,6)","v":"ALMOXARIFE"},"QUANTIDADE",{"$f":"HLOOKUP($B$5,'Dados Gerais'!$D$5:$BK$20,10)","v":2}]
[null,"CCT",null,{"$f":"HLOOKUP($B$5,'Dados Gerais'!$D$5:$BK$20,15)","v":"SEAC/DF X SINDISERVIÇOS/DF 2024/2024 Nº DF000012/2024"},"DATA-BASE",{"$f":"HLOOKUP($B$5,'Dados Gerais'!$D$5:$BK$20,16)","v":"2024-01-01"}]
[]
[null,"MÓDULO 1 - COMPOSIÇÃO DA REMUNERAÇÃO",null,null,null,"Valor"]
[null,null,"A","Salário-Base",null,{"$f":"HLOOKUP($B$5,'Dados Gerais'!$D$5:$BK$20,8)","v":3035.66}]
[null,null,"B","Adicional de Periculosidade",null,{"$f":"HLOOKUP($B$5,'Dados Gerais'!$D$5:$BK$37,25)","v":0}]
[null,null,"C","Adicional de Insalubridade",null,{"$f":"HLOOKUP($B$5,'Dados Gerais'!$D$5:$BK$37,31)","v":0}]
[null,null,"D","Adicional Noturno",null,{"$f":"HLOOKUP($B$5,'Dados Gerais'!$D$5:$BK$50,46)","v":0},null,"* Nota 1 - O Módulo 1 refere-se ao valor mensal devido ao empregado pela prestação do serviço no período de 12 meses."]
[null,null,"E","Adicional de Hora Extra",null,{"$f":"HLOOKUP($B$5,'Dados Gerais'!$D$5:$BK$67,63)","v":0},null,"* Nota 2 - O adicional de hora extra no feriado trabalhado foi suprimido pela Lei 13.467/17"]
[null,null,"F","Outros (especificar)",null,{"$f":"HLOOKUP($B$5,'Dados Gerais'!$D$5:$BK$59,33)","v":0},null,"* Nota 3 - ART. 7º, § 2º, DA LEI Nº 605/49.Sendo mensalista o obreiro, o adicional noturno pago de forma fixa já é considerado integrado para os efeitos do pagamento do repouso semanal remunerado, nos termos do art. 7º, § 2º, da Lei nº 605/49."]
[]
[null,null,null,"TOTAL DA REMUNERAÇÃO",null,{"$f":"SUM(F9:F14)","v":3035.66}]
[]
[null,"MÓDULO 2 - ENCARGOS E BENEFÍCIOS ANUAIS, MENSAIS E DIÁRIOS",null,null,"Percentuais","Valor"]
[null,"Submódulo 2.1 - 13º Salário, Férias e Adicional de Férias"]
[null,null,"A","13º Salário - Calculado no Módulo 7 - Destacado",0,{"$f":"ROUND(E20*F$16,2)","v":0}]
[null,null,"B","Férias e Adicional de Férias",{"$f":"'Encargos Sociais'!E31","v":3.0300000000000001E-2},{"$f":"ROUND(E21*F$16,2)","v":91.98},null,"* Nota 1 - Provisiona-se, mensalmente, o proporcional a 1/12 dos valores referentes a gratificação natalina, férias e adicional de férias."]
[null,null,null,null,null,null,null,"* Nota 2 - O adicional de férias contido no Submódulo 2.1 corresponde a 1/3 da remuneração que, por sua vez, é dividida por 12 contome Nota 1."]
[null,"Submódulo 2.2 - Encargos Previdenciários (GPS), Fundo de Garantia por Tempo de Serviço (FGTS) e Outras Contribuições"]
[null,null,"A","INSS (art. 22, inciso I, Lei nº 8.212/91)",{"$f":"'Encargos Sociais'!E14","v":0.2},{"$f":"ROUND(E24*($F$16+$F$41+$F$73),2)","v":692.86}]
[null,null,"B","Salário Educação (art. 3º, inciso I, Decreto nº 87.043/82)",{"$f":"'Encargos Sociais'!E15","v":2.5000000000000001E-2},{"$f":"ROUND(E25*($F$16+$F$41+$F$73),2)","v":86.61}]
[null,null,"C","SAT/RAT (art. 22, II, Lei 8.212/91 e Anexo V, Decreto 6.042/07) - Enquadramento 8211-3/00",{"$f":"'Encargos Sociais'!E16","v":0.03},103.93]
[null,null,"D","SESC ou SESI (art. 30, Lei nº 8.036/90 e art. 1º, Lei 8.154/90)",{"$f":"'Encargos Sociais'!E17","v":1.4999999999999999E-2},51.96]
[null,null,"E","SENAI ou SENAC (Decreto nº 2.318/86)",{"$f":"'Encargos Sociais'!E18","v":0.01},34.64]
[null,null,"F","SEBRAE (§ 3º, art. 8º, Lei 8.029/90, alterada pela Lei nº 8.154/90)",{"$f":"'Encargos Sociais'!E19","v":6.0000000000000001E-3},20.79]
[null,null,"G","INCRA (art. 1º, I, Decreto Lei 1.146/70 e Lei 7.787, de 30/06/89)",{"$f":"'Encargos Sociais'!E20","v":2E-3},6.93,null,"* Nota 1 - Os percentuais dos encargos previdenciários, do FGTS e demais contribuições são estabelecidos por legislação vigente."]
[null,null,"H","FGTS (Lei Complementar nº 110/01 e art. 30, Lei nº 8.036/90)",{"$f":"'Encargos Sociais'!E21","v":0.08},277.14,null,"* Nota 2 - O SAT, a depender do grau de risco do serviço, irá variar entre 1%, para risco leve, de 2%, para risco médio, e de 3% para risco grave."]
[null,null,"I","SECONCI (Convenções Coletivas de Trabalho da construção)",{"$f":"'Encargos Sociais'!E22","v":0},0,null,"* Nota 3 - Os percentuais do Submódulo 2.2 incidem sobre o Módulo 1 e o Submódulo 2.1."]
[]
[null,"Submódulo 2.3 - Benefícios Mensais e Diários"]
[null,null,"A","Auxílio Transporte",null,{"$f":"HLOOKUP($B$5,'Dados Gerais'!$D$5:$BK$93,82)","v":159.56}]
[null,null,"B","Auxílio Alimentação",null,{"$f":"HLOOKUP($B$5,'Dados Gerais'!$D$5:$BK$93,89)","v":1012.8}]
[null,null,"C","Assistência Médica e Familiar",null,{"$f":"HLOOKUP($B$5,'Dados Gerais'!$D$5:$BK$101,97)","v":0}]
[null,null,"D","Outros (Seguro de vida e auxílio funeral e auxílio odontológico)",null,{"$f":"HLOOKUP($B$5,'Dados Gerais'!$D$5:$BK$118,114)","v":0},null,"* Nota 1 - O valor informado deverá ser o custo real do benefício (descontado o valor eventualmente pago pelo empregado)."]
[null,null,null,null,null,null,null,"* Nota 2 - Observar a previsão dos benefícios contidos em Acordos, Convenções e Dissídios Coletivos de Trabalho e o disposto no art. 6º da IN 5/2017"]
[null,null,null,"QUADRO-RESUMO DO MÓDULO 2"]
[null,null,null,"2.1 - 13º Salário, Férias e Adicional de Férias - 13º Destacado - Calculado no Módulo 7 ",{"$f":"SUM(E20:E21)","v":3.0300000000000001E-2},{"$f":"F20+F21","v":91.98}]
[null,null,null,"2.2 - Encargos Previdenciários (GPS), Fundo de Garantia por Tempo de Serviço (FGTS) e Contribuições",{"$f":"SUM(E24:E32)","v":0.36800000000000005},{"$f":"SUM(F24:F32)","v":1274.8600000000001}]
[null,null,null,"2.3 - Benefícios Mensais e Diários",null,{"$f":"SUM(F35:F38)","v":1172.3599999999999}]
[]
[null,null,null,"TOTAL DOS ENCARGOS E BENEFÍCIOS",null,{"$f":"SUM(F41:F43)","v":2539.1999999999998}]
[]
[null,"MÓDULO 3 - PREVISÃO PARA RESCISÃO",null,null,"Percentuais","Valor"]
[null,null,"A","Aviso Prévio Indenizado (Art. 7º, inciso XXI, da CF/1988 e arts. 477, 487, §1º, e 491 da CLT)",{"$f":"'Encargos Sociais'!E36","v":8.3000000000000001E-3},{"$f":"ROUND(E48*$F$16,2)","v":25.2}]
[null,null,"B","Incidência do FGTS sobre o Aviso Prévio Indenizado (Súmula 305 TST)",{"$f":"'Encargos Sociais'!E37","v":6.9999999999999999E-4},2.12,null,"* Nota 1 - Adotou-se os parâmetros do estudo do STF (http://www.stf.jus.br/arquivo/cms/sobrestfestudosci/anexo/encargos_sociais_03102007.pdf), onde 5% do pessoal é demitido pelo empregador no decurso do contrato (para estes, considerou-se o aviso prévio indenizado). Desprezou-se as demissões por justa causa e os pedidos de demissão."]
[null,null,"C","Multa do FGTS e Contribuição Social sobre o Aviso Prévio Indenizado (Art. 18, §1º, da Lei 8.036/1990 e art. 1º da LC nº 110/2001)",{"$f":"'Encargos Sociais'!E38","v":3.8E-3},11.54,null,"* Nota 2 - No cálculo do percentual, considerou-se 36 dias, correspondendo à metade da duração média dos contratos (2 anos)"]
[null,null,"D","Aviso Prévio Trabalhado (Art. 488, parágrafo único, CLT)",{"$f":"'Encargos Sociais'!E39","v":1.2E-2},36.43,null,"* Nota 3 - Incide sobre a Remuneração + 13º salário (1/12) + Férias (1/12) + Adicional de Férias (1/36) x 50% multa (40% para o empregado e 10% de contribuição social) x 8% FGTS"]
[null,null,"E","Incidência de GPS, FGTS e outras contribuições sobre o Aviso Prévio Trabalhado",{"$f":"'Encargos Sociais'!E40","v":4.4000000000000003E-3},13.36,null,"* Nota 4 - Os 95% restantes do cálculo, a um prazo médio de contrato de 4 anos. Assim, calcula-se 7 dias para o 1º ano de contrato e mais 3 dias para os 3 anos seguintes."]
[null,null,"F","Multa do FGTS e Contribuição Social sobre o Aviso Prévio Trabalhado",{"$f":"'Encargos Sociais'!E41","v":3.44E-2},104.43,null,null,null,null,null,{"$f":"SUM(L8:L51)","v":0}]
[]
[null,null,null,"TOTAL DE PREVISÃO PARA RESCISÃO",null,{"$f":"SUM(F48:F53)","v":193.07999999999998}]
[]
[null,"MÓDULO 4 - CUSTO DO PROFISSIONAL AUSENTE",null,null,"Percentuais","Valor"]
[null,"Submódulo 4.1 - Ausências Legais"]
[null,null,"A","Férias (Arts. 129 e 130, inc. I, da CLT)",{"$f":"'Encargos Sociais'!E25","v":9.0899999999999995E-2},{"$f":"ROUND(E59*$F$16,2)","v":275.94},null,"* Nota 1 - As alíneas “A” a “F” referem-se somente ao custo que será pago ao repositor pelos dias \ntrabalhados quando da necessidade de substituir a mão de obra alocada na prestação do serviço."]
[null,null,"B","Ausências Legais (Arts. 131 e 473 da CLT)",{"$f":"'Encargos Sociais'!E26","v":7.9000000000000008E-3},23.98,null,"* Nota 2 - Adotou-se a estimativa do SINAPI de 2 dias por ano."]
[null,null,"C","Licença-Paternidade (Art. 7º, XIX, e art. 10, §1º, do ADCT, CF/1988 e Art. 1º, II, da Lei 11.770/2008)",{"$f":"'Encargos Sociais'!E27","v":8.0000000000000004E-4},2.4300000000000002,null,"* Nota 3 - Utilizada a proporção de 50% para homens, 5 dias de afastamento, e a probabilidade de um trabalhador requerer a Licença Paternidade em 5,22%, conforme SINAPI (citando dados da PNAD 2015)"]
[null,null,"D","Ausência por Acidente de Trabalho (Art. 131, III, da CLT)",{"$f":"'Encargos Sociais'!E28","v":8.9999999999999998E-4},2.73,null,"* Nota 4 - Utilzada a estatística de 1,96% dos contribuintes beneficiados com a emissão do auxílio, conforme Anuário Estatístico da Previdência Social. Afastamento de 15 dias a cargo da empresa."]
[null,null,"E","Afastamento Maternidade (Art. 71 da Lei nº 8.213/1991)",{"$f":"'Encargos Sociais'!E29","v":3.3E-3},10.02,null,"* Nota 5 - Utilizada a proporção de 50% para mulheres, 180 dias de afastamento, e a probabilidade de uma trabalhadora requerer a Licença Maternidade em 4,91%, conforme SINAPI (citando dados do IBGE 2016)"]
[null,null,"F","Auxílio Enfermidade - Doença (Art. 59 da Lei nº 8.213/1991)",{"$f":"'Encargos Sociais'!E30","v":7.1000000000000004E-3},21.55,null,"* Nota 6 - Utilizada a estatística de 3,37% dos contribuintes beneficiados com o auxílio, conforme Anuário Estatístico da Previdência Social de 2015 (acrescidos de 2 dias ao ano, para os quais o trabalhador nem requer o benefício da Previdência - conforme SINAPI)"]
[]
[null,"Submódulo 4.2 - Intrajornada"]
[null,null,"A","Intervalo para repouso ou alimentação",{"$f":"'Encargos Sociais'!E33","v":0},{"$f":"ROUND(E67*$F$16,2)","v":0}]
[]
[null,null,null,"QUADRO-RESUMO DO MÓDULO 4",null,"Valor"]
[null,null,null,"4.1 - Ausências Legais",{"$f":"SUM(E59:E64)","v":0.11089999999999998},{"$f":"ROUND(E70*$F$16,2)","v":336.65}]
[null,null,null,"4.2 - Intrajornada",{"$f":"E67","v":0},{"$f":"ROUND(E71*$F$16,2)","v":0}]
[]
[null,null,null,"TOTAL DE PREVISÃO PARA RESCISÃO E INTERVALO INTRAJORNADA",null,{"$f":"SUM(F70:F71)","v":336.65}]
[]
[null,"MÓDULO 5 - INSUMOS DIVERSOS",null,null,null,"Valor"]
[null,null,"A","Uniformes - aquisição",null,{"$f":"ROUND(HLOOKUP($B$5,Uniformes!L4:EA6,3)/12,2)","v":37.29}]
[null,null,"B","Materiais de consumo relacionados ao posto - aquisição",null,{"$f":"ROUND(HLOOKUP(B5,'Mat Cons'!I11:DX13,3)/12,2)","v":0}]
[null,null,"C","Materiais permanentes relacionados ao posto - remuneração da sua depreciação / manutenção",null,{"$f":"HLOOKUP(B5,'Mat Perm'!Q11:EF13,3)","v":0}]
[null,null,"D","Equipamentos relacionados ao posto - remuneração da sua depreciação / manutenção",null,{"$f":"HLOOKUP(B5,'Equip Rel'!Q11:EF13,3)","v":0}]
[null,null,"E","Equipamentos de Proteção Individual - EPI - aquisição",null,{"$f":"ROUND(HLOOKUP(B5,EPI!J4:DY6,3)/12,2)","v":23.03}]
[]
[null,null,null,"TOTAL DE INSUMOS DIVERSOS",null,{"$f":"SUM(F76:F81)","v":60.32},null,"* Nota - Valores mensais por empregado"]
[]
[null,"MÓDULO 6 - CUSTOS INDIRETOS, TRIBUTOS E LUCRO - BDI",null,null,"Percentuais","Valor"]
[null,null,"A","Custos Indiretos",{"$f":"BDI!E6","v":2.7000000000000003E-2}]
[null,null,"A.1","Administração Central",{"$f":"BDI!E7","v":2.1600000000000001E-2}]
[null,null,"A.2","Seguros, Garantias e Riscos",{"$f":"BDI!E8","v":5.4000000000000003E-3}]
[null,null,"B","Lucro",{"$f":"BDI!E10","v":3.3399999999999999E-2}]
[null,null,"C","Tributos",{"$f":"SUM(E90:E91)","v":0.124}]
[null,null,"C.1","Tributos Federais (COFINS, PIS e CPRB)",{"$f":"BDI!E18","v":7.3999999999999996E-2}]
[null,null,"C.2","Tributos Distritais (ISS)",{"$f":"BDI!E23","v":0.05},null,null,"* Nota - Utilizou-se o indicado pelo Sindicato da Arquitetura e da Engenharia (Sinaenco, 2008, p. 22), que adota um percentual redutor de 20% no cálculo dos custos tributários relativos às contribuições PIS e COFINS"]
[null,null,"D","Despesas Financeiras",{"$f":"BDI!E13","v":4.4669210982628549E-3}]
[]
[null,null,null,"TOTAL DE BDI",{"$f":"BDI!E26","v":0.21690000000000001},{"$f":"E94*E102","v":1337.1689789999998}]
[]
[null,null,null,"QUADRO-RESUMO DO CUSTO MENSAL POR EMPREGADO - SEM O 13º","Valor"]
[null,null,null,"Módulo 1 - Composição da Remuneração",{"$f":"F16","v":3035.66}]
[null,null,null,"Módulo 2 - Encargos e Benefícios Anuais, Mensais e Diários",{"$f":"F45","v":2539.1999999999998}]
[null,null,null,"Módulo 3 - Provisão para Rescisão",{"$f":"F55","v":193.07999999999998}]
[null,null,null,"Módulo 4 - Custo de Reposição do Profissional Ausente",{"$f":"F73","v":336.65}]
[null,null,null,"Módulo 5 - Insumos Diversos",{"$f":"F82","v":60.32}]
[null,null,null,"SUBTOTAL (A+B+C+D+E)",{"$f":"SUM(E97:E101)","v":6164.9099999999989}]
[null,null,null,"Módulo 6 - Custos Indiretos, Tributos e Lucro",{"$f":"F94","v":1337.1689789999998}]
[]
[null,null,null,"TOTAL DO POSTO",{"$f":"SUM(E102:E103)","v":7502.078978999999}]
[]
[null,"MÓDULO 7 - DESTAQUE DO MÓDULO 2 - 13º SALÁRIO",null,null,"Percentuais","Valor"]
[null,null,"A","13º Salário",{"$f":"'Encargos Sociais'!E32","v":8.3299999999999999E-2},{"$f":"ROUND(E108*F$16,2)","v":252.87}]
[null,null,"B","Encargos Sociais sobre o 13º Salário - Taxa calculada no SUBMÓDULO 2.2",{"$f":"SUM($E$24:$E$32)","v":0.36800000000000005},{"$f":"ROUND(E109*$F$108,2)","v":93.06},null,"* Nota 1 - Provisiona-se, mensalmente, o proporcional a 1/12 dos valores referentes a gratificação natalina e adicional de férias."]
[null,null,"C","BDI sobre o 13º Salário - Taxa calculada no MÓDULO 6",{"$f":"E94","v":0.21690000000000001},{"$f":"ROUND(E110*($F$108+$F$109),2)","v":75.03}]
[]
[null,null,null,"TOTAL DO DESTAQUE DO 13º SALÁRIO",null,{"$f":"SUM(F108:F110)","v":420.96000000000004}]
[]
[null,null,null,"QUADRO-RESUMO DO CUSTO MENSAL POR EMPREGADO","Valor"]
[null,null,null,"Custo total - sem o 13º Salário",{"$f":"E105","v":7502.078978999999}]
[null,null,null,"Destaque do 13º Salário (valor mensal)",{"$f":"F112","v":420.96000000000004}]
[]
[null,null,null,"TOTAL DO POSTO",{"$f":"E115+E116","v":7923.038978999999}]

{"sheet":"6","index":9,"n_rows":118,"n_cols":12,"rows_kept":118,"cut":false,"hidden":false,"merged":[[106,1,106,3],[39,3,39,5],[46,1,46,3],[56,1,56,3],[68,3,68,5],[74,1,74,3],[83,1,83,3],[17,1,17,3],[1,1,1,5],[2,1,2,5],[4,1,4,2],[5,1,5,2],[7,1,7,3]]}
[]
[null,"PLANILHA DE ESTIMATIVA DE CUSTOS"]
[null,"Padrão IN 05/2017 e IN 07/2018 - MPDG"]
[]
[null,6,null,{"$f":"HLOOKUP($B$5,'Dados Gerais'!$D$5:$BK$20,6)","v":"SERVENTE"},"QUANTIDADE",{"$f":"HLOOKUP($B$5,'Dados Gerais'!$D$5:$BK$20,10)","v":189}]
[null,"CCT",null,{"$f":"HLOOKUP($B$5,'Dados Gerais'!$D$5:$BK$20,15)","v":"SEAC/DF X SINDISERVIÇOS/DF 2024/2024 Nº DF000012/2024"},"DATA-BASE",{"$f":"HLOOKUP($B$5,'Dados Gerais'!$D$5:$BK$20,16)","v":"2024-01-01"}]
[]
[null,"MÓDULO 1 - COMPOSIÇÃO DA REMUNERAÇÃO",null,null,null,"Valor"]
[null,null,"A","Salário-Base",null,{"$f":"HLOOKUP($B$5,'Dados Gerais'!$D$5:$BK$20,8)","v":2017.21}]
[null,null,"B","Adicional de Periculosidade",null,{"$f":"HLOOKUP($B$5,'Dados Gerais'!$D$5:$BK$37,25)","v":0}]
[null,null,"C","Adicional de Insalubridade",null,{"$f":"HLOOKUP($B$5,'Dados Gerais'!$D$5:$BK$37,31)","v":0}]
[null,null,"D","Adicional Noturno",null,{"$f":"HLOOKUP($B$5,'Dados Gerais'!$D$5:$BK$50,46)","v":0},null,"* Nota 1 - O Módulo 1 refere-se ao valor mensal devido ao empregado pela prestação do serviço no período de 12 meses."]
[null,null,"E","Adicional de Hora Extra",null,{"$f":"HLOOKUP($B$5,'Dados Gerais'!$D$5:$BK$67,63)","v":0},null,"* Nota 2 - O adicional de hora extra no feriado trabalhado foi suprimido pela Lei 13.467/17"]
[null,null,"F","Outros (especificar)",null,{"$f":"HLOOKUP($B$5,'Dados Gerais'!$D$5:$BK$59,33)","v":0},null,"* Nota 3 - ART. 7º, § 2º, DA LEI Nº 605/49.Sendo mensalista o obreiro, o adicional noturno pago de forma fixa já é considerado integrado para os efeitos do pagamento do repouso semanal remunerado, nos termos do art. 7º, § 2º, da Lei nº 605/49."]
[]
[null,null,null,"TOTAL DA REMUNERAÇÃO",null,{"$f":"SUM(F9:F14)","v":2017.21}]
[]
[null,"MÓDULO 2 - ENCARGOS E BENEFÍCIOS ANUAIS, MENSAIS E DIÁRIOS",null,null,"Percentuais","Valor"]
[null,"Submódulo 2.1 - 13º Salário, Férias e Adicional de Férias"]
[null,null,"A","13º Salário - Calculado no Módulo 7 - Destacado",0,{"$f":"ROUND(E20*F$16,2)","v":0}]
[null,null,"B","Férias e Adicional de Férias",{"$f":"'Encargos Sociais'!E31","v":3.0300000000000001E-2},{"$f":"ROUND(E21*F$16,2)","v":61.12},null,"* Nota 1 - Provisiona-se, mensalmente, o proporcional a 1/12 dos valores referentes a gratificação natalina, férias e adicional de férias."]
[null,null,null,null,null,null,null,"* Nota 2 - O adicional de férias contido no Submódulo 2.1 corresponde a 1/3 da remuneração que, por sua vez, é dividida por 12 contome Nota 1."]
[null,"Submódulo 2.2 - Encargos Previdenciários (GPS), Fundo de Garantia por Tempo de Serviço (FGTS) e Outras Contribuições"]
[null,null,"A","INSS (art. 22, inciso I, Lei nº 8.212/91)",{"$f":"'Encargos Sociais'!E14","v":0.2},{"$f":"ROUND(E24*($F$16+$F$41+$F$73),2)","v":460.41}]
[null,null,"B","Salário Educação (art. 3º, inciso I, Decreto nº 87.043/82)",{"$f":"'Encargos Sociais'!E15","v":2.5000000000000001E-2},{"$f":"ROUND(E25*($F$16+$F$41+$F$73),2)","v":57.55}]
[null,null,"C","SAT/RAT (art. 22, II, Lei 8.212/91 e Anexo V, Decreto 6.042/07) - Enquadramento 8211-3/00",{"$f":"'Encargos Sociais'!E16","v":0.03},69.06]
[null,null,"D","SESC ou SESI (art. 30, Lei nº 8.036/90 e art. 1º, Lei 8.154/90)",{"$f":"'Encargos Sociais'!E17","v":1.4999999999999999E-2},34.53]
[null,null,"E","SENAI ou SENAC (Decreto nº 2.318/86)",{"$f":"'Encargos Sociais'!E18","v":0.01},23.02]
[null,null,"F","SEBRAE (§ 3º, art. 8º, Lei 8.029/90, alterada pela Lei nº 8.154/90)",{"$f":"'Encargos Sociais'!E19","v":6.0000000000000001E-3},13.81]
[null,null,"G","INCRA (art. 1º, I, Decreto Lei 1.146/70 e Lei 7.787, de 30/06/89)",{"$f":"'Encargos Sociais'!E20","v":2E-3},4.5999999999999996,null,"* Nota 1 - Os percentuais dos encargos previdenciários, do FGTS e demais contribuições são estabelecidos por legislação vigente."]
[null,null,"H","FGTS (Lei Complementar nº 110/01 e art. 30, Lei nº 8.036/90)",{"$f":"'Encargos Sociais'!E21","v":0.08},184.16,null,"* Nota 2 - O SAT, a depender do grau de risco do serviço, irá variar entre 1%, para risco leve, de 2%, para risco médio, e de 3% para risco grave."]
[null,null,"I","SECONCI (Convenções Coletivas de Trabalho da construção)",{"$f":"'Encargos Sociais'!E22","v":0},0,null,"* Nota 3 - Os percentuais do Submódulo 2.2 incidem sobre o Módulo 1 e o Submódulo 2.1."]
[]
[null,"Submódulo 2.3 - Benefícios Mensais e Diários"]
[null,null,"A","Auxílio Transporte",null,{"$f":"HLOOKUP($B$5,'Dados Gerais'!$D$5:$BK$93,82)","v":220.67}]
[null,null,"B","Auxílio Alimentação",null,{"$f":"HLOOKUP($B$5,'Dados Gerais'!$D$5:$BK$93,89)","v":1012.8}]
[null,null,"C","Assistência Médica e Familiar",null,{"$f":"HLOOKUP($B$5,'Dados Gerais'!$D$5:$BK$101,97)","v":0}]
[null,null,"D","Outros (Seguro de vida e auxílio funeral e auxílio odontológico)",null,{"$f":"HLOOKUP($B$5,'Dados Gerais'!$D$5:$BK$118,114)","v":0},null,"* Nota 1 - O valor informado deverá ser o custo real do benefício (descontado o valor eventualmente pago pelo empregado)."]
[null,null,null,null,null,null,null,"* Nota 2 - Observar a previsão dos benefícios contidos em Acordos, Convenções e Dissídios Coletivos de Trabalho e o disposto no art. 6º da IN 5/2017"]
[null,null,null,"QUADRO-RESUMO DO MÓDULO 2"]
[null,null,null,"2.1 - 13º Salário, Férias e Adicional de Férias - 13º Destacado - Calculado no Módulo 7 ",{"$f":"SUM(E20:E21)","v":3.0300000000000001E-2},{"$f":"F20+F21","v":61.12}]
[null,null,null,"2.2 - Encargos Previdenciários (GPS), Fundo de Garantia por Tempo de Serviço (FGTS) e Contribuições",{"$f":"SUM(E24:E32)","v":0.36800000000000005},{"$f":"SUM(F24:F32)","v":847.13999999999987}]
[null,null,null,"2.3 - Benefícios Mensais e Diários",null,{"$f":"SUM(F35:F38)","v":1233.47}]
[]
[null,null,null,"TOTAL DOS ENCARGOS E BENEFÍCIOS",null,{"$f":"SUM(F41:F43)","v":2141.73}]
[]
[null,"MÓDULO 3 - PREVISÃO PARA RESCISÃO",null,null,"Percentuais","Valor"]
[null,null,"A","Aviso Prévio Indenizado (Art. 7º, inciso XXI, da CF/1988 e arts. 477, 487, §1º, e 491 da CLT)",{"$f":"'Encargos Sociais'!E36","v":8.3000000000000001E-3},{"$f":"ROUND(E48*$F$16,2)","v":16.739999999999998}]
[null,null,"B","Incidência do FGTS sobre o Aviso Prévio Indenizado (Súmula 305 TST)",{"$f":"'Encargos Sociais'!E37","v":6.9999999999999999E-4},1.41,null,"* Nota 1 - Adotou-se os parâmetros do estudo do STF (http://www.stf.jus.br/arquivo/cms/sobrestfestudosci/anexo/encargos_sociais_03102007.pdf), onde 5% do pessoal é demitido pelo empregador no decurso do contrato (para estes, considerou-se o aviso prévio indenizado). Desprezou-se as demissões por justa causa e os pedidos de demissão."]
[null,null,"C","Multa do FGTS e Contribuição Social sobre o Aviso Prévio Indenizado (Art. 18, §1º, da Lei 8.036/1990 e art. 1º da LC nº 110/2001)",{"$f":"'Encargos Sociais'!E38","v":3.8E-3},7.67,null,"* Nota 2 - No cálculo do percentual, considerou-se 36 dias, correspondendo à metade da duração média dos contratos (2 anos)"]
[null,null,"D","Aviso Prévio Trabalhado (Art. 488, parágrafo único, CLT)",{"$f":"'Encargos Sociais'!E39","v":1.2E-2},24.21,null,"* Nota 3 - Incide sobre a Remuneração + 13º salário (1/12) + Férias (1/12) + Adicional de Férias (1/36) x 50% multa (40% para o empregado e 10% de contribuição social) x 8% FGTS"]
[null,null,"E","Incidência de GPS, FGTS e outras contribuições sobre o Aviso Prévio Trabalhado",{"$f":"'Encargos Sociais'!E40","v":4.4000000000000003E-3},8.8800000000000008,null,"* Nota 4 - Os 95% restantes do cálculo, a um prazo médio de contrato de 4 anos. Assim, calcula-se 7 dias para o 1º ano de contrato e mais 3 dias para os 3 anos seguintes."]
[null,null,"F","Multa do FGTS e Contribuição Social sobre o Aviso Prévio Trabalhado",{"$f":"'Encargos Sociais'!E41","v":3.44E-2},69.39,null,null,null,null,null,{"$f":"SUM(L8:L51)","v":0}]
[]
[null,null,null,"TOTAL DE PREVISÃO PARA RESCISÃO",null,{"$f":"SUM(F48:F53)","v":128.30000000000001}]
[]
[null,"MÓDULO 4 - CUSTO DO PROFISSIONAL AUSENTE",null,null,"Percentuais","Valor"]
[null,"Submódulo 4.1 - Ausências Legais"]
[null,null,"A","Férias (Arts. 129 e 130, inc. I, da CLT)",{"$f":"'Encargos Sociais'!E25","v":9.0899999999999995E-2},{"$f":"ROUND(E59*$F$16,2)","v":183.36},null,"* Nota 1 - As alíneas “A” a “F” referem-se somente ao custo que será pago ao repositor pelos dias \ntrabalhados quando da necessidade de substituir a mão de obra alocada na prestação do serviço."]
[null,null,"B","Ausências Legais (Arts. 131 e 473 da CLT)",{"$f":"'Encargos Sociais'!E26","v":7.9000000000000008E-3},15.94,null,"* Nota 2 - Adotou-se a estimativa do SINAPI de 2 dias por ano."]
[null,null,"C","Licença-Paternidade (Art. 7º, XIX, e art. 10, §1º, do ADCT, CF/1988 e Art. 1º, II, da Lei 11.770/2008)",{"$f":"'Encargos Sociais'!E27","v":8.0000000000000004E-4},1.61,null,"* Nota 3 - Utilizada a proporção de 50% para homens, 5 dias de afastamento, e a probabilidade de um trabalhador requerer a Licença Paternidade em 5,22%, conforme SINAPI (citando dados da PNAD 2015)"]
[null,null,"D","Ausência por Acidente de Trabalho (Art. 131, III, da CLT)",{"$f":"'Encargos Sociais'!E28","v":8.9999999999999998E-4},1.82,null,"* Nota 4 - Utilzada a estatística de 1,96% dos contribuintes beneficiados com a emissão do auxílio, conforme Anuário Estatístico da Previdência Social. Afastamento de 15 dias a cargo da empresa."]
[null,null,"E","Afastamento Maternidade (Art. 71 da Lei nº 8.213/1991)",{"$f":"'Encargos Sociais'!E29","v":3.3E-3},6.66,null,"* Nota 5 - Utilizada a proporção de 50% para mulheres, 180 dias de afastamento, e a probabilidade de uma trabalhadora requerer a Licença Maternidade em 4,91%, conforme SINAPI (citando dados do IBGE 2016)"]
[null,null,"F","Auxílio Enfermidade - Doença (Art. 59 da Lei nº 8.213/1991)",{"$f":"'Encargos Sociais'!E30","v":7.1000000000000004E-3},14.32,null,"* Nota 6 - Utilizada a estatística de 3,37% dos contribuintes beneficiados com o auxílio, conforme Anuário Estatístico da Previdência Social de 2015 (acrescidos de 2 dias ao ano, para os quais o trabalhador nem requer o benefício da Previdência - conforme SINAPI)"]
[]
[null,"Submódulo 4.2 - Intrajornada"]
[null,null,"A","Intervalo para repouso ou alimentação",{"$f":"'Encargos Sociais'!E33","v":0},{"$f":"ROUND(E67*$F$16,2)","v":0}]
[]
[null,null,null,"QUADRO-RESUMO DO MÓDULO 4",null,"Valor"]
[null,null,null,"4.1 - Ausências Legais",{"$f":"SUM(E59:E64)","v":0.11089999999999998},{"$f":"ROUND(E70*$F$16,2)","v":223.71}]
[null,null,null,"4.2 - Intrajornada",{"$f":"E67","v":0},{"$f":"ROUND(E71*$F$16,2)","v":0}]
[]
[null,null,null,"TOTAL DE PREVISÃO PARA RESCISÃO E INTERVALO INTRAJORNADA",null,{"$f":"SUM(F70:F71)","v":223.71}]
[]
[null,"MÓDULO 5 - INSUMOS DIVERSOS",null,null,null,"Valor"]
[null,null,"A","Uniformes - aquisição",null,{"$f":"ROUND(HLOOKUP($B$5,Uniformes!L4:EA6,3)/12,2)","v":37.29}]
[null,null,"B","Materiais de consumo relacionados ao posto - aquisição",null,{"$f":"ROUND(HLOOKUP(B5,'Mat Cons'!I11:DX13,3)/12,2)","v":0}]
[null,null,"C","Materiais permanentes relacionados ao posto - remuneração da sua depreciação / manutenção",null,{"$f":"HLOOKUP(B5,'Mat Perm'!Q11:EF13,3)","v":0}]
[null,null,"D","Equipamentos relacionados ao posto - remuneração da sua depreciação / manutenção",null,{"$f":"HLOOKUP(B5,'Equip Rel'!Q11:EF13,3)","v":0}]
[null,null,"E","Equipamentos de Proteção Individual - EPI - aquisição",null,{"$f":"ROUND(HLOOKUP(B5,EPI!J4:DY6,3)/12,2)","v":24.31}]
[]
[null,null,null,"TOTAL DE INSUMOS DIVERSOS",null,{"$f":"SUM(F76:F81)","v":61.599999999999994},null,"* Nota - Valores mensais por empregado"]
[]
[null,"MÓDULO 6 - CUSTOS INDIRETOS, TRIBUTOS E LUCRO - BDI",null,null,"Percentuais","Valor"]
[null,null,"A","Custos Indiretos",{"$f":"BDI!E6","v":2.7000000000000003E-2}]
[null,null,"A.1","Administração Central",{"$f":"BDI!E7","v":2.1600000000000001E-2}]
[null,null,"A.2","Seguros, Garantias e Riscos",{"$f":"BDI!E8","v":5.4000000000000003E-3}]
[null,null,"B","Lucro",{"$f":"BDI!E10","v":3.3399999999999999E-2}]
[null,null,"C","Tributos",{"$f":"SUM(E90:E91)","v":0.124}]
[null,null,"C.1","Tributos Federais (COFINS, PIS e CPRB)",{"$f":"BDI!E18","v":7.3999999999999996E-2}]
[null,null,"C.2","Tributos Distritais (ISS)",{"$f":"BDI!E23","v":0.05},null,null,"* Nota - Utilizou-se o indicado pelo Sindicato da Arquitetura e da Engenharia (Sinaenco, 2008, p. 22), que adota um percentual redutor de 20% no cálculo dos custos tributários relativos às contribuições PIS e COFINS"]
[null,null,"D","Despesas Financeiras",{"$f":"BDI!E13","v":4.4669210982628549E-3}]
[]
[null,null,null,"TOTAL DE BDI",{"$f":"BDI!E26","v":0.21690000000000001},{"$f":"E94*E102","v":991.78609500000027}]
[]
[null,null,null,"QUADRO-RESUMO DO CUSTO MENSAL POR EMPREGADO - SEM O 13º","Valor"]
[null,null,null,"Módulo 1 - Composição da Remuneração",{"$f":"F16","v":2017.21}]
[null,null,null,"Módulo 2 - Encargos e Benefícios Anuais, Mensais e Diários",{"$f":"F45","v":2141.73}]
[null,null,null,"Módulo 3 - Provisão para Rescisão",{"$f":"F55","v":128.30000000000001}]
[null,null,null,"Módulo 4 - Custo de Reposição do Profissional Ausente",{"$f":"F73","v":223.71}]
[null,null,null,"Módulo 5 - Insumos Diversos",{"$f":"F82","v":61.599999999999994}]
[null,null,null,"SUBTOTAL (A+B+C+D+E)",{"$f":"SUM(E97:E101)","v":4572.5500000000011}]
[null,null,null,"Módulo 6 - Custos Indiretos, Tributos e Lucro",{"$f":"F94","v":991.78609500000027}]
[]
[null,null,null,"TOTAL DO POSTO",{"$f":"SUM(E102:E103)","v":5564.3360950000015}]
[]
[null,"MÓDULO 7 - DESTAQUE DO MÓDULO 2 - 13º SALÁRIO",null,null,"Percentuais","Valor"]
[null,null,"A","13º Salário",{"$f":"'Encargos Sociais'!E32","v":8.3299999999999999E-2},{"$f":"ROUND(E108*F$16,2)","v":168.03}]
[null,null,"B","Encargos Sociais sobre o 13º Salário - Taxa calculada no SUBMÓDULO 2.2",{"$f":"SUM($E$24:$E$32)","v":0.36800000000000005},{"$f":"ROUND(E109*$F$108,2)","v":61.84},null,"* Nota 1 - Provisiona-se, mensalmente, o proporcional a 1/12 dos valores referentes a gratificação natalina e adicional de férias."]
[null,null,"C","BDI sobre o 13º Salário - Taxa calculada no MÓDULO 6",{"$f":"E94","v":0.21690000000000001},{"$f":"ROUND(E110*($F$108+$F$109),2)","v":49.86}]
[]
[null,null,null,"TOTAL DO DESTAQUE DO 13º SALÁRIO",null,{"$f":"SUM(F108:F110)","v":279.73}]
[]
[null,null,null,"QUADRO-RESUMO DO CUSTO MENSAL POR EMPREGADO","Valor"]
[null,null,null,"Custo total - sem o 13º Salário",{"$f":"E105","v":5564.3360950000015}]
[null,null,null,"Destaque do 13º Salário (valor mensal)",{"$f":"F112","v":279.73}]
[]
[null,null,null,"TOTAL DO POSTO",{"$f":"E115+E116","v":5844.066095000002}]

{"sheet":"7","index":10,"n_rows":118,"n_cols":8,"rows_kept":118,"cut":false,"hidden":true,"merged":[[17,1,17,3],[1,1,1,5],[2,1,2,5],[4,1,4,2],[5,1,5,2],[7,1,7,3],[106,1,106,3],[39,3,39,5],[46,1,46,3],[56,1,56,3],[68,3,68,5],[74,1,74,3],[83,1,83,3]]}
[]
[null,"PLANILHA DE ESTIMATIVA DE CUSTOS"]
[null,"Padrão IN 05/2017 e IN 07/2018 - MPDG"]
[]
[null,7,null,{"$f":"HLOOKUP($B$5,'Dados Gerais'!$D$5:$BK$20,6)","v":0},"QUANTIDADE",{"$f":"HLOOKUP($B$5,'Dados Gerais'!$D$5:$BK$20,10)","v":0}]
[null,"CCT",null,{"$f":"HLOOKUP($B$5,'Dados Gerais'!$D$5:$BK$20,15)","v":0},"DATA-BASE",{"$f":"HLOOKUP($B$5,'Dados Gerais'!$D$5:$BK$20,16)","v":"00:00:00"}]
[]
[null,"MÓDULO 1 - COMPOSIÇÃO DA REMUNERAÇÃO",null,null,null,"Valor"]
[null,null,"A","Salário-Base",null,{"$f":"HLOOKUP($B$5,'Dados Gerais'!$D$5:$BK$20,8)","v":0}]
[null,null,"B","Adicional de Periculosidade",null,{"$f":"HLOOKUP($B$5,'Dados Gerais'!$D$5:$BK$37,25)","v":0}]
[null,null,"C","Adicional de Insalubridade",null,{"$f":"HLOOKUP($B$5,'Dados Gerais'!$D$5:$BK$37,31)","v":0}]
[null,null,"D","Adicional Noturno",null,{"$f":"HLOOKUP($B$5,'Dados Gerais'!$D$5:$BK$50,46)","v":0},null,"* Nota 1 - O Módulo 1 refere-se ao valor mensal devido ao empregado pela prestação do serviço no período de 12 meses."]
[null,null,"E","Adicional de Hora Extra",null,{"$f":"HLOOKUP($B$5,'Dados Gerais'!$D$5:$BK$67,63)","v":0},null,"* Nota 2 - O adicional de hora extra no feriado trabalhado foi suprimido pela Lei 13.467/17"]
[null,null,"F","Outros (especificar)",null,{"$f":"HLOOKUP($B$5,'Dados Gerais'!$D$5:$BK$59,33)","v":0},null,"* Nota 3 - ART. 7º, § 2º, DA LEI Nº 605/49.Sendo mensalista o obreiro, o adicional noturno pago de forma fixa já é considerado integrado para os efeitos do pagamento do repouso semanal remunerado, nos termos do art. 7º, § 2º, da Lei nº 605/49."]
[]
[null,null,null,"TOTAL DA REMUNERAÇÃO",null,{"$f":"SUM(F9:F14)","v":0}]
[]
[null,"MÓDULO 2 - ENCARGOS E BENEFÍCIOS ANUAIS, MENSAIS E DIÁRIOS",null,null,"Percentuais","Valor"]
[null,"Submódulo 2.1 - 13º Salário, Férias e Adicional de Férias"]
[null,null,"A","13º Salário - Calculado no Módulo 7 - Destacado",0,{"$f":"ROUND(E20*F$16,2)","v":0}]
[null,null,"B","Férias e Adicional de Férias",{"$f":"'Encargos Sociais'!E31","v":3.0300000000000001E-2},{"$f":"ROUND(E21*F$16,2)","v":0},null,"* Nota 1 - Provisiona-se, mensalmente, o proporcional a 1/12 dos valores referentes a gratificação natalina, férias e adicional de férias."]
[null,null,null,null,null,null,null,"* Nota 2 - O adicional de férias contido no Submódulo 2.1 corresponde a 1/3 da remuneração que, por sua vez, é dividida por 12 contome Nota 1."]
[null,"Submódulo 2.2 - Encargos Previdenciários (GPS), Fundo de Garantia por Tempo de Serviço (FGTS) e Outras Contribuições"]
[null,null,"A","INSS (art. 22, inciso I, Lei nº 8.212/91)",{"$f":"'Encargos Sociais'!E14","v":0.2},{"$f":"ROUND(E24*($F$16+$F$41+$F$73),2)","v":0}]
[null,null,"B","Salário Educação (art. 3º, inciso I, Decreto nº 87.043/82)",{"$f":"'Encargos Sociais'!E15","v":2.5000000000000001E-2},{"$f":"ROUND(E25*($F$16+$F$41+$F$73),2)","v":0}]
[null,null,"C","SAT/RAT (art. 22, II, Lei 8.212/91 e Anexo V, Decreto 6.042/07) - Enquadramento 8211-3/00",{"$f":"'Encargos Sociais'!E16","v":0.03},0]
[null,null,"D","SESC ou SESI (art. 30, Lei nº 8.036/90 e art. 1º, Lei 8.154/90)",{"$f":"'Encargos Sociais'!E17","v":1.4999999999999999E-2},0]
[null,null,"E","SENAI ou SENAC (Decreto nº 2.318/86)",{"$f":"'Encargos Sociais'!E18","v":0.01},0]
[null,null,"F","SEBRAE (§ 3º, art. 8º, Lei 8.029/90, alterada pela Lei nº 8.154/90)",{"$f":"'Encargos Sociais'!E19","v":6.0000000000000001E-3},0]
[null,null,"G","INCRA (art. 1º, I, Decreto Lei 1.146/70 e Lei 7.787, de 30/06/89)",{"$f":"'Encargos Sociais'!E20","v":2E-3},0,null,"* Nota 1 - Os percentuais dos encargos previdenciários, do FGTS e demais contribuições são estabelecidos por legislação vigente."]
[null,null,"H","FGTS (Lei Complementar nº 110/01 e art. 30, Lei nº 8.036/90)",{"$f":"'Encargos Sociais'!E21","v":0.08},0,null,"* Nota 2 - O SAT, a depender do grau de risco do serviço, irá variar entre 1%, para risco leve, de 2%, para risco médio, e de 3% para risco grave."]
[null,null,"I","SECONCI (Convenções Coletivas de Trabalho da construção)",{"$f":"'Encargos Sociais'!E22","v":0},0,null,"* Nota 3 - Os percentuais do Submódulo 2.2 incidem sobre o Módulo 1 e o Submódulo 2.1."]
[]
[null,"Submódulo 2.3 - Benefícios Mensais e Diários"]
[null,null,"A","Auxílio Transporte",null,{"$f":"HLOOKUP($B$5,'Dados Gerais'!$D$5:$BK$93,82)","v":0}]
[null,null,"B","Auxílio Alimentação",null,{"$f":"HLOOKUP($B$5,'Dados Gerais'!$D$5:$BK$93,89)","v":0}]
[null,null,"C","Assistência Médica e Familiar",null,{"$f":"HLOOKUP($B$5,'Dados Gerais'!$D$5:$BK$101,97)","v":0}]
[null,null,"D","Outros (Seguro de vida e auxílio funeral e auxílio odontológico)",null,{"$f":"HLOOKUP($B$5,'Dados Gerais'!$D$5:$BK$118,114)","v":0},null,"* Nota 1 - O valor informado deverá ser o custo real do benefício (descontado o valor eventualmente pago pelo empregado)."]
[null,null,null,null,null,null,null,"* Nota 2 - Observar a previsão dos benefícios contidos em Acordos, Convenções e Dissídios Coletivos de Trabalho e o disposto no art. 6º da IN 5/2017"]
[null,null,null,"QUADRO-RESUMO DO MÓDULO 2"]
[null,null,null,"2.1 - 13º Salário, Férias e Adicional de Férias - 13º Destacado - Calculado no Módulo 7 ",{"$f":"SUM(E20:E21)","v":3.0300000000000001E-2},{"$f":"F20+F21","v":0}]
[null,null,null,"2.2 - Encargos Previdenciários (GPS), Fundo de Garantia por Tempo de Serviço (FGTS) e Contribuições",{"$f":"SUM(E24:E32)","v":0.36800000000000005},{"$f":"SUM(F24:F32)","v":0}]
[null,null,null,"2.3 - Benefícios Mensais e Diários",null,{"$f":"SUM(F35:F38)","v":0}]
[]
[null,null,null,"TOTAL DOS ENCARGOS E BENEFÍCIOS",null,{"$f":"SUM(F41:F43)","v":0}]
[]
[null,"MÓDULO 3 - PREVISÃO PARA RESCISÃO",null,null,"Percentuais","Valor"]
[null,null,"A","Aviso Prévio Indenizado (Art. 7º, inciso XXI, da CF/1988 e arts. 477, 487, §1º, e 491 da CLT)",{"$f":"'Encargos Sociais'!E36","v":8.3000000000000001E-3},{"$f":"ROUND(E48*$F$16,2)","v":0}]
[null,null,"B","Incidência do FGTS sobre o Aviso Prévio Indenizado (Súmula 305 TST)",{"$f":"'Encargos Sociais'!E37","v":6.9999999999999999E-4},0,null,"* Nota 1 - Adotou-se os parâmetros do estudo do STF (http://www.stf.jus.br/arquivo/cms/sobrestfestudosci/anexo/encargos_sociais_03102007.pdf), onde 5% do pessoal é demitido pelo empregador no decurso do contrato (para estes, considerou-se o aviso prévio indenizado). Desprezou-se as demissões por justa causa e os pedidos de demissão."]
[null,null,"C","Multa do FGTS e Contribuição Social sobre o Aviso Prévio Indenizado (Art. 18, §1º, da Lei 8.036/1990 e art. 1º da LC nº 110/2001)",{"$f":"'Encargos Sociais'!E38","v":3.8E-3},0,null,"* Nota 2 - No cálculo do percentual, considerou-se 36 dias, correspondendo à metade da duração média dos contratos (2 anos)"]
[null,null,"D","Aviso Prévio Trabalhado (Art. 488, parágrafo único, CLT)",{"$f":"'Encargos Sociais'!E39","v":1.2E-2},0,null,"* Nota 3 - Incide sobre a Remuneração + 13º salário (1/12) + Férias (1/12) + Adicional de Férias (1/36) x 50% multa (40% para o empregado e 10% de contribuição social) x 8% FGTS"]
[null,null,"E","Incidência de GPS, FGTS e outras contribuições sobre o Aviso Prévio Trabalhado",{"$f":"'Encargos Sociais'!E40","v":4.4000000000000003E-3},0,null,"* Nota 4 - Os 95% restantes do cálculo, a um prazo médio de contrato de 4 anos. Assim, calcula-se 7 dias para o 1º ano de contrato e mais 3 dias para os 3 anos seguintes."]
[null,null,"F","Multa do FGTS e Contribuição Social sobre o Aviso Prévio Trabalhado",{"$f":"'Encargos Sociais'!E41","v":3.44E-2},0]
[]
[null,null,null,"TOTAL DE PREVISÃO PARA RESCISÃO",null,{"$f":"SUM(F48:F53)","v":0}]
[]
[null,"MÓDULO 4 - CUSTO DO PROFISSIONAL AUSENTE",null,null,"Percentuais","Valor"]
[null,"Submódulo 4.1 - Ausências Legais"]
[null,null,"A","Férias (Arts. 129 e 130, inc. I, da CLT)",{"$f":"'Encargos Sociais'!E25","v":9.0899999999999995E-2},{"$f":"ROUND(E59*$F$16,2)","v":0},null,"* Nota 1 - As alíneas “A” a “F” referem-se somente ao custo que será pago ao repositor pelos dias \ntrabalhados quando da necessidade de substituir a mão de obra alocada na prestação do serviço."]
[null,null,"B","Ausências Legais (Arts. 131 e 473 da CLT)",{"$f":"'Encargos Sociais'!E26","v":7.9000000000000008E-3},0,null,"* Nota 2 - Adotou-se a estimativa do SINAPI de 2 dias por ano."]
[null,null,"C","Licença-Paternidade (Art. 7º, XIX, e art. 10, §1º, do ADCT, CF/1988 e Art. 1º, II, da Lei 11.770/2008)",{"$f":"'Encargos Sociais'!E27","v":8.0000000000000004E-4},0,null,"* Nota 3 - Utilizada a proporção de 50% para homens, 5 dias de afastamento, e a probabilidade de um trabalhador requerer a Licença Paternidade em 5,22%, conforme SINAPI (citando dados da PNAD 2015)"]
[null,null,"D","Ausência por Acidente de Trabalho (Art. 131, III, da CLT)",{"$f":"'Encargos Sociais'!E28","v":8.9999999999999998E-4},0,null,"* Nota 4 - Utilzada a estatística de 1,96% dos contribuintes beneficiados com a emissão do auxílio, conforme Anuário Estatístico da Previdência Social. Afastamento de 15 dias a cargo da empresa."]
[null,null,"E","Afastamento Maternidade (Art. 71 da Lei nº 8.213/1991)",{"$f":"'Encargos Sociais'!E29","v":3.3E-3},0,null,"* Nota 5 - Utilizada a proporção de 50% para mulheres, 180 dias de afastamento, e a probabilidade de uma trabalhadora requerer a Licença Maternidade em 4,91%, conforme SINAPI (citando dados do IBGE 2016)"]
[null,null,"F","Auxílio Enfermidade - Doença (Art. 59 da Lei nº 8.213/1991)",{"$f":"'Encargos Sociais'!E30","v":7.1000000000000004E-3},0,null,"* Nota 6 - Utilizada a estatística de 3,37% dos contribuintes beneficiados com o auxílio, conforme Anuário Estatístico da Previdência Social de 2015 (acrescidos de 2 dias ao ano, para os quais o trabalhador nem requer o benefício da Previdência - conforme SINAPI)"]
[]
[null,"Submódulo 4.2 - Intrajornada"]
[null,null,"A","Intervalo para repouso ou alimentação",{"$f":"'Encargos Sociais'!E33","v":0},{"$f":"ROUND(E67*$F$16,2)","v":0}]
[]
[null,null,null,"QUADRO-RESUMO DO MÓDULO 4",null,"Valor"]
[null,null,null,"4.1 - Ausências Legais",{"$f":"SUM(E59:E64)","v":0.11089999999999998},{"$f":"ROUND(E70*$F$16,2)","v":0}]
[null,null,null,"4.2 - Intrajornada",{"$f":"E67","v":0},{"$f":"ROUND(E71*$F$16,2)","v":0}]
[]
[null,null,null,"TOTAL DE PREVISÃO PARA RESCISÃO E INTERVALO INTRAJORNADA",null,{"$f":"SUM(F70:F71)","v":0}]
[]
[null,"MÓDULO 5 - INSUMOS DIVERSOS",null,null,null,"Valor"]
[null,null,"A","Uniformes - aquisição",null,{"$f":"ROUND(HLOOKUP($B$5,Uniformes!L4:EA6,3)/12,2)","v":0}]
[null,null,"B","Materiais de consumo relacionados ao posto - aquisição",null,{"$f":"ROUND(HLOOKUP(B5,'Mat Cons'!I11:DX13,3)/12,2)","v":0}]
[null,null,"C","Materiais permanentes relacionados ao posto - remuneração da sua depreciação / manutenção",null,{"$f":"HLOOKUP(B5,'Mat Perm'!Q11:EF13,3)","v":0}]
[null,null,"D","Equipamentos relacionados ao posto - remuneração da sua depreciação / manutenção",null,{"$f":"HLOOKUP(B5,'Equip Rel'!Q11:EF13,3)","v":0}]
[null,null,"E","Equipamentos de Proteção Individual - EPI - aquisição",null,{"$f":"ROUND(HLOOKUP(B5,EPI!J4:DY6,3)/12,2)","v":0}]
[]
[null,null,null,"TOTAL DE INSUMOS DIVERSOS",null,{"$f":"SUM(F76:F81)","v":0},null,"* Nota - Valores mensais por empregado"]
[]
[null,"MÓDULO 6 - CUSTOS INDIRETOS, TRIBUTOS E LUCRO - BDI",null,null,"Percentuais","Valor"]
[null,null,"A","Custos Indiretos",{"$f":"BDI!E6","v":2.7000000000000003E-2}]
[null,null,"A.1","Administração Central",{"$f":"BDI!E7","v":2.1600000000000001E-2}]
[null,null,"A.2","Seguros, Garantias e Riscos",{"$f":"BDI!E8","v":5.4000000000000003E-3}]
[null,null,"B","Lucro",{"$f":"BDI!E10","v":3.3399999999999999E-2}]
[null,null,"C","Tributos",{"$f":"SUM(E90:E91)","v":0.124}]
[null,null,"C.1","Tributos Federais (COFINS, PIS e CPRB)",{"$f":"BDI!E18","v":7.3999999999999996E-2}]
[null,null,"C.2","Tributos Distritais (ISS)",{"$f":"BDI!E23","v":0.05},null,null,"* Nota - Utilizou-se o indicado pelo Sindicato da Arquitetura e da Engenharia (Sinaenco, 2008, p. 22), que adota um percentual redutor de 20% no cálculo dos custos tributários relativos às contribuições PIS e COFINS"]
[null,null,"D","Despesas Financeiras",{"$f":"BDI!E13","v":4.4669210982628549E-3}]
[]
[null,null,null,"TOTAL DE BDI",{"$f":"BDI!E26","v":0.21690000000000001},{"$f":"E94*E102","v":0}]
[]
[null,null,null,"QUADRO-RESUMO DO CUSTO MENSAL POR EMPREGADO - SEM O 13º","Valor"]
[null,null,null,"Módulo 1 - Composição da Remuneração",{"$f":"F16","v":0}]
[null,null,null,"Módulo 2 - Encargos e Benefícios Anuais, Mensais e Diários",{"$f":"F45","v":0}]
[null,null,null,"Módulo 3 - Provisão para Rescisão",{"$f":"F55","v":0}]
[null,null,null,"Módulo 4 - Custo de Reposição do Profissional Ausente",{"$f":"F73","v":0}]
[null,null,null,"Módulo 5 - Insumos Diversos",{"$f":"F82","v":0}]
[null,null,null,"SUBTOTAL (A+B+C+D+E)",{"$f":"SUM(E97:E101)","v":0}]
[null,null,null,"Módulo 6 - Custos Indiretos, Tributos e Lucro",{"$f":"F94","v":0}]
[]
[null,null,null,"TOTAL DO POSTO",{"$f":"SUM(E102:E103)","v":0}]
[]
[null,"MÓDULO 7 - DESTAQUE DO MÓDULO 2 - 13º SALÁRIO",null,null,"Percentuais","Valor"]
[null,null,"A","13º Salário",{"$f":"'Encargos Sociais'!E32","v":8.3299999999999999E-2},{"$f":"ROUND(E108*F$16,2)","v":0}]
[null,null,"B","Encargos Sociais sobre o 13º Salário - Taxa calculada no SUBMÓDULO 2.2",{"$f":"SUM($E$24:$E$32)","v":0.36800000000000005},{"$f":"ROUND(E109*$F$108,2)","v":0},null,"* Nota 1 - Provisiona-se, mensalmente, o proporcional a 1/12 dos valores referentes a gratificação natalina e adicional de férias."]
[null,null,"C","BDI sobre o 13º Salário - Taxa calculada no MÓDULO 6",{"$f":"E94","v":0.21690000000000001},{"$f":"ROUND(E110*($F$108+$F$109),2)","v":0}]
[]
[null,null,null,"TOTAL DO DESTAQUE DO 13º SALÁRIO",null,{"$f":"SUM(F108:F110)","v":0}]
[]
[null,null,null,"QUADRO-RESUMO DO CUSTO MENSAL POR EMPREGADO","Valor"]
[null,null,null,"Custo total - sem o 13º Salário",{"$f":"E105","v":0}]
[null,null,null,"Destaque do 13º Salário (valor mensal)",{"$f":"F112","v":0}]
[]
[null,null,null,"TOTAL DO POSTO",{"$f":"E115+E116","v":0}]

{"sheet":"8","index":11,"n_rows":118,"n_cols":8,"rows_kept":118,"cut":false,"hidden":true,"merged":[[17,1,17,3],[1,1,1,5],[2,1,2,5],[4,1,4,2],[5,1,5,2],[7,1,7,3],[106,1,106,3],[39,3,39,5],[46,1,46,3],[56,1,56,3],[68,3,68,5],[74,1,74,3],[83,1,83,3]]}
[]
[null,"PLANILHA DE ESTIMATIVA DE CUSTOS"]
[null,"Padrão IN 05/2017 e IN 07/2018 - MPDG"]
[]
[null,8,null,{"$f":"HLOOKUP($B$5,'Dados Gerais'!$D$5:$BK$20,6)","v":0},"QUANTIDADE",{"$f":"HLOOKUP($B$5,'Dados Gerais'!$D$5:$BK$20,10)","v":0}]
[null,"CCT",null,{"$f":"HLOOKUP($B$5,'Dados Gerais'!$D$5:$BK$20,15)","v":0},"DATA-BASE",{"$f":"HLOOKUP($B$5,'Dados Gerais'!$D$5:$BK$20,16)","v":"00:00:00"}]
[]
[null,"MÓDULO 1 - COMPOSIÇÃO DA REMUNERAÇÃO",null,null,null,"Valor"]
[null,null,"A","Salário-Base",null,{"$f":"HLOOKUP($B$5,'Dados Gerais'!$D$5:$BK$20,8)","v":0}]
[null,null,"B","Adicional de Periculosidade",null,{"$f":"HLOOKUP($B$5,'Dados Gerais'!$D$5:$BK$37,25)","v":0}]
[null,null,"C","Adicional de Insalubridade",null,{"$f":"HLOOKUP($B$5,'Dados Gerais'!$D$5:$BK$37,31)","v":0}]
[null,null,"D","Adicional Noturno",null,{"$f":"HLOOKUP($B$5,'Dados Gerais'!$D$5:$BK$50,46)","v":0},null,"* Nota 1 - O Módulo 1 refere-se ao valor mensal devido ao empregado pela prestação do serviço no período de 12 meses."]
[null,null,"E","Adicional de Hora Extra",null,{"$f":"HLOOKUP($B$5,'Dados Gerais'!$D$5:$BK$67,63)","v":0},null,"* Nota 2 - O adicional de hora extra no feriado trabalhado foi suprimido pela Lei 13.467/17"]
[null,null,"F","Outros (especificar)",null,{"$f":"HLOOKUP($B$5,'Dados Gerais'!$D$5:$BK$59,33)","v":0},null,"* Nota 3 - ART. 7º, § 2º, DA LEI Nº 605/49.Sendo mensalista o obreiro, o adicional noturno pago de forma fixa já é considerado integrado para os efeitos do pagamento do repouso semanal remunerado, nos termos do art. 7º, § 2º, da Lei nº 605/49."]
[]
[null,null,null,"TOTAL DA REMUNERAÇÃO",null,{"$f":"SUM(F9:F14)","v":0}]
[]
[null,"MÓDULO 2 - ENCARGOS E BENEFÍCIOS ANUAIS, MENSAIS E DIÁRIOS",null,null,"Percentuais","Valor"]
[null,"Submódulo 2.1 - 13º Salário, Férias e Adicional de Férias"]
[null,null,"A","13º Salário - Calculado no Módulo 7 - Destacado",0,{"$f":"ROUND(E20*F$16,2)","v":0}]
[null,null,"B","Férias e Adicional de Férias",{"$f":"'Encargos Sociais'!E31","v":3.0300000000000001E-2},{"$f":"ROUND(E21*F$16,2)","v":0},null,"* Nota 1 - Provisiona-se, mensalmente, o proporcional a 1/12 dos valores referentes a gratificação natalina, férias e adicional de férias."]
[null,null,null,null,null,null,null,"* Nota 2 - O adicional de férias contido no Submódulo 2.1 corresponde a 1/3 da remuneração que, por sua vez, é dividida por 12 contome Nota 1."]
[null,"Submódulo 2.2 - Encargos Previdenciários (GPS), Fundo de Garantia por Tempo de Serviço (FGTS) e Outras Contribuições"]
[null,null,"A","INSS (art. 22, inciso I, Lei nº 8.212/91)",{"$f":"'Encargos Sociais'!E14","v":0.2},{"$f":"ROUND(E24*($F$16+$F$41+$F$73),2)","v":0}]
[null,null,"B","Salário Educação (art. 3º, inciso I, Decreto nº 87.043/82)",{"$f":"'Encargos Sociais'!E15","v":2.5000000000000001E-2},{"$f":"ROUND(E25*($F$16+$F$41+$F$73),2)","v":0}]
[null,null,"C","SAT/RAT (art. 22, II, Lei 8.212/91 e Anexo V, Decreto 6.042/07) - Enquadramento 8211-3/00",{"$f":"'Encargos Sociais'!E16","v":0.03},0]
[null,null,"D","SESC ou SESI (art. 30, Lei nº 8.036/90 e art. 1º, Lei 8.154/90)",{"$f":"'Encargos Sociais'!E17","v":1.4999999999999999E-2},0]
[null,null,"E","SENAI ou SENAC (Decreto nº 2.318/86)",{"$f":"'Encargos Sociais'!E18","v":0.01},0]
[null,null,"F","SEBRAE (§ 3º, art. 8º, Lei 8.029/90, alterada pela Lei nº 8.154/90)",{"$f":"'Encargos Sociais'!E19","v":6.0000000000000001E-3},0]
[null,null,"G","INCRA (art. 1º, I, Decreto Lei 1.146/70 e Lei 7.787, de 30/06/89)",{"$f":"'Encargos Sociais'!E20","v":2E-3},0,null,"* Nota 1 - Os percentuais dos encargos previdenciários, do FGTS e demais contribuições são estabelecidos por legislação vigente."]
[null,null,"H","FGTS (Lei Complementar nº 110/01 e art. 30, Lei nº 8.036/90)",{"$f":"'Encargos Sociais'!E21","v":0.08},0,null,"* Nota 2 - O SAT, a depender do grau de risco do serviço, irá variar entre 1%, para risco leve, de 2%, para risco médio, e de 3% para risco grave."]
[null,null,"I","SECONCI (Convenções Coletivas de Trabalho da construção)",{"$f":"'Encargos Sociais'!E22","v":0},0,null,"* Nota 3 - Os percentuais do Submódulo 2.2 incidem sobre o Módulo 1 e o Submódulo 2.1."]
[]
[null,"Submódulo 2.3 - Benefícios Mensais e Diários"]
[null,null,"A","Auxílio Transporte",null,{"$f":"HLOOKUP($B$5,'Dados Gerais'!$D$5:$BK$93,82)","v":0}]
[null,null,"B","Auxílio Alimentação",null,{"$f":"HLOOKUP($B$5,'Dados Gerais'!$D$5:$BK$93,89)","v":0}]
[null,null,"C","Assistência Médica e Familiar",null,{"$f":"HLOOKUP($B$5,'Dados Gerais'!$D$5:$BK$101,97)","v":0}]
[null,null,"D","Outros (Seguro de vida e auxílio funeral e auxílio odontológico)",null,{"$f":"HLOOKUP($B$5,'Dados Gerais'!$D$5:$BK$118,114)","v":0},null,"* Nota 1 - O valor informado deverá ser o custo real do benefício (descontado o valor eventualmente pago pelo empregado)."]
[null,null,null,null,null,null,null,"* Nota 2 - Observar a previsão dos benefícios contidos em Acordos, Convenções e Dissídios Coletivos de Trabalho e o disposto no art. 6º da IN 5/2017"]
[null,null,null,"QUADRO-RESUMO DO MÓDULO 2"]
[null,null,null,"2.1 - 13º Salário, Férias e Adicional de Férias - 13º Destacado - Calculado no Módulo 7 ",{"$f":"SUM(E20:E21)","v":3.0300000000000001E-2},{"$f":"F20+F21","v":0}]
[null,null,null,"2.2 - Encargos Previdenciários (GPS), Fundo de Garantia por Tempo de Serviço (FGTS) e Contribuições",{"$f":"SUM(E24:E32)","v":0.36800000000000005},{"$f":"SUM(F24:F32)","v":0}]
[null,null,null,"2.3 - Benefícios Mensais e Diários",null,{"$f":"SUM(F35:F38)","v":0}]
[]
[null,null,null,"TOTAL DOS ENCARGOS E BENEFÍCIOS",null,{"$f":"SUM(F41:F43)","v":0}]
[]
[null,"MÓDULO 3 - PREVISÃO PARA RESCISÃO",null,null,"Percentuais","Valor"]
[null,null,"A","Aviso Prévio Indenizado (Art. 7º, inciso XXI, da CF/1988 e arts. 477, 487, §1º, e 491 da CLT)",{"$f":"'Encargos Sociais'!E36","v":8.3000000000000001E-3},{"$f":"ROUND(E48*$F$16,2)","v":0}]
[null,null,"B","Incidência do FGTS sobre o Aviso Prévio Indenizado (Súmula 305 TST)",{"$f":"'Encargos Sociais'!E37","v":6.9999999999999999E-4},0,null,"* Nota 1 - Adotou-se os parâmetros do estudo do STF (http://www.stf.jus.br/arquivo/cms/sobrestfestudosci/anexo/encargos_sociais_03102007.pdf), onde 5% do pessoal é demitido pelo empregador no decurso do contrato (para estes, considerou-se o aviso prévio indenizado). Desprezou-se as demissões por justa causa e os pedidos de demissão."]
[null,null,"C","Multa do FGTS e Contribuição Social sobre o Aviso Prévio Indenizado (Art. 18, §1º, da Lei 8.036/1990 e art. 1º da LC nº 110/2001)",{"$f":"'Encargos Sociais'!E38","v":3.8E-3},0,null,"* Nota 2 - No cálculo do percentual, considerou-se 36 dias, correspondendo à metade da duração média dos contratos (2 anos)"]
[null,null,"D","Aviso Prévio Trabalhado (Art. 488, parágrafo único, CLT)",{"$f":"'Encargos Sociais'!E39","v":1.2E-2},0,null,"* Nota 3 - Incide sobre a Remuneração + 13º salário (1/12) + Férias (1/12) + Adicional de Férias (1/36) x 50% multa (40% para o empregado e 10% de contribuição social) x 8% FGTS"]
[null,null,"E","Incidência de GPS, FGTS e outras contribuições sobre o Aviso Prévio Trabalhado",{"$f":"'Encargos Sociais'!E40","v":4.4000000000000003E-3},0,null,"* Nota 4 - Os 95% restantes do cálculo, a um prazo médio de contrato de 4 anos. Assim, calcula-se 7 dias para o 1º ano de contrato e mais 3 dias para os 3 anos seguintes."]
[null,null,"F","Multa do FGTS e Contribuição Social sobre o Aviso Prévio Trabalhado",{"$f":"'Encargos Sociais'!E41","v":3.44E-2},0]
[]
[null,null,null,"TOTAL DE PREVISÃO PARA RESCISÃO",null,{"$f":"SUM(F48:F53)","v":0}]
[]
[null,"MÓDULO 4 - CUSTO DO PROFISSIONAL AUSENTE",null,null,"Percentuais","Valor"]
[null,"Submódulo 4.1 - Ausências Legais"]
[null,null,"A","Férias (Arts. 129 e 130, inc. I, da CLT)",{"$f":"'Encargos Sociais'!E25","v":9.0899999999999995E-2},{"$f":"ROUND(E59*$F$16,2)","v":0},null,"* Nota 1 - As alíneas “A” a “F” referem-se somente ao custo que será pago ao repositor pelos dias \ntrabalhados quando da necessidade de substituir a mão de obra alocada na prestação do serviço."]
[null,null,"B","Ausências Legais (Arts. 131 e 473 da CLT)",{"$f":"'Encargos Sociais'!E26","v":7.9000000000000008E-3},0,null,"* Nota 2 - Adotou-se a estimativa do SINAPI de 2 dias por ano."]
[null,null,"C","Licença-Paternidade (Art. 7º, XIX, e art. 10, §1º, do ADCT, CF/1988 e Art. 1º, II, da Lei 11.770/2008)",{"$f":"'Encargos Sociais'!E27","v":8.0000000000000004E-4},0,null,"* Nota 3 - Utilizada a proporção de 50% para homens, 5 dias de afastamento, e a probabilidade de um trabalhador requerer a Licença Paternidade em 5,22%, conforme SINAPI (citando dados da PNAD 2015)"]
[null,null,"D","Ausência por Acidente de Trabalho (Art. 131, III, da CLT)",{"$f":"'Encargos Sociais'!E28","v":8.9999999999999998E-4},0,null,"* Nota 4 - Utilzada a estatística de 1,96% dos contribuintes beneficiados com a emissão do auxílio, conforme Anuário Estatístico da Previdência Social. Afastamento de 15 dias a cargo da empresa."]
[null,null,"E","Afastamento Maternidade (Art. 71 da Lei nº 8.213/1991)",{"$f":"'Encargos Sociais'!E29","v":3.3E-3},0,null,"* Nota 5 - Utilizada a proporção de 50% para mulheres, 180 dias de afastamento, e a probabilidade de uma trabalhadora requerer a Licença Maternidade em 4,91%, conforme SINAPI (citando dados do IBGE 2016)"]
[null,null,"F","Auxílio Enfermidade - Doença (Art. 59 da Lei nº 8.213/1991)",{"$f":"'Encargos Sociais'!E30","v":7.1000000000000004E-3},0,null,"* Nota 6 - Utilizada a estatística de 3,37% dos contribuintes beneficiados com o auxílio, conforme Anuário Estatístico da Previdência Social de 2015 (acrescidos de 2 dias ao ano, para os quais o trabalhador nem requer o benefício da Previdência - conforme SINAPI)"]
[]
[null,"Submódulo 4.2 - Intrajornada"]
[null,null,"A","Intervalo para repouso ou alimentação",{"$f":"'Encargos Sociais'!E33","v":0},{"$f":"ROUND(E67*$F$16,2)","v":0}]
[]
[null,null,null,"QUADRO-RESUMO DO MÓDULO 4",null,"Valor"]
[null,null,null,"4.1 - Ausências Legais",{"$f":"SUM(E59:E64)","v":0.11089999999999998},{"$f":"ROUND(E70*$F$16,2)","v":0}]
[null,null,null,"4.2 - Intrajornada",{"$f":"E67","v":0},{"$f":"ROUND(E71*$F$16,2)","v":0}]
[]
[null,null,null,"TOTAL DE PREVISÃO PARA RESCISÃO E INTERVALO INTRAJORNADA",null,{"$f":"SUM(F70:F71)","v":0}]
[]
[null,"MÓDULO 5 - INSUMOS DIVERSOS",null,null,null,"Valor"]
[null,null,"A","Uniformes - aquisição",null,{"$f":"ROUND(HLOOKUP($B$5,Uniformes!L4:EA6,3)/12,2)","v":0}]
[null,null,"B","Materiais de consumo relacionados ao posto - aquisição",null,{"$f":"ROUND(HLOOKUP(B5,'Mat Cons'!I11:DX13,3)/12,2)","v":0}]
[null,null,"C","Materiais permanentes relacionados ao posto - remuneração da sua depreciação / manutenção",null,{"$f":"HLOOKUP(B5,'Mat Perm'!Q11:EF13,3)","v":0}]
[null,null,"D","Equipamentos relacionados ao posto - remuneração da sua depreciação / manutenção",null,{"$f":"HLOOKUP(B5,'Equip Rel'!Q11:EF13,3)","v":0}]
[null,null,"E","Equipamentos de Proteção Individual - EPI - aquisição",null,{"$f":"ROUND(HLOOKUP(B5,EPI!J4:DY6,3)/12,2)","v":0}]
[]
[null,null,null,"TOTAL DE INSUMOS DIVERSOS",null,{"$f":"SUM(F76:F81)","v":0},null,"* Nota - Valores mensais por empregado"]
[]
[null,"MÓDULO 6 - CUSTOS INDIRETOS, TRIBUTOS E LUCRO - BDI",null,null,"Percentuais","Valor"]
[null,null,"A","Custos Indiretos",{"$f":"BDI!E6","v":2.7000000000000003E-2}]
[null,null,"A.1","Administração Central",{"$f":"BDI!E7","v":2.1600000000000001E-2}]
[null,null,"A.2","Seguros, Garantias e Riscos",{"$f":"BDI!E8","v":5.4000000000000003E-3}]
[null,null,"B","Lucro",{"$f":"BDI!E10","v":3.3399999999999999E-2}]
[null,null,"C","Tributos",{"$f":"SUM(E90:E91)","v":0.124}]
[null,null,"C.1","Tributos Federais (COFINS, PIS e CPRB)",{"$f":"BDI!E18","v":7.3999999999999996E-2}]
[null,null,"C.2","Tributos Distritais (ISS)",{"$f":"BDI!E23","v":0.05},null,null,"* Nota - Utilizou-se o indicado pelo Sindicato da Arquitetura e da Engenharia (Sinaenco, 2008, p. 22), que adota um percentual redutor de 20% no cálculo dos custos tributários relativos às contribuições PIS e COFINS"]
[null,null,"D","Despesas Financeiras",{"$f":"BDI!E13","v":4.4669210982628549E-3}]
[]
[null,null,null,"TOTAL DE BDI",{"$f":"BDI!E26","v":0.21690000000000001},{"$f":"E94*E102","v":0}]
[]
[null,null,null,"QUADRO-RESUMO DO CUSTO MENSAL POR EMPREGADO - SEM O 13º","Valor"]
[null,null,null,"Módulo 1 - Composição da Remuneração",{"$f":"F16","v":0}]
[null,null,null,"Módulo 2 - Encargos e Benefícios Anuais, Mensais e Diários",{"$f":"F45","v":0}]
[null,null,null,"Módulo 3 - Provisão para Rescisão",{"$f":"F55","v":0}]
[null,null,null,"Módulo 4 - Custo de Reposição do Profissional Ausente",{"$f":"F73","v":0}]
[null,null,null,"Módulo 5 - Insumos Diversos",{"$f":"F82","v":0}]
[null,null,null,"SUBTOTAL (A+B+C+D+E)",{"$f":"SUM(E97:E101)","v":0}]
[null,null,null,"Módulo 6 - Custos Indiretos, Tributos e Lucro",{"$f":"F94","v":0}]
[]
[null,null,null,"TOTAL DO POSTO",{"$f":"SUM(E102:E103)","v":0}]
[]
[null,"MÓDULO 7 - DESTAQUE DO MÓDULO 2 - 13º SALÁRIO",null,null,"Percentuais","Valor"]
[null,null,"A","13º Salário",{"$f":"'Encargos Sociais'!E32","v":8.3299999999999999E-2},{"$f":"ROUND(E108*F$16,2)","v":0}]
[null,null,"B","Encargos Sociais sobre o 13º Salário - Taxa calculada no SUBMÓDULO 2.2",{"$f":"SUM($E$24:$E$32)","v":0.36800000000000005},{"$f":"ROUND(E109*$F$108,2)","v":0},null,"* Nota 1 - Provisiona-se, mensalmente, o proporcional a 1/12 dos valores referentes a gratificação natalina e adicional de férias."]
[null,null,"C","BDI sobre o 13º Salário - Taxa calculada no MÓDULO 6",{"$f":"E94","v":0.21690000000000001},{"$f":"ROUND(E110*($F$108+$F$109),2)","v":0}]
[]
[null,null,null,"TOTAL DO DESTAQUE DO 13º SALÁRIO",null,{"$f":"SUM(F108:F110)","v":0}]
[]
[null,null,null,"QUADRO-RESUMO DO CUSTO MENSAL POR EMPREGADO","Valor"]
[null,null,null,"Custo total - sem o 13º Salário",{"$f":"E105","v":0}]
[null,null,null,"Destaque do 13º Salário (valor mensal)",{"$f":"F112","v":0}]
[]
[null,null,null,"TOTAL DO POSTO",{"$f":"E115+E116","v":0}]

{"sheet":"9","index":12,"n_rows":118,"n_cols":8,"rows_kept":118,"cut":false,"hidden":true,"merged":[[17,1,17,3],[1,1,1,5],[2,1,2,5],[4,1,4,2],[5,1,5,2],[7,1,7,3],[106,1,106,3],[39,3,39,5],[46,1,46,3],[56,1,56,3],[68,3,68,5],[74,1,74,3],[83,1,83,3]]}
[]
[null,"PLANILHA DE ESTIMATIVA DE CUSTOS"]
[null,"Padrão IN 05/2017 e IN 07/2018 - MPDG"]
[]
[null,9,null,{"$f":"HLOOKUP($B$5,'Dados Gerais'!$D$5:$BK$20,6)","v":0},"QUANTIDADE",{"$f":"HLOOKUP($B$5,'Dados Gerais'!$D$5:$BK$20,10)","v":0}]
[null,"CCT",null,{"$f":"HLOOKUP($B$5,'Dados Gerais'!$D$5:$BK$20,15)","v":0},"DATA-BASE",{"$f":"HLOOKUP($B$5,'Dados Gerais'!$D$5:$BK$20,16)","v":"00:00:00"}]
[]
[null,"MÓDULO 1 - COMPOSIÇÃO DA REMUNERAÇÃO",null,null,null,"Valor"]
[null,null,"A","Salário-Base",null,{"$f":"HLOOKUP($B$5,'Dados Gerais'!$D$5:$BK$20,8)","v":0}]
[null,null,"B","Adicional de Periculosidade",null,{"$f":"HLOOKUP($B$5,'Dados Gerais'!$D$5:$BK$37,25)","v":0}]
[null,null,"C","Adicional de Insalubridade",null,{"$f":"HLOOKUP($B$5,'Dados Gerais'!$D$5:$BK$37,31)","v":0}]
[null,null,"D","Adicional Noturno",null,{"$f":"HLOOKUP($B$5,'Dados Gerais'!$D$5:$BK$50,46)","v":0},null,"* Nota 1 - O Módulo 1 refere-se ao valor mensal devido ao empregado pela prestação do serviço no período de 12 meses."]
[null,null,"E","Adicional de Hora Extra",null,{"$f":"HLOOKUP($B$5,'Dados Gerais'!$D$5:$BK$67,63)","v":0},null,"* Nota 2 - O adicional de hora extra no feriado trabalhado foi suprimido pela Lei 13.467/17"]
[null,null,"F","Outros (especificar)",null,{"$f":"HLOOKUP($B$5,'Dados Gerais'!$D$5:$BK$59,33)","v":0},null,"* Nota 3 - ART. 7º, § 2º, DA LEI Nº 605/49.Sendo mensalista o obreiro, o adicional noturno pago de forma fixa já é considerado integrado para os efeitos do pagamento do repouso semanal remunerado, nos termos do art. 7º, § 2º, da Lei nº 605/49."]
[]
[null,null,null,"TOTAL DA REMUNERAÇÃO",null,{"$f":"SUM(F9:F14)","v":0}]
[]
[null,"MÓDULO 2 - ENCARGOS E BENEFÍCIOS ANUAIS, MENSAIS E DIÁRIOS",null,null,"Percentuais","Valor"]
[null,"Submódulo 2.1 - 13º Salário, Férias e Adicional de Férias"]
[null,null,"A","13º Salário - Calculado no Módulo 7 - Destacado",0,{"$f":"ROUND(E20*F$16,2)","v":0}]
[null,null,"B","Férias e Adicional de Férias",{"$f":"'Encargos Sociais'!E31","v":3.0300000000000001E-2},{"$f":"ROUND(E21*F$16,2)","v":0},null,"* Nota 1 - Provisiona-se, mensalmente, o proporcional a 1/12 dos valores referentes a gratificação natalina, férias e adicional de férias."]
[null,null,null,null,null,null,null,"* Nota 2 - O adicional de férias contido no Submódulo 2.1 corresponde a 1/3 da remuneração que, por sua vez, é dividida por 12 contome Nota 1."]
[null,"Submódulo 2.2 - Encargos Previdenciários (GPS), Fundo de Garantia por Tempo de Serviço (FGTS) e Outras Contribuições"]
[null,null,"A","INSS (art. 22, inciso I, Lei nº 8.212/91)",{"$f":"'Encargos Sociais'!E14","v":0.2},{"$f":"ROUND(E24*($F$16+$F$41+$F$73),2)","v":0}]
[null,null,"B","Salário Educação (art. 3º, inciso I, Decreto nº 87.043/82)",{"$f":"'Encargos Sociais'!E15","v":2.5000000000000001E-2},{"$f":"ROUND(E25*($F$16+$F$41+$F$73),2)","v":0}]
[null,null,"C","SAT/RAT (art. 22, II, Lei 8.212/91 e Anexo V, Decreto 6.042/07) - Enquadramento 8211-3/00",{"$f":"'Encargos Sociais'!E16","v":0.03},0]
[null,null,"D","SESC ou SESI (art. 30, Lei nº 8.036/90 e art. 1º, Lei 8.154/90)",{"$f":"'Encargos Sociais'!E17","v":1.4999999999999999E-2},0]
[null,null,"E","SENAI ou SENAC (Decreto nº 2.318/86)",{"$f":"'Encargos Sociais'!E18","v":0.01},0]
[null,null,"F","SEBRAE (§ 3º, art. 8º, Lei 8.029/90, alterada pela Lei nº 8.154/90)",{"$f":"'Encargos Sociais'!E19","v":6.0000000000000001E-3},0]
[null,null,"G","INCRA (art. 1º, I, Decreto Lei 1.146/70 e Lei 7.787, de 30/06/89)",{"$f":"'Encargos Sociais'!E20","v":2E-3},0,null,"* Nota 1 - Os percentuais dos encargos previdenciários, do FGTS e demais contribuições são estabelecidos por legislação vigente."]
[null,null,"H","FGTS (Lei Complementar nº 110/01 e art. 30, Lei nº 8.036/90)",{"$f":"'Encargos Sociais'!E21","v":0.08},0,null,"* Nota 2 - O SAT, a depender do grau de risco do serviço, irá variar entre 1%, para risco leve, de 2%, para risco médio, e de 3% para risco grave."]
[null,null,"I","SECONCI (Convenções Coletivas de Trabalho da construção)",{"$f":"'Encargos Sociais'!E22","v":0},0,null,"* Nota 3 - Os percentuais do Submódulo 2.2 incidem sobre o Módulo 1 e o Submódulo 2.1."]
[]
[null,"Submódulo 2.3 - Benefícios Mensais e Diários"]
[null,null,"A","Auxílio Transporte",null,{"$f":"HLOOKUP($B$5,'Dados Gerais'!$D$5:$BK$93,82)","v":0}]
[null,null,"B","Auxílio Alimentação",null,{"$f":"HLOOKUP($B$5,'Dados Gerais'!$D$5:$BK$93,89)","v":0}]
[null,null,"C","Assistência Médica e Familiar",null,{"$f":"HLOOKUP($B$5,'Dados Gerais'!$D$5:$BK$101,97)","v":0}]
[null,null,"D","Outros (Seguro de vida e auxílio funeral e auxílio odontológico)",null,{"$f":"HLOOKUP($B$5,'Dados Gerais'!$D$5:$BK$118,114)","v":0},null,"* Nota 1 - O valor informado deverá ser o custo real do benefício (descontado o valor eventualmente pago pelo empregado)."]
[null,null,null,null,null,null,null,"* Nota 2 - Observar a previsão dos benefícios contidos em Acordos, Convenções e Dissídios Coletivos de Trabalho e o disposto no art. 6º da IN 5/2017"]
[null,null,null,"QUADRO-RESUMO DO MÓDULO 2"]
[null,null,null,"2.1 - 13º Salário, Férias e Adicional de Férias - 13º Destacado - Calculado no Módulo 7 ",{"$f":"SUM(E20:E21)","v":3.0300000000000001E-2},{"$f":"F20+F21","v":0}]
[null,null,null,"2.2 - Encargos Previdenciários (GPS), Fundo de Garantia por Tempo de Serviço (FGTS) e Contribuições",{"$f":"SUM(E24:E32)","v":0.36800000000000005},{"$f":"SUM(F24:F32)","v":0}]
[null,null,null,"2.3 - Benefícios Mensais e Diários",null,{"$f":"SUM(F35:F38)","v":0}]
[]
[null,null,null,"TOTAL DOS ENCARGOS E BENEFÍCIOS",null,{"$f":"SUM(F41:F43)","v":0}]
[]
[null,"MÓDULO 3 - PREVISÃO PARA RESCISÃO",null,null,"Percentuais","Valor"]
[null,null,"A","Aviso Prévio Indenizado (Art. 7º, inciso XXI, da CF/1988 e arts. 477, 487, §1º, e 491 da CLT)",{"$f":"'Encargos Sociais'!E36","v":8.3000000000000001E-3},{"$f":"ROUND(E48*$F$16,2)","v":0}]
[null,null,"B","Incidência do FGTS sobre o Aviso Prévio Indenizado (Súmula 305 TST)",{"$f":"'Encargos Sociais'!E37","v":6.9999999999999999E-4},0,null,"* Nota 1 - Adotou-se os parâmetros do estudo do STF (http://www.stf.jus.br/arquivo/cms/sobrestfestudosci/anexo/encargos_sociais_03102007.pdf), onde 5% do pessoal é demitido pelo empregador no decurso do contrato (para estes, considerou-se o aviso prévio indenizado). Desprezou-se as demissões por justa causa e os pedidos de demissão."]
[null,null,"C","Multa do FGTS e Contribuição Social sobre o Aviso Prévio Indenizado (Art. 18, §1º, da Lei 8.036/1990 e art. 1º da LC nº 110/2001)",{"$f":"'Encargos Sociais'!E38","v":3.8E-3},0,null,"* Nota 2 - No cálculo do percentual, considerou-se 36 dias, correspondendo à metade da duração média dos contratos (2 anos)"]
[null,null,"D","Aviso Prévio Trabalhado (Art. 488, parágrafo único, CLT)",{"$f":"'Encargos Sociais'!E39","v":1.2E-2},0,null,"* Nota 3 - Incide sobre a Remuneração + 13º salário (1/12) + Férias (1/12) + Adicional de Férias (1/36) x 50% multa (40% para o empregado e 10% de contribuição social) x 8% FGTS"]
[null,null,"E","Incidência de GPS, FGTS e outras contribuições sobre o Aviso Prévio Trabalhado",{"$f":"'Encargos Sociais'!E40","v":4.4000000000000003E-3},0,null,"* Nota 4 - Os 95% restantes do cálculo, a um prazo médio de contrato de 4 anos. Assim, calcula-se 7 dias para o 1º ano de contrato e mais 3 dias para os 3 anos seguintes."]
[null,null,"F","Multa do FGTS e Contribuição Social sobre o Aviso Prévio Trabalhado",{"$f":"'Encargos Sociais'!E41","v":3.44E-2},0]
[]
[null,null,null,"TOTAL DE PREVISÃO PARA RESCISÃO",null,{"$f":"SUM(F48:F53)","v":0}]
[]
[null,"MÓDULO 4 - CUSTO DO PROFISSIONAL AUSENTE",null,null,"Percentuais","Valor"]
[null,"Submódulo 4.1 - Ausências Legais"]
[null,null,"A","Férias (Arts. 129 e 130, inc. I, da CLT)",{"$f":"'Encargos Sociais'!E25","v":9.0899999999999995E-2},{"$f":"ROUND(E59*$F$16,2)","v":0},null,"* Nota 1 - As alíneas “A” a “F” referem-se somente ao custo que será pago ao repositor pelos dias \ntrabalhados quando da necessidade de substituir a mão de obra alocada na prestação do serviço."]
[null,null,"B","Ausências Legais (Arts. 131 e 473 da CLT)",{"$f":"'Encargos Sociais'!E26","v":7.9000000000000008E-3},0,null,"* Nota 2 - Adotou-se a estimativa do SINAPI de 2 dias por ano."]
[null,null,"C","Licença-Paternidade (Art. 7º, XIX, e art. 10, §1º, do ADCT, CF/1988 e Art. 1º, II, da Lei 11.770/2008)",{"$f":"'Encargos Sociais'!E27","v":8.0000000000000004E-4},0,null,"* Nota 3 - Utilizada a proporção de 50% para homens, 5 dias de afastamento, e a probabilidade de um trabalhador requerer a Licença Paternidade em 5,22%, conforme SINAPI (citando dados da PNAD 2015)"]
[null,null,"D","Ausência por Acidente de Trabalho (Art. 131, III, da CLT)",{"$f":"'Encargos Sociais'!E28","v":8.9999999999999998E-4},0,null,"* Nota 4 - Utilzada a estatística de 1,96% dos contribuintes beneficiados com a emissão do auxílio, conforme Anuário Estatístico da Previdência Social. Afastamento de 15 dias a cargo da empresa."]
[null,null,"E","Afastamento Maternidade (Art. 71 da Lei nº 8.213/1991)",{"$f":"'Encargos Sociais'!E29","v":3.3E-3},0,null,"* Nota 5 - Utilizada a proporção de 50% para mulheres, 180 dias de afastamento, e a probabilidade de uma trabalhadora requerer a Licença Maternidade em 4,91%, conforme SINAPI (citando dados do IBGE 2016)"]
[null,null,"F","Auxílio Enfermidade - Doença (Art. 59 da Lei nº 8.213/1991)",{"$f":"'Encargos Sociais'!E30","v":7.1000000000000004E-3},0,null,"* Nota 6 - Utilizada a estatística de 3,37% dos contribuintes beneficiados com o auxílio, conforme Anuário Estatístico da Previdência Social de 2015 (acrescidos de 2 dias ao ano, para os quais o trabalhador nem requer o benefício da Previdência - conforme SINAPI)"]
[]
[null,"Submódulo 4.2 - Intrajornada"]
[null,null,"A","Intervalo para repouso ou alimentação",{"$f":"'Encargos Sociais'!E33","v":0},{"$f":"ROUND(E67*$F$16,2)","v":0}]
[]
[null,null,null,"QUADRO-RESUMO DO MÓDULO 4",null,"Valor"]
[null,null,null,"4.1 - Ausências Legais",{"$f":"SUM(E59:E64)","v":0.11089999999999998},{"$f":"ROUND(E70*$F$16,2)","v":0}]
[null,null,null,"4.2 - Intrajornada",{"$f":"E67","v":0},{"$f":"ROUND(E71*$F$16,2)","v":0}]
[]
[null,null,null,"TOTAL DE PREVISÃO PARA RESCISÃO E INTERVALO INTRAJORNADA",null,{"$f":"SUM(F70:F71)","v":0}]
[]
[null,"MÓDULO 5 - INSUMOS DIVERSOS",null,null,null,"Valor"]
[null,null,"A","Uniformes - aquisição",null,{"$f":"ROUND(HLOOKUP($B$5,Uniformes!L4:EA6,3)/12,2)","v":0}]
[null,null,"B","Materiais de consumo relacionados ao posto - aquisição",null,{"$f":"ROUND(HLOOKUP(B5,'Mat Cons'!I11:DX13,3)/12,2)","v":0}]
[null,null,"C","Materiais permanentes relacionados ao posto - remuneração da sua depreciação / manutenção",null,{"$f":"HLOOKUP(B5,'Mat Perm'!Q11:EF13,3)","v":0}]
[null,null,"D","Equipamentos relacionados ao posto - remuneração da sua depreciação / manutenção",null,{"$f":"HLOOKUP(B5,'Equip Rel'!Q11:EF13,3)","v":0}]
[null,null,"E","Equipamentos de Proteção Individual - EPI - aquisição",null,{"$f":"ROUND(HLOOKUP(B5,EPI!J4:DY6,3)/12,2)","v":0}]
[]
[null,null,null,"TOTAL DE INSUMOS DIVERSOS",null,{"$f":"SUM(F76:F81)","v":0},null,"* Nota - Valores mensais por empregado"]
[]
[null,"MÓDULO 6 - CUSTOS INDIRETOS, TRIBUTOS E LUCRO - BDI",null,null,"Percentuais","Valor"]
[null,null,"A","Custos Indiretos",{"$f":"BDI!E6","v":2.7000000000000003E-2}]
[null,null,"A.1","Administração Central",{"$f":"BDI!E7","v":2.1600000000000001E-2}]
[null,null,"A.2","Seguros, Garantias e Riscos",{"$f":"BDI!E8","v":5.4000000000000003E-3}]
[null,null,"B","Lucro",{"$f":"BDI!E10","v":3.3399999999999999E-2}]
[null,null,"C","Tributos",{"$f":"SUM(E90:E91)","v":0.124}]
[null,null,"C.1","Tributos Federais (COFINS, PIS e CPRB)",{"$f":"BDI!E18","v":7.3999999999999996E-2}]
[null,null,"C.2","Tributos Distritais (ISS)",{"$f":"BDI!E23","v":0.05},null,null,"* Nota - Utilizou-se o indicado pelo Sindicato da Arquitetura e da Engenharia (Sinaenco, 2008, p. 22), que adota um percentual redutor de 20% no cálculo dos custos tributários relativos às contribuições PIS e COFINS"]
[null,null,"D","Despesas Financeiras",{"$f":"BDI!E13","v":4.4669210982628549E-3}]
[]
[null,null,null,"TOTAL DE BDI",{"$f":"BDI!E26","v":0.21690000000000001},{"$f":"E94*E102","v":0}]
[]
[null,null,null,"QUADRO-RESUMO DO CUSTO MENSAL POR EMPREGADO - SEM O 13º","Valor"]
[null,null,null,"Módulo 1 - Composição da Remuneração",{"$f":"F16","v":0}]
[null,null,null,"Módulo 2 - Encargos e Benefícios Anuais, Mensais e Diários",{"$f":"F45","v":0}]
[null,null,null,"Módulo 3 - Provisão para Rescisão",{"$f":"F55","v":0}]
[null,null,null,"Módulo 4 - Custo de Reposição do Profissional Ausente",{"$f":"F73","v":0}]
[null,null,null,"Módulo 5 - Insumos Diversos",{"$f":"F82","v":0}]
[null,null,null,"SUBTOTAL (A+B+C+D+E)",{"$f":"SUM(E97:E101)","v":0}]
[null,null,null,"Módulo 6 - Custos Indiretos, Tributos e Lucro",{"$f":"F94","v":0}]
[]
[null,null,null,"TOTAL DO POSTO",{"$f":"SUM(E102:E103)","v":0}]
[]
[null,"MÓDULO 7 - DESTAQUE DO MÓDULO 2 - 13º SALÁRIO",null,null,"Percentuais","Valor"]
[null,null,"A","13º Salário",{"$f":"'Encargos Sociais'!E32","v":8.3299999999999999E-2},{"$f":"ROUND(E108*F$16,2)","v":0}]
[null,null,"B","Encargos Sociais sobre o 13º Salário - Taxa calculada no SUBMÓDULO 2.2",{"$f":"SUM($E$24:$E$32)","v":0.36800000000000005},{"$f":"ROUND(E109*$F$108,2)","v":0},null,"* Nota 1 - Provisiona-se, mensalmente, o proporcional a 1/12 dos valores referentes a gratificação natalina e adicional de férias."]
[null,null,"C","BDI sobre o 13º Salário - Taxa calculada no MÓDULO 6",{"$f":"E94","v":0.21690000000000001},{"$f":"ROUND(E110*($F$108+$F$109),2)","v":0}]
[]
[null,null,null,"TOTAL DO DESTAQUE DO 13º SALÁRIO",null,{"$f":"SUM(F108:F110)","v":0}]
[]
[null,null,null,"QUADRO-RESUMO DO CUSTO MENSAL POR EMPREGADO","Valor"]
[null,null,null,"Custo total - sem o 13º Salário",{"$f":"E105","v":0}]
[null,null,null,"Destaque do 13º Salário (valor mensal)",{"$f":"F112","v":0}]
[]
[null,null,null,"TOTAL DO POSTO",{"$f":"E115+E116","v":0}]

{"sheet":"Dados Gerais","index":13,"n_rows":118,"n_cols":63,"rows_kept":118,"cut":false,"hidden":false,"merged":[[2,1,2,2]]}
[]
[]
[null,"INFORMAÇÕES DE ENTRADA"]
[]
[null,null,null,1,2,3,4,5,6,7,8,9,10,11,12,13,14,15,16,17,18,19,20,21,22,23,24,25,26,27,28,29,30,31,32,33,34,35,36,37,38,39,40,41,42,43,44,45,46,47,48,49,50,51,52,53,54,55,56,57,58,59,60]
[null,"",null,"CARGO 1","CARGO 2","CARGO 3","CARGO 4","CARGO 5","CARGO 6","CARGO 7","CARGO 8","CARGO 9","CARGO 10","CARGO 11","CARGO 12","CARGO 13","CARGO 14","CARGO 15","CARGO 16","CARGO 17","CARGO 18","CARGO 19","CARGO 20","CARGO 21","CARGO 22","CARGO 23","CARGO 24","CARGO 25","CARGO 26","CARGO 27","CARGO 28","CARGO 29","CARGO 30","CARGO 31","CARGO 32","CARGO 33","CARGO 34","CARGO 35","CARGO 36","CARGO 37","CARGO 38","CARGO 39","CARGO 40","CARGO 41","CARGO 42","CARGO 43","CARGO 44","CARGO 45","CARGO 46","CARGO 47","CARGO 48","CARGO 49","CARGO 50","CARGO 51","CARGO 52","CARGO 53","CARGO 54","CARGO 55","CARGO 56","CARGO 57","CARGO 58","CARGO 59","CARGO 60"]
[null,"INFORMAÇÕES BÁSICAS"]
[]
[null,"DESCRIÇÃO DOS POSTOS DE SERVIÇO"]
[null,null,null,"ENCARREGADO GERAL","ENCARREGADO SETORIAL","ENCARREGADO DE SERVIÇO","AUXILIAR DE ENCARREGADO","ALMOXARIFE","SERVENTE"]
[null,"REMUNERAÇÕES"]
[null,null,null,7744.91,4428.78,3483.45,2598.63,3035.66,2017.21]
[null,"QUANTIDADE DE POSTOS"]
[null,null,null,1,2,12,1,2,189]
[null,"JORNADA"]
[null,null,"HORAS",220,{"$f":"44*5","v":220},220,220,220,220]
[null,null,"DIAS/MÊS",24,24,24,24,24,24]
[null,"CCT UTILIZADA"]
[null,null,"SINDICATOS E REFERÊNCIA","SEAC/DF X SINDISERVIÇOS/DF 2024/2024 Nº DF000012/2024",{"$f":"D19","v":"SEAC/DF X SINDISERVIÇOS/DF 2024/2024 Nº DF000012/2024"},{"$f":"E19","v":"SEAC/DF X SINDISERVIÇOS/DF 2024/2024 Nº DF000012/2024"},"SEAC/DF X SINDISERVIÇOS/DF 2024/2024 Nº DF000012/2024","SEAC/DF X SINDISERVIÇOS/DF 2024/2024 Nº DF000012/2024","SEAC/DF X SINDISERVIÇOS/DF 2024/2024 Nº DF000012/2024"]
[null,null,"DATA-BASE","2024-01-01",{"$f":"D20","v":"2024-01-01"},{"$f":"E20","v":"2024-01-01"},"2024-01-01","2024-01-01","2024-01-01"]
[]
[null,"ADICIONAIS LEGAIS E GRATIFICAÇÕES"]
[]
[null,"PERICULOSIDADE (PERCENTUAL)"]
[null,null,null,0,0,0,0,0,0]
[null,"BASE DE CÁLCULO DO ADICIONAL DE PERICULOSIDADE (SALÁRIO BÁSICO)"]
[null,null,null,{"$f":"D12","v":7744.91},2386.75,2386.75,2386.75,2386.75,2386.75]
[null,"VALOR MENSAL DO ADICIONAL DE PERICULOSIDADE"]
[null,null,null,{"$f":"ROUND(D25*D12,2)","v":0},0,0,0,0,0]
[null,"INSALUBRIDADE (PERCENTUAL)"]
[null,null,null,0,0,0,0,0,0]
[null,"BASE DE CÁLCULO DO ADICIONAL DE INSALUBRIDADE (SALÁRIO MÍNIMO LEGAL)"]
[null,null,null,1412,{"$f":"D33","v":1412},{"$f":"E33","v":1412},{"$f":"F33","v":1412},{"$f":"G33","v":1412},{"$f":"H33","v":1412}]
[null,"VALOR MENSAL DO ADICIONAL DE INSALUBRIDADE"]
[null,null,null,{"$f":"D31*D33","v":0},0,0,0,0,0]
[null,"GRATIFICAÇÃO - VALOR MENSAL (R$)"]
[null,null,null,0,0,0,0,0,0]
[]
[null,"ADICIONAL NOTURNO"]
[]
[null,"INCIDÊNCIA (PERCENTUAL CONFORME CCT)"]
[null,null,null,0.2,{"$f":"D42","v":0.2},{"$f":"E42","v":0.2},{"$f":"F42","v":0.2},{"$f":"G42","v":0.2},{"$f":"H42","v":0.2}]
[null,"HORAS REAIS POR DIA"]
[null,null,null,0,0,0,0,0,0]
[null,"HORAS FICTAS POR DIA"]
[null,null,null,{"$f":"D44*8/7","v":0},0,{"$f":"F44*8/7","v":0},0,0,0]
[null,"BASE DE CÁLCULO DO ADICIONAL NOTURNO (INCLUINDO ADICIONAIS E GRATIFICAÇÕES)"]
[null,null,null,{"$f":"D12+D29+D35+D37","v":7744.91},{"$f":"E12+E29+E35+E37","v":4428.78},{"$f":"F12+F29+F35+F37","v":3483.45},2598.63,3035.66,2017.21]
[null,"VALOR MENSAL DO ADICIONAL NOTURNO (HORA NORMAL + HORA REDUZIDA) - POR POSTO"]
[null,null,null,{"$f":"ROUND(D46*D17*D42*D48/D16,2)","v":0},{"$f":"ROUND(E46*E17*E42*E48/E16,2)","v":0},{"$f":"ROUND(F46*F17*F42*F48/F16,2)","v":0},0,0,0]
[]
[null,"ADICIONAL DE HORA EXTRA"]
[null,null,null,null,null,null,null,null,null,null,null,{"$f":"SUM(L8:L51)","v":0}]
[null,"INCIDÊNCIA (PERCENTUAL 1)"]
[null,null,null,0.5,0.5,0.5,0.5,0.5,0.5]
[null,"HORAS EXTRAS POR MÊS (PERCENTUAL 1)"]
[null,null,null,0,0,0,0,0,0]
[null,"VALOR MENSAL DO ADICIONAL DE HORAS EXTRAS (PERCENTUAL 1) - POR POSTO"]
[null,null,null,{"$f":"ROUND(D57*D55*D12/D16,2)","v":0},0,0,0,0,0]
[null,"INCIDÊNCIA (PERCENTUAL 2)"]
[null,null,null,1,1,1,1,1,1]
[null,"HORAS EXTRAS POR MÊS (PERCENTUAL 2)"]
[null,null,null,0,0,0,0,0,0]
[null,"VALOR MENSAL DO ADICIONAL DE HORAS EXTRAS (PERCENTUAL 2) - POR POSTO"]
[null,null,null,{"$f":"ROUND(D63*D61*D12/D16,2)","v":0},0,0,0,0,0]
[null,"TOTAL MENSAL DOS ADICIONAIS DE HORAS EXTRAS - POR POSTO"]
[null,null,null,{"$f":"D65+D59","v":0},0,0,0,0,0]
[]
[null,"BENEFÍCIOS COMUNS - AUXÍLIO TRANSPORTE"]
[]
[null,"DISTRIBUIÇÃO ESTIMADA DE PROCEDÊNCIA"]
[null,null,"Cidade-satélite",{"$f":"100%-D73","v":0.7681},{"$f":"D72","v":0.7681},{"$f":"E72","v":0.7681},0.7681,0.7681,0.7681]
[null,null,"Região do entorno (percentual considerando contrato em andamento)",{"$f":"ROUND(48/Remunerações!$E$15,4)","v":0.2319},{"$f":"D73","v":0.2319},0.2319,0.2319,0.2319,0.2319]
[null,null,"Esplanada - apenas para os que vêm do entorno",{"$f":"D73","v":0.2319},0.2319,0.2319,0.2319,0.2319,0.2319]
[null,"VALORES DOS VALES"]
[null,null,"Cidade-satélite",5.5,{"$f":"D76","v":5.5},{"$f":"E76","v":5.5},5.5,5.5,5.5]
[null,null,"Região do entorno (média ponderada considerando contrato em andamento)",9.73,{"$f":"D77","v":9.73},9.73,9.73,9.73,9.73]
[null,null,"Esplanada",2.75,2.75,2.75,2.75,2.75,2.75]
[null,"VALOR MENSAL BRUTO DE PAGAMENTO - POR POSTO"]
[null,null,null,{"$f":"ROUND((D72*D76+D73*D77+D74*D78)*2*D17,2)","v":341.7},{"$f":"ROUND((E72*E76+E73*E77+E74*E78)*2*E17,2)","v":341.7},341.7,341.7,341.7,341.7]
[null,"PERCENTUAL DE DESCONTO"]
[null,null,null,0.06,0.06,0.06,0.06,0.06,0.06]
[null,"VALOR MENSAL DO DESCONTO - POR POSTO"]
[null,null,null,{"$f":"ROUND(D82*D12,2)","v":464.69},{"$f":"ROUND(E82*E12,2)","v":265.73},{"$f":"ROUND(F82*F12,2)","v":209.01},155.91999999999999,182.14,121.03]
[null,"VALOR MENSAL LÍQUIDO DO VALE TRANSPORTE - POR POSTO"]
[null,null,null,{"$f":"IF(D80>D84,D80-D84,0)","v":0},75.96999999999997,{"$f":"IF(F80>F84,F80-F84,0)","v":132.69},185.78,159.56,220.67]
[null,null,null,{"$f":"D86*D14","v":0},2962.54,2962.54,2962.54,2962.54,2962.54]
[null,"BENEFÍCIOS COMUNS - AUXÍLIO ALIMENTAÇÃO"]
[]
[null,null,"VALOR CCT",42.2,{"$f":"D90","v":42.2},{"$f":"E90","v":42.2},{"$f":"F90","v":42.2},{"$f":"G90","v":42.2},{"$f":"H90","v":42.2}]
[null,null,"VALOR CD",35,35,35,35,35,35]
[null,"VALOR MENSAL DO AUXÍLIO ALIMENTAÇÃO - POR POSTO"]
[null,null,null,{"$f":"ROUND(LARGE(D90:D91,1)*D17,2)","v":1012.8},{"$f":"ROUND(LARGE(E90:E91,1)*E17,2)","v":1012.8},1012.8,1012.8,1012.8,1012.8]
[null,null,null,{"$f":"D93*D14","v":1012.8},10339.56,10339.56,10339.56,10339.56,10339.56]
[null,"BENEFÍCIOS ESPECIAIS - ASSISTÊNCIA MÉDICA E FAMILIAR"]
[]
[null,null,"OBRIGAÇÃO DE PAGTO","NÃO","NÃO","NÃO","NÃO","NÃO","NÃO"]
[null,null,"VALOR CCT",0,0,0,0,0,0]
[null,null,"VALOR MERCADO",0,0,0,0,0,0]
[null,"VALOR MENSAL DO AUXÍLIO ESPECIAL - ASSISTÊNCIA MÉDICA E FAMILIAR - POR POSTO"]
[null,null,null,{"$f":"IF(D97=\"SIM\",ROUND(SMALL(D98:D99,1),2),0)","v":0},0,{"$f":"IF(F97=\"SIM\",ROUND(SMALL(F98:F99,1),2),0)","v":0},0,0,0]
[]
[null,"BENEFÍCIOS ESPECIAIS - SEGURO DE VIDA E AUXÍLIO-FUNERAL, AUX ODONT, AUX CRECHE"]
[]
[null,"SEGURO DE VIDA E AUXÍLIO FUNERAL"]
[null,null,"OBRIGAÇÃO DE PAGTO","NÃO","NÃO","NÃO","NÃO","NÃO","NÃO"]
[null,null,"VALOR CCT",0,0,0,0,0,0]
[null,null,"VALOR MERCADO",0,0,0,0,0,0]
[null,"VALOR MENSAL DO AUXÍLIO ESPECIAL - SEGURO DE VIDA E AUXÍLIO FUNERAL - POR POSTO"]
[null,null,null,{"$f":"IF(D106=\"SIM\",ROUND(SMALL(D107:D108,1),2),0)","v":0},0,{"$f":"IF(F106=\"SIM\",ROUND(SMALL(F107:F108,1),2),0)","v":0},0,0,0]
[null,"AUXÍLIO ODONTOLÓGICO"]
[null,null,"OBRIGAÇÃO DE PAGTO","NÃO","NÃO","NÃO","NÃO","NÃO","NÃO"]
[null,null,"VALOR CCT",0,0,0,0,0,0]
[null,null,"VALOR MERCADO",0,0,0,0,0,0]
[null,"VALOR MENSAL DO AUXÍLIO ODONTOLÓGICO - POR POSTO"]
[null,null,null,{"$f":"IF(D112=\"SIM\",ROUND(SMALL(D113:D114,1),2)*D17,0)","v":0},0,0,0,0,0]
[null,"TOTAL MENSAL DOS AUXÍLIOS ESPECIAIS - POR POSTO"]
[null,null,null,{"$f":"D116+D110","v":0},0,{"$f":"F116+F110","v":0},0,0,0]

{"sheet":"Encargos Sociais","index":14,"n_rows":53,"n_cols":12,"rows_kept":53,"cut":false,"hidden":false,"merged":[[2,1,2,3],[3,1,3,4]]}
[]
[]
[]
[null,"ENCARGOS SOCIAIS SOBRE A MÃO DE OBRA"]
[null,null,null,null,"Percentuais"]
[]
[null,"Referência:"]
[null,null,"SINAPI OUT/2018"]
[]
[null,"Categorias:"]
[null,null,"TODAS"]
[]
[null,"GRUPO A: Encargos Sociais Básicos - Previdenciários (GPS), Fundo de Garantia por Tempo de Serviço (FGTS) e Outras Contribuições",null,null,{"$f":"ROUND(SUM(E14:E22),4)","v":0.36799999999999999}]
[null,null,"A","INSS (art. 22, inciso I, Lei nº 8.212/91)",0.2]
[null,null,"B","Salário Educação (art. 3º, inciso I, Decreto nº 87.043/82)",2.5000000000000001E-2]
[null,null,"C","SAT/RAT (art. 22, II, Lei 8.212/91 e Anexo V, Decreto 6.042/07) - Enquadramento 8121-4/00",0.03]
[null,null,"D","SESC ou SESI (art. 30, Lei nº 8.036/90 e art. 1º, Lei 8.154/90)",1.4999999999999999E-2]
[null,null,"E","SENAI ou SENAC (Decreto nº 2.318/86)",0.01]
[null,null,"F","SEBRAE (§ 3º, art. 8º, Lei 8.029/90, alterada pela Lei nº 8.154/90)",6.0000000000000001E-3,null,"* Nota 1 - Os percentuais dos encargos previdenciários, do FGTS e demais contribuições são estabelecidos por legislação vigente."]
[null,null,"G","INCRA (art. 1º, I, Decreto Lei 1.146/70 e Lei 7.787, de 30/06/89)",2E-3,null,"* Nota 2 - O SAT, a depender do grau de risco do serviço, irá variar entre 1%, para risco leve, de 2%, para risco médio, e de 3% para risco grave."]
[null,null,"H","FGTS (Lei Complementar nº 110/01 e art. 30, Lei nº 8.036/90)",0.08,null,"* Nota 3 - Os percentuais do Submódulo 2.2 incidem sobre o Módulo 1, o Submódulo 2.1, o Módulo 3, o Módulo 4 e o Módulo 6."]
[null,null,"I","SECONCI (Convenções Coletivas de Trabalho da construção)",0]
[]
[null,"GRUPO B: Encargos Sociais Relacionados ao Custo do Profissional Ausente - Ausências Legais",null,null,{"$f":"ROUND(SUM(E25:E33),4)","v":0.22450000000000001}]
[null,null,"A","Férias (Arts. 129 e 130, inc. I, da CLT)",{"$f":"ROUND(1/11,4)","v":9.0899999999999995E-2},null,"Nota 1 - As alíneas “A” a “F” referem-se  ao custo que será pago pela empresa ao profissional ausente (férias e ausências legais)"]
[null,null,"B","Ausências Legais (Arts. 131 e 473 da CLT)",{"$f":"ROUND(2/252,4)","v":7.9000000000000008E-3},null,"* Nota 2 - Adotou-se a estimativa do SINAPI de 2 dias por ano. Em 252 dias úteis por ano."]
[null,null,"C","Licença-Paternidade (Art. 7º, XIX, e art. 10, §1º, do ADCT, CF/1988 e Art. 1º, II, da Lei 11.770/2008)",{"$f":"ROUND((5/(30*12))*0.0596,4)","v":8.0000000000000004E-4},null,"* Nota 3 - Utilizada a proporção de 50% para homens, 5 dias de afastamento, e a probabilidade de um trabalhador requerer a Licença Paternidade em 5,96%, conforme SINAPI (Anuário Estatístico da Previdência Social - 2017)"]
[null,null,"D","Ausência por Acidente de Trabalho (Art. 131, III, da CLT)",{"$f":"ROUND(0.0205*15/360,4)","v":8.9999999999999998E-4},null,"* Nota 4 - Utilzada a estatística de 2,05% dos contribuintes beneficiados com a emissão do auxílio, conforme Anuário Estatístico da Previdência Social. Afastamento de 15 dias a cargo da empresa."]
[null,null,"E","Afastamento Maternidade (Art. 71 da Lei nº 8.213/1991)",{"$f":"ROUND(0.0508*(120/360)*(30+30*4/3)/360,4)","v":3.3E-3},null,"* Nota 5 - Utilizada a estimativa de 120 dias de afastamento, e a probabilidade de uma trabalhadora requerer a Licença Maternidade em 5,08%, conforme SINAPI (citando dados do IBGE 2017) - A própria previdência paga o benefício pelos 120 dias, contudo o empregador arca com o 13º e com as férias"]
[null,null,"F","Auxílio Enfermidade - Doença (Art. 59 da Lei nº 8.213/1991)",{"$f":"ROUND(((0.0376*15)+2)/360,4)","v":7.1000000000000004E-3},null,"* Nota 6 - Utilizada a estatística de 3,76% dos contribuintes beneficiados com o auxílio, conforme Anuário Estatístico da Previdência Social de 2016 (acrescidos de 2 dias ao ano, para os quais o trabalhador nem requer o benefício da Previdência - conforme SINAPI)"]
[null,null,"G","Adicional de Férias (componente do Submódulo 2.1)",{"$f":"ROUND(1/3*1/11,4)","v":3.0300000000000001E-2},null,"* Nota 7 - O adicional de férias contido no Submódulo 2.1 corresponde a 1/3 da remuneração que, por sua vez, é dividida por 11 contome Nota 1."]
[null,null,"H","13º Salário (destacado na planilha de custos)",{"$f":"ROUND(1/12,4)","v":8.3299999999999999E-2},null,"* Nota 8 - Provisiona-se, mensalmente, o proporcional a 1/12 dos valores referentes a gratificação natalina e adicional de férias."]
[null,null,"I","Intervalo para repouso ou alimentação (componente do Submódulo 4.2)",0]
[]
[null,"GRUPO C: Encargos Sociais Relacionados à Previsão para Rescisão Trabalhista",null,null,{"$f":"ROUND(SUM(E36:E41),4)","v":6.3600000000000004E-2}]
[null,null,"A","Aviso Prévio Indenizado (Art. 7º, inciso XXI, da CF/1988 e arts. 477, 487, §1º, e 491 da CLT)",{"$f":"ROUND(0.1*30/360,4)","v":8.3000000000000001E-3},null,"* Nota 1 - Considerou-se demissões de 10% por ano para substituições, a um prazo estimado de contrato de 3 anos. Aviso prévio - 1º ano 30 dias. Considerou-se os 10% demitidos sem justa causa e recebendo aviso indenizado."]
[null,null,"B","Incidência do FGTS sobre o Aviso Prévio Indenizado (Súmula 305 TST)",{"$f":"ROUND(E21*E36,4)","v":6.9999999999999999E-4}]
[null,null,"C","Multa do FGTS e Contribuição Social sobre o Aviso Prévio Indenizado (Art. 18, §1º, da Lei 8.036/1990 e art. 1º da LC nº 110/2001)",{"$f":"ROUND((1+1/12+1/12+1/36)*0.4*E21*0.2*0.5,4)","v":3.8E-3},null,"* Nota 2 - Incide sobre a Remuneração + 13º salário (1/12) + Férias (1/12) + Adicional de Férias (1/36) x 40% multa para o empregador x 8% FGTS x taxa de rotatividade estimada 20% ao ano, sendo 50% demitidos sem justa causa"]
[null,null,"D","Aviso Prévio Trabalhado (Art. 488, parágrafo único, CLT)",{"$f":"ROUND(((7+2*3)*100%/360)/3,4)","v":1.2E-2},null,"* Nota 3 - Considerou-se demissões de 100% ao final do contrato, com um prazo médio estimado de 3 anos. Assim, calcula-se 7 dias para o 1º ano de contrato e mais 3 dias para os 2 anos seguintes. Total 13 dias."]
[null,null,"E","Incidência de GPS, FGTS e outras contribuições sobre o Aviso Prévio Trabalhado",{"$f":"ROUND(E39*E13,4)","v":4.4000000000000003E-3}]
[null,null,"F","Multa do FGTS e Contribuição Social sobre o Aviso Prévio Trabalhado",{"$f":"ROUND((1+1/12+1/12+1/36)*0.4*E21*(1-0.2*0.5),4)","v":3.44E-2},null,"* Nota 4 - Incide sobre a Remuneração + 13º salário (1/12) + Férias (1/12) + Adicional de Férias (1/36) x 40% multa para o empregador x 8% FGTS x (1- taxa de rotatividade estimada Nota2)"]
[]
[null,"GRUPO D: Reincidências",null,null,{"$f":"ROUND(SUM(E44:E44),4)","v":8.2600000000000007E-2}]
[null,null,"A","Reincidência do Grupo A sobre o Grupo B",{"$f":"E13*E24","v":8.2615999999999995E-2}]
[]
[null,null,null,"SOMATÓRIO - ENCARGOS SOCIAIS SOBRE A MÃO DE OBRA",{"$f":"E43+E35+E24+E13","v":0.73870000000000002}]
[]
[]
[]
[]
[]
[]
[null,null,null,null,null,null,null,null,null,null,null,{"$f":"SUM(L8:L51)","v":0}]

{"sheet":"BDI","index":15,"n_rows":53,"n_cols":12,"rows_kept":53,"cut":false,"hidden":false,"merged":[[1,1,1,3],[2,1,2,4]]}
[]
[]
[null,"COMPOSIÇÃO DA TAXA DE CUSTOS INDIRETOS, TRIBUTOS E LUCRO - BDI"]
[null,"APLICAÇÃO: MÃO DE OBRA, 13º, MATERIAIS, EPC E EQUIPAMENTO DE REGISTRO DE FREQUÊNCIA",null,null,"Percentuais"]
[]
[null,"Custos Indiretos da Contratada",null,null,{"$f":"SUM(E7:E8)","v":2.7000000000000003E-2}]
[null,null,"A","Administração Central",2.1600000000000001E-2,null,"* Nota 1 - O Somatório da Administração Central com o Lucro deve ser inferior a 12%"]
[null,null,"B","Seguros, Garantias e Riscos",{"$f":"0.34%+0.2%","v":5.4000000000000003E-3},null,"* Nota 2 - O risco previsto para o porte do contrato majorado em mais 0,20% devido ao não pagamento dos insumos componentes do custo do posto quando da ausência do mesmo."]
[]
[null,"Lucro",null,null,{"$f":"SUM(E11:E11)","v":3.3399999999999999E-2}]
[null,null,"A","Lucro Real sobre os Custos Administrados",3.3399999999999999E-2]
[]
[null,"Despesas Financeiras",null,null,{"$f":"E14","v":4.4669210982628549E-3}]
[null,null,"A","Cálculo Baseado no Prazo para a Restituição dos Desembolsos Realizados pelo Contratado e na Taxa de Retorno Arbitrada",{"$f":"(1+E16)^(E15/252)-1","v":4.4669210982628549E-3},null,"* Nota 1 - DF = [(1+TR)^(DU/252)]/100"]
[null,null,"A.1","Dias Úteis Considerados",11,null,"* Nota 2 - Diferença de dias entre o desembolso, pelo contratado, e o pagamento, pela Câmara"]
[null,null,"A.2","Taxa de Retorno",0.1075,null,"* Nota 3 - A taxa sugerida é a meta da SELIC"]
[]
[null,"Impostos - Tributos Federais",null,null,{"$f":"SUM(E19:E21)","v":7.3999999999999996E-2}]
[null,null,"A","Contribuição para o Financiamento da Seguridade Social - COFINS",{"$f":"0.8*7.6%","v":6.08E-2},null,"* Nota 1 - Redução de 20% considerando as deduções permitidas em Lei, conforme SENGE, citado pelo TCU - Acórdão 2622/2013"]
[null,null,"B","Programa de Integração Social - PIS",{"$f":"0.8*1.65%","v":1.3200000000000002E-2},null,"* Nota 2 - Redução de 20% considerando as deduções permitidas em Lei, conforme SENGE, citado pelo TCU - Acórdão 2622/2013"]
[null,null,"C","Contribuição Previdenciária sobre a Receita Bruta - CPRB",0,null,"* Nota 3 - Lei 12.546/2011 - Verificar atualizações e setores beneficiados"]
[]
[null,"Impostos - Tributos Distritais",null,null,{"$f":"SUM(E24:E24)","v":0.05}]
[null,null,"A","Imposto sobre Serviço de Qualquer Natureza - ISS",0.05]
[]
[null,null,null,"SOMATÓRIO - ENCARGOS SOCIAIS SOBRE A MÃO DE OBRA",{"$f":"ROUND((((1+E6)*(1+E10)*(1+E13)/(1-E18-E23))-1),4)","v":0.21690000000000001},null,"* Nota 1 - [(1+AC+SGR)*(1+L)*(1+DF)/(1-CONFINS-PIS-CPRB-ISS)]-1"]
[]
[]
[]
[]
[]
[]
[]
[]
[]
[]
[]
[]
[]
[]
[]
[]
[]
[]
[]
[]
[]
[]
[]
[]
[]
[]
[null,null,null,null,null,null,null,null,null,null,null,{"$f":"SUM(L8:L51)","v":0}]

{"sheet":"Uniformes","index":16,"n_rows":87,"n_cols":131,"rows_kept":87,"cut":false,"hidden":false,"merged":[[80,2,82,2],[83,2,85,2],[65,2,69,2],[2,1,2,3],[3,1,3,8],[14,2,18,2],[19,2,23,2],[60,2,64,2]]}
[]
[]
[]
[null,"UNIFORMES - AQUISIÇÃO",null,null,null,null,null,null,null,null,null,1,null,{"$f":"L4+1","v":2},null,{"$f":"N4+1","v":3},null,{"$f":"P4+1","v":4},null,{"$f":"R4+1","v":5},null,{"$f":"T4+1","v":6},null,{"$f":"V4+1","v":7},null,{"$f":"X4+1","v":8},null,{"$f":"Z4+1","v":9},null,{"$f":"AB4+1","v":10},null,{"$f":"AD4+1","v":11},null,{"$f":"AF4+1","v":12},null,{"$f":"AH4+1","v":13},null,{"$f":"AJ4+1","v":14},null,{"$f":"AL4+1","v":15},null,{"$f":"AN4+1","v":16},null,{"$f":"AP4+1","v":17},null,{"$f":"AR4+1","v":18},null,{"$f":"AT4+1","v":19},null,{"$f":"AV4+1","v":20},null,{"$f":"AX4+1","v":21},null,{"$f":"AZ4+1","v":22},null,{"$f":"BB4+1","v":23},null,{"$f":"BD4+1","v":24},null,{"$f":"BF4+1","v":25},null,{"$f":"BH4+1","v":26},null,{"$f":"BJ4+1","v":27},null,{"$f":"BL4+1","v":28},null,{"$f":"BN4+1","v":29},null,{"$f":"BP4+1","v":30},null,{"$f":"BR4+1","v":31},null,{"$f":"BT4+1","v":32},null,{"$f":"BV4+1","v":33},null,{"$f":"BX4+1","v":34},null,{"$f":"BZ4+1","v":35},null,{"$f":"CB4+1","v":36},null,{"$f":"CD4+1","v":37},null,{"$f":"CF4+1","v":38},null,{"$f":"CH4+1","v":39},null,{"$f":"CJ4+1","v":40},null,{"$f":"CL4+1","v":41},null,{"$f":"CN4+1","v":42},null,{"$f":"CP4+1","v":43},null,{"$f":"CR4+1","v":44},null,{"$f":"CT4+1","v":45},null,{"$f":"CV4+1","v":46},null,{"$f":"CX4+1","v":47},null,{"$f":"CZ4+1","v":48},null,{"$f":"DB4+1","v":49},null,{"$f":"DD4+1","v":50},null,{"$f":"DF4+1","v":51},null,{"$f":"DH4+1","v":52},null,{"$f":"DJ4+1","v":53},null,{"$f":"DL4+1","v":54},null,{"$f":"DN4+1","v":55},null,{"$f":"DP4+1","v":56},null,{"$f":"DR4+1","v":57},null,{"$f":"DT4+1","v":58},null,{"$f":"DV4+1","v":59},null,{"$f":"DX4+1","v":60}]
[]
[null,null,null,null,null,null,null,null,null,null,null,{"$f":"ROUND(SUM(M5:M107),2)","v":1373.36},null,{"$f":"ROUND(SUM(O5:O107),2)","v":1373.36},null,{"$f":"ROUND(SUM(Q5:Q107),2)","v":1354.19},null,{"$f":"ROUND(SUM(S5:S107),2)","v":1354.19},null,{"$f":"ROUND(SUM(U5:U107),2)","v":447.52},null,{"$f":"ROUND(SUM(W5:W107),2)","v":447.52},null,{"$f":"ROUND(SUM(Y5:Y107),2)","v":0},null,{"$f":"ROUND(SUM(AA5:AA107),2)","v":0},null,{"$f":"ROUND(SUM(AC5:AC107),2)","v":0},null,{"$f":"ROUND(SUM(AE5:AE107),2)","v":0},null,{"$f":"ROUND(SUM(AG5:AG107),2)","v":0},null,{"$f":"ROUND(SUM(AI5:AI107),2)","v":0},null,{"$f":"ROUND(SUM(AK5:AK107),2)","v":0},null,{"$f":"ROUND(SUM(AM5:AM107),2)","v":0},null,{"$f":"ROUND(SUM(AO5:AO107),2)","v":0},null,{"$f":"ROUND(SUM(AQ5:AQ107),2)","v":0},null,{"$f":"ROUND(SUM(AS5:AS107),2)","v":0},null,{"$f":"ROUND(SUM(AU5:AU107),2)","v":0},null,{"$f":"ROUND(SUM(AW5:AW107),2)","v":0},null,{"$f":"ROUND(SUM(AY5:AY107),2)","v":0},null,{"$f":"ROUND(SUM(BA5:BA107),2)","v":0},null,{"$f":"ROUND(SUM(BC5:BC107),2)","v":0},null,{"$f":"ROUND(SUM(BE5:BE107),2)","v":0},null,{"$f":"ROUND(SUM(BG5:BG107),2)","v":0},null,{"$f":"ROUND(SUM(BI5:BI107),2)","v":0},null,{"$f":"ROUND(SUM(BK5:BK107),2)","v":0},null,{"$f":"ROUND(SUM(BM5:BM107),2)","v":0},null,{"$f":"ROUND(SUM(BO5:BO107),2)","v":0},null,{"$f":"ROUND(SUM(BQ5:BQ107),2)","v":0},null,{"$f":"ROUND(SUM(BS5:BS107),2)","v":0},null,{"$f":"ROUND(SUM(BU5:BU107),2)","v":0},null,{"$f":"ROUND(SUM(BW5:BW107),2)","v":0},null,{"$f":"ROUND(SUM(BY5:BY107),2)","v":0},null,{"$f":"ROUND(SUM(CA5:CA107),2)","v":0},null,{"$f":"ROUND(SUM(CC5:CC107),2)","v":0},null,{"$f":"ROUND(SUM(CE5:CE107),2)","v":0},null,{"$f":"ROUND(SUM(CG5:CG107),2)","v":0},null,{"$f":"ROUND(SUM(CI5:CI107),2)","v":0},null,{"$f":"ROUND(SUM(CK5:CK107),2)","v":0},null,{"$f":"ROUND(SUM(CM5:CM107),2)","v":0},null,{"$f":"ROUND(SUM(CO5:CO107),2)","v":0},null,{"$f":"ROUND(SUM(CQ5:CQ107),2)","v":0},null,{"$f":"ROUND(SUM(CS5:CS107),2)","v":0},null,{"$f":"ROUND(SUM(CU5:CU107),2)","v":0},null,{"$f":"ROUND(SUM(CW5:CW107),2)","v":0},null,{"$f":"ROUND(SUM(CY5:CY107),2)","v":0},null,{"$f":"ROUND(SUM(DA5:DA107),2)","v":0},null,{"$f":"ROUND(SUM(DC5:DC107),2)","v":0},null,{"$f":"ROUND(SUM(DE5:DE107),2)","v":0},null,{"$f":"ROUND(SUM(DG5:DG107),2)","v":0},null,{"$f":"ROUND(SUM(DI5:DI107),2)","v":0},null,{"$f":"ROUND(SUM(DK5:DK107),2)","v":0},null,{"$f":"ROUND(SUM(DM5:DM107),2)","v":0},null,{"$f":"ROUND(SUM(DO5:DO107),2)","v":0},null,{"$f":"ROUND(SUM(DQ5:DQ107),2)","v":0},null,{"$f":"ROUND(SUM(DS5:DS107),2)","v":0},null,{"$f":"ROUND(SUM(DU5:DU107),2)","v":0},null,{"$f":"ROUND(SUM(DW5:DW107),2)","v":0},null,{"$f":"ROUND(SUM(DY5:DY107),2)","v":0},null,{"$f":"ROUND(SUM(EA5:EA107),2)","v":0}]
[null,null,"CATEGORIAS",null,null,null,null,null,"QUANTIDADE"]
[null,null,null,null,null,null,null,null,null,null,null,{"$f":"IF($C8=L$4,1,0)","v":0}]
[null,null,1,{"$f":"HLOOKUP($C9,'Dados Gerais'!$D$5:$BK$10,6)","v":"ENCARREGADO GERAL"},null,null,null,null,1,null,null,1,null,{"$f":"IF($C9=N$4,1,0)","v":0},null,{"$f":"IF($C9=P$4,1,0)","v":0},null,{"$f":"IF($C9=R$4,1,0)","v":0},null,{"$f":"IF($C9=T$4,1,0)","v":0},null,{"$f":"IF($C9=V$4,1,0)","v":0},null,{"$f":"IF($C9=X$4,1,0)","v":0},null,{"$f":"IF($C9=Z$4,1,0)","v":0},null,{"$f":"IF($C9=AB$4,1,0)","v":0},null,{"$f":"IF($C9=AD$4,1,0)","v":0},null,{"$f":"IF($C9=AF$4,1,0)","v":0},null,{"$f":"IF($C9=AH$4,1,0)","v":0},null,{"$f":"IF($C9=AJ$4,1,0)","v":0},null,{"$f":"IF($C9=AL$4,1,0)","v":0},null,{"$f":"IF($C9=AN$4,1,0)","v":0},null,{"$f":"IF($C9=AP$4,1,0)","v":0},null,{"$f":"IF($C9=AR$4,1,0)","v":0},null,{"$f":"IF($C9=AT$4,1,0)","v":0},null,{"$f":"IF($C9=AV$4,1,0)","v":0},null,{"$f":"IF($C9=AX$4,1,0)","v":0},null,{"$f":"IF($C9=AZ$4,1,0)","v":0},null,{"$f":"IF($C9=BB$4,1,0)","v":0},null,{"$f":"IF($C9=BD$4,1,0)","v":0},null,{"$f":"IF($C9=BF$4,1,0)","v":0},null,{"$f":"IF($C9=BH$4,1,0)","v":0},null,{"$f":"IF($C9=BJ$4,1,0)","v":0},null,{"$f":"IF($C9=BL$4,1,0)","v":0},null,{"$f":"IF($C9=BN$4,1,0)","v":0},null,{"$f":"IF($C9=BP$4,1,0)","v":0},null,{"$f":"IF($C9=BR$4,1,0)","v":0},null,{"$f":"IF($C9=BT$4,1,0)","v":0},null,{"$f":"IF($C9=BV$4,1,0)","v":0},null,{"$f":"IF($C9=BX$4,1,0)","v":0},null,{"$f":"IF($C9=BZ$4,1,0)","v":0},null,{"$f":"IF($C9=CB$4,1,0)","v":0},null,{"$f":"IF($C9=CD$4,1,0)","v":0},null,{"$f":"IF($C9=CF$4,1,0)","v":0},null,{"$f":"IF($C9=CH$4,1,0)","v":0},null,{"$f":"IF($C9=CJ$4,1,0)","v":0},null,{"$f":"IF($C9=CL$4,1,0)","v":0},null,{"$f":"IF($C9=CN$4,1,0)","v":0},null,{"$f":"IF($C9=CP$4,1,0)","v":0},null,{"$f":"IF($C9=CR$4,1,0)","v":0},null,{"$f":"IF($C9=CT$4,1,0)","v":0},null,{"$f":"IF($C9=CV$4,1,0)","v":0},null,{"$f":"IF($C9=CX$4,1,0)","v":0},null,{"$f":"IF($C9=CZ$4,1,0)","v":0},null,{"$f":"IF($C9=DB$4,1,0)","v":0},null,{"$f":"IF($C9=DD$4,1,0)","v":0},null,{"$f":"IF($C9=DF$4,1,0)","v":0},null,{"$f":"IF($C9=DH$4,1,0)","v":0},null,{"$f":"IF($C9=DJ$4,1,0)","v":0},null,{"$f":"IF($C9=DL$4,1,0)","v":0},null,{"$f":"IF($C9=DN$4,1,0)","v":0},null,{"$f":"IF($C9=DP$4,1,0)","v":0},null,{"$f":"IF($C9=DR$4,1,0)","v":0},null,{"$f":"IF($C9=DT$4,1,0)","v":0},null,{"$f":"IF($C9=DV$4,1,0)","v":0},null,{"$f":"IF($C9=DX$4,1,0)","v":0},null,{"$f":"IF($C9=DZ$4,1,0)","v":0}]
[null,null,2,{"$f":"HLOOKUP($C10,'Dados Gerais'!$D$5:$BK$10,6)","v":"ENCARREGADO SETORIAL"},null,null,null,null,{"$f":"HLOOKUP($C10,'Dados Gerais'!$D$5:$BK$14,10)","v":2},null,null,{"$f":"IF($C10=L$4,1,0)","v":0},null,1,null,0,null,0,null,0,null,0,null,0,null,0,null,0,null,0,null,0,null,0,null,0,null,0,null,0,null,0,null,0,null,0,null,0,null,0,null,0,null,0,null,0,null,0,null,0,null,0,null,0,null,0,null,0,null,0,null,0,null,0,null,0,null,0,null,0,null,0,null,0,null,0,null,0,null,0,null,0,null,0,null,0,null,0,null,0,null,0,null,0,null,0,null,0,null,0,null,0,null,0,null,0,null,0,null,0,null,0,null,0,null,0,null,0,null,0]
[null,null,null,null,null,null,null,null,null,null,null,0]
[]
[null,null,"ITEM","DESCRIÇÃO","QUANT ANUAL\nPOR POSTO","% ESTIMADO POR GÊNERO","Nº DE POSTOS","QUANT ANUAL\nTOTAL ESTIMADA","VALOR"]
[null,null,null,null,null,null,null,null,null,null,null,null,{"$f":"IF(SUM(L$8:L$11)>0,$E14*$I14,0)","v":0},null,{"$f":"IF(SUM(N$8:N$11)>0,$E14*$I14,0)","v":0},null,{"$f":"IF(SUM(P$8:P$11)>0,$E14*$I14,0)","v":0},null,{"$f":"IF(SUM(R$8:R$11)>0,$E14*$I14,0)","v":0},null,{"$f":"IF(SUM(T$8:T$11)>0,$E14*$I14,0)","v":0},null,{"$f":"IF(SUM(V$8:V$11)>0,$E14*$I14,0)","v":0},null,{"$f":"IF(SUM(X$8:X$11)>0,$E14*$I14,0)","v":0},null,{"$f":"IF(SUM(Z$8:Z$11)>0,$E14*$I14,0)","v":0},null,{"$f":"IF(SUM(AB$8:AB$11)>0,$E14*$I14,0)","v":0},null,{"$f":"IF(SUM(AD$8:AD$11)>0,$E14*$I14,0)","v":0},null,{"$f":"IF(SUM(AF$8:AF$11)>0,$E14*$I14,0)","v":0},null,{"$f":"IF(SUM(AH$8:AH$11)>0,$E14*$I14,0)","v":0},null,{"$f":"IF(SUM(AJ$8:AJ$11)>0,$E14*$I14,0)","v":0},null,{"$f":"IF(SUM(AL$8:AL$11)>0,$E14*$I14,0)","v":0},null,{"$f":"IF(SUM(AN$8:AN$11)>0,$E14*$I14,0)","v":0},null,{"$f":"IF(SUM(AP$8:AP$11)>0,$E14*$I14,0)","v":0},null,{"$f":"IF(SUM(AR$8:AR$11)>0,$E14*$I14,0)","v":0},null,{"$f":"IF(SUM(AT$8:AT$11)>0,$E14*$I14,0)","v":0},null,{"$f":"IF(SUM(AV$8:AV$11)>0,$E14*$I14,0)","v":0},null,{"$f":"IF(SUM(AX$8:AX$11)>0,$E14*$I14,0)","v":0},null,{"$f":"IF(SUM(AZ$8:AZ$11)>0,$E14*$I14,0)","v":0},null,{"$f":"IF(SUM(BB$8:BB$11)>0,$E14*$I14,0)","v":0},null,{"$f":"IF(SUM(BD$8:BD$11)>0,$E14*$I14,0)","v":0},null,{"$f":"IF(SUM(BF$8:BF$11)>0,$E14*$I14,0)","v":0},null,{"$f":"IF(SUM(BH$8:BH$11)>0,$E14*$I14,0)","v":0},null,{"$f":"IF(SUM(BJ$8:BJ$11)>0,$E14*$I14,0)","v":0},null,{"$f":"IF(SUM(BL$8:BL$11)>0,$E14*$I14,0)","v":0},null,{"$f":"IF(SUM(BN$8:BN$11)>0,$E14*$I14,0)","v":0},null,{"$f":"IF(SUM(BP$8:BP$11)>0,$E14*$I14,0)","v":0},null,{"$f":"IF(SUM(BR$8:BR$11)>0,$E14*$I14,0)","v":0},null,{"$f":"IF(SUM(BT$8:BT$11)>0,$E14*$I14,0)","v":0},null,{"$f":"IF(SUM(BV$8:BV$11)>0,$E14*$I14,0)","v":0},null,{"$f":"IF(SUM(BX$8:BX$11)>0,$E14*$I14,0)","v":0},null,{"$f":"IF(SUM(BZ$8:BZ$11)>0,$E14*$I14,0)","v":0},null,{"$f":"IF(SUM(CB$8:CB$11)>0,$E14*$I14,0)","v":0},null,{"$f":"IF(SUM(CD$8:CD$11)>0,$E14*$I14,0)","v":0},null,{"$f":"IF(SUM(CF$8:CF$11)>0,$E14*$I14,0)","v":0},null,{"$f":"IF(SUM(CH$8:CH$11)>0,$E14*$I14,0)","v":0},null,{"$f":"IF(SUM(CJ$8:CJ$11)>0,$E14*$I14,0)","v":0},null,{"$f":"IF(SUM(CL$8:CL$11)>0,$E14*$I14,0)","v":0},null,{"$f":"IF(SUM(CN$8:CN$11)>0,$E14*$I14,0)","v":0},null,{"$f":"IF(SUM(CP$8:CP$11)>0,$E14*$I14,0)","v":0},null,{"$f":"IF(SUM(CR$8:CR$11)>0,$E14*$I14,0)","v":0},null,{"$f":"IF(SUM(CT$8:CT$11)>0,$E14*$I14,0)","v":0},null,{"$f":"IF(SUM(CV$8:CV$11)>0,$E14*$I14,0)","v":0},null,{"$f":"IF(SUM(CX$8:CX$11)>0,$E14*$I14,0)","v":0},null,{"$f":"IF(SUM(CZ$8:CZ$11)>0,$E14*$I14,0)","v":0},null,{"$f":"IF(SUM(DB$8:DB$11)>0,$E14*$I14,0)","v":0},null,{"$f":"IF(SUM(DD$8:DD$11)>0,$E14*$I14,0)","v":0},null,{"$f":"IF(SUM(DF$8:DF$11)>0,$E14*$I14,0)","v":0},null,{"$f":"IF(SUM(DH$8:DH$11)>0,$E14*$I14,0)","v":0},null,{"$f":"IF(SUM(DJ$8:DJ$11)>0,$E14*$I14,0)","v":0},null,{"$f":"IF(SUM(DL$8:DL$11)>0,$E14*$I14,0)","v":0},null,{"$f":"IF(SUM(DN$8:DN$11)>0,$E14*$I14,0)","v":0},null,{"$f":"IF(SUM(DP$8:DP$11)>0,$E14*$I14,0)","v":0},null,{"$f":"IF(SUM(DR$8:DR$11)>0,$E14*$I14,0)","v":0},null,{"$f":"IF(SUM(DT$8:DT$11)>0,$E14*$I14,0)","v":0},null,{"$f":"IF(SUM(DV$8:DV$11)>0,$E14*$I14,0)","v":0},null,{"$f":"IF(SUM(DX$8:DX$11)>0,$E14*$I14,0)","v":0},null,{"$f":"IF(SUM(DZ$8:DZ$11)>0,$E14*$I14,0)","v":0}]
[null,null,"MASCULINO","Calça social na cor azul noite, em tecido gabardine, 70% poliéster e 30% algodão",4,{"$f":"ROUNDUP(1/2,2)","v":0.5},{"$f":"SUM($I$9:$I$10)","v":3},{"$f":"ROUNDUP(E15*F15*G15,0)","v":6},97.45,null,null,null,{"$f":"IF(SUM(L$8:L$11)>0,$H15*$I15,0)/SUM($I$9:$I$10)","v":194.9},null,{"$f":"IF(SUM(N$8:N$11)>0,$H15*$I15,0)/SUM($I$9:$I$10)","v":194.9},null,{"$f":"IF(SUM(P$8:P$11)>0,$H15*$I15,0)/SUM($I$9:$I$10)","v":0},null,{"$f":"IF(SUM(R$8:R$11)>0,$H15*$I15,0)","v":0},null,{"$f":"IF(SUM(T$8:T$11)>0,$H15*$I15,0)","v":0},null,{"$f":"IF(SUM(V$8:V$11)>0,$H15*$I15,0)","v":0},null,{"$f":"IF(SUM(X$8:X$11)>0,$H15*$I15,0)","v":0},null,{"$f":"IF(SUM(Z$8:Z$11)>0,$H15*$I15,0)","v":0},null,{"$f":"IF(SUM(AB$8:AB$11)>0,$H15*$I15,0)","v":0},null,{"$f":"IF(SUM(AD$8:AD$11)>0,$H15*$I15,0)","v":0},null,0,null,0,null,0,null,0,null,0,null,0,null,0,null,{"$f":"IF(SUM(AT$8:AT$11)>0,$H15*$I15,0)","v":0},null,0,null,0,null,0,null,0,null,0,null,0,null,0,null,0,null,0,null,0,null,0,null,0,null,0,null,0,null,0,null,0,null,0,null,0,null,0,null,0,null,0,null,0,null,0,null,0,null,0,null,0,null,0,null,0,null,0,null,0,null,0,null,{"$f":"IF(SUM(DF$8:DF$11)>0,$H15*$I15,0)","v":0},null,0,null,0,null,0,null,0,null,0,null,0,null,0,null,0,null,0,null,0]
[null,null,null,"Camisa social na cor azul claro, em tecido tricoline, 100% algodão",4,{"$f":"F15","v":0.5},3,{"$f":"ROUNDUP(E16*F16*G16,0)","v":6},79.5,null,null,null,{"$f":"IF(SUM(L$8:L$11)>0,$H16*$I16,0)/SUM($I$9:$I$10)","v":159},null,{"$f":"IF(SUM(N$8:N$11)>0,$H16*$I16,0)/SUM($I$9:$I$10)","v":159},null,0,null,0,null,0,null,0,null,0,null,0,null,0,null,0,null,{"$f":"IF(SUM(AF$8:AF$11)>0,$H16*$I16,0)","v":0},null,0,null,0,null,0,null,0,null,0,null,0,null,0,null,0,null,0,null,0,null,0,null,0,null,0,null,0,null,0,null,0,null,0,null,0,null,0,null,0,null,0,null,0,null,0,null,0,null,0,null,0,null,0,null,0,null,0,null,0,null,0,null,0,null,0,null,0,null,0,null,0,null,0,null,0,null,0,null,0,null,0,null,0,null,0,null,0,null,0,null,0,null,0,null,0,null,0]
[null,null,null,"Cinto em couro na cor preta",2,{"$f":"F16","v":0.5},3,3,59.18,null,null,null,59.18,null,{"$f":"IF(SUM(N$8:N$11)>0,$H17*$I17,0)/SUM($I$9:$I$10)","v":59.18},null,0,null,0,null,0,null,0,null,0,null,0,null,0,null,0,null,0,null,0,null,0,null,0,null,0,null,0,null,0,null,0,null,0,null,0,null,0,null,0,null,0,null,0,null,0,null,0,null,0,null,0,null,0,null,0,null,0,null,0,null,0,null,0,null,0,null,0,null,0,null,0,null,0,null,0,null,0,null,0,null,0,null,0,null,0,null,0,null,0,null,0,null,0,null,0,null,0,null,0,null,0,null,0,null,0,null,0,null,0,null,0,null,0,null,0]
[null,null,null,"Meia social na cor preta",4,0.5,3,6,11.54,null,null,null,23.08,null,{"$f":"IF(SUM(N$8:N$11)>0,$H18*$I18,0)/SUM($I$9:$I$10)","v":23.08},null,0,null,0,null,0,null,0,null,0,null,0,null,0,null,0,null,0,null,0,null,0,null,0,null,0,null,0,null,0,null,0,null,0,null,0,null,0,null,0,null,0,null,0,null,0,null,0,null,0,null,0,null,0,null,0,null,0,null,0,null,0,null,0,null,0,null,0,null,0,null,0,null,0,null,0,null,0,null,0,null,0,null,0,null,0,null,0,null,0,null,0,null,0,null,0,null,0,null,0,null,0,null,0,null,0,null,0,null,0,null,0,null,0,null,0]
[null,null,null,"Sapato social preto, em couro acolchoado, com solo antiderrapante",4,0.5,3,6,153.94999999999999,null,null,null,307.89999999999998,null,{"$f":"IF(SUM(N$8:N$11)>0,$H19*$I19,0)/SUM($I$9:$I$10)","v":307.89999999999998},null,0,null,0,null,0,null,0,null,0,null,0,null,0,null,0,null,0,null,0,null,0,null,0,null,0,null,0,null,0,null,0,null,0,null,0,null,0,null,0,null,0,null,0,null,0,null,0,null,0,null,0,null,0,null,0,null,0,null,0,null,0,null,0,null,0,null,0,null,0,null,0,null,0,null,0,null,0,null,0,null,0,null,0,null,0,null,0,null,0,null,0,null,0,null,0,null,0,null,0,null,0,null,0,null,0,null,0,null,0,null,0,null,0,null,0]
[null,null,"FEMININO","Saia social na cor azul noite, em tecido gabardine, 70% poliéster e 30% algodão",{"$f":"E15","v":4},0.5,3,6,82.45,null,null,null,{"$f":"IF(SUM(L$8:L$11)>0,$H20*$I20,0)/SUM($I$9:$I$10)","v":164.9},null,{"$f":"IF(SUM(N$8:N$11)>0,$H20*$I20,0)/SUM($I$9:$I$10)","v":164.9},null,0,null,0,null,0,null,0,null,0,null,0,null,0,null,0,null,0,null,0,null,0,null,0,null,0,null,0,null,0,null,0,null,0,null,0,null,0,null,0,null,0,null,0,null,0,null,0,null,0,null,0,null,0,null,0,null,0,null,0,null,0,null,0,null,0,null,0,null,0,null,0,null,0,null,0,null,0,null,0,null,0,null,0,null,0,null,0,null,0,null,0,null,0,null,0,null,0,null,0,null,0,null,0,null,0,null,0,null,0,null,0,null,0,null,0]
[null,null,null,"Camisa social na cor azul claro, em tecido tricoline, 100% algodão",{"$f":"E16","v":4},0.5,3,6,74.95,null,null,null,149.9,null,{"$f":"IF(SUM(N$8:N$11)>0,$H21*$I21,0)/SUM($I$9:$I$10)","v":149.9},null,0,null,0,null,0,null,0,null,0,null,0,null,0,null,0,null,0,null,0,null,0,null,0,null,0,null,0,null,0,null,0,null,0,null,0,null,0,null,0,null,0,null,0,null,0,null,0,null,0,null,0,null,0,null,0,null,0,null,0,null,0,null,0,null,0,null,0,null,0,null,0,null,0,null,0,null,0,null,0,null,0,null,0,null,0,null,0,null,0,null,0,null,0,null,0,null,0,null,0,null,0,null,0,null,0,null,0,null,0,null,0,null,0,null,0]
[null,null,null,"Cinto em couro na cor preta",{"$f":"E17","v":2},0.5,3,3,62.5,null,null,null,62.5,null,{"$f":"IF(SUM(N$8:N$11)>0,$H22*$I22,0)/SUM($I$9:$I$10)","v":62.5},null,0,null,0,null,0,null,0,null,0,null,0,null,0,null,0,null,{"$f":"IF(SUM(AF$8:AF$11)>0,$H22*$I22,0)","v":0},null,0,null,0,null,0,null,0,null,0,null,0,null,0,null,0,null,0,null,0,null,0,null,0,null,0,null,0,null,0,null,0,null,0,null,0,null,0,null,0,null,0,null,0,null,0,null,0,null,0,null,0,null,0,null,0,null,0,null,0,null,0,null,{"$f":"IF(SUM(CR$8:CR$11)>0,$H22*$I22,0)","v":0},null,0,null,0,null,0,null,0,null,0,null,0,null,0,null,0,null,0,null,0,null,0,null,0,null,0,null,0,null,0,null,0,null,0]
[null,null,null,"Meia social na cor preta",{"$f":"E18","v":4},0.5,3,6,21,null,null,null,42,null,{"$f":"IF(SUM(N$8:N$11)>0,$H23*$I23,0)/SUM($I$9:$I$10)","v":42},null,0,null,0,null,0,null,0,null,0,null,0,null,0,null,0,null,0,null,0,null,0,null,0,null,0,null,0,null,0,null,0,null,0,null,0,null,0,null,0,null,0,null,0,null,0,null,0,null,0,null,0,null,0,null,0,null,0,null,0,null,0,null,0,null,0,null,0,null,0,null,0,null,0,null,0,null,0,null,0,null,0,null,0,null,0,null,0,null,0,null,0,null,0,null,0,null,0,null,0,null,0,null,0,null,0,null,0,null,0,null,0,null,0,null,0]
[null,null,null,"Sapato social preto, em couro acolchoado, com solo antiderrapante",{"$f":"E19","v":4},0.5,3,6,105,null,null,null,210,null,{"$f":"IF(SUM(N$8:N$11)>0,$H24*$I24,0)/SUM($I$9:$I$10)","v":210},null,0,null,0,null,0,null,0,null,0,null,0,null,0,null,0,null,0,null,0,null,0,null,0,null,0,null,0,null,0,null,0,null,0,null,0,null,0,null,0,null,0,null,0,null,0,null,0,null,0,null,0,null,0,null,0,null,0,null,0,null,0,null,0,null,0,null,0,null,0,null,0,null,0,null,0,null,0,null,0,null,0,null,0,null,0,null,0,null,0,null,0,null,0,null,0,null,0,null,0,null,0,null,0,null,0,null,0,null,0,null,0,null,0,null,0]
[null,null,null,null,null,null,null,null,null,null,null,null,{"$f":"IF(SUM(L$8:L$11)>0,$E25*$I25,0)","v":0},null,{"$f":"IF(SUM(N$8:N$11)>0,$E25*$I25,0)","v":0},null,{"$f":"IF(SUM(P$8:P$11)>0,$E25*$I25,0)","v":0},null,{"$f":"IF(SUM(R$8:R$11)>0,$E25*$I25,0)","v":0},null,{"$f":"IF(SUM(T$8:T$11)>0,$E25*$I25,0)","v":0},null,{"$f":"IF(SUM(V$8:V$11)>0,$E25*$I25,0)","v":0},null,{"$f":"IF(SUM(X$8:X$11)>0,$E25*$I25,0)","v":0},null,{"$f":"IF(SUM(Z$8:Z$11)>0,$E25*$I25,0)","v":0},null,{"$f":"IF(SUM(AB$8:AB$11)>0,$E25*$I25,0)","v":0},null,{"$f":"IF(SUM(AD$8:AD$11)>0,$E25*$I25,0)","v":0},null,{"$f":"IF(SUM(AF$8:AF$11)>0,$E25*$I25,0)","v":0},null,{"$f":"IF(SUM(AH$8:AH$11)>0,$E25*$I25,0)","v":0},null,{"$f":"IF(SUM(AJ$8:AJ$11)>0,$E25*$I25,0)","v":0},null,{"$f":"IF(SUM(AL$8:AL$11)>0,$E25*$I25,0)","v":0},null,{"$f":"IF(SUM(AN$8:AN$11)>0,$E25*$I25,0)","v":0},null,{"$f":"IF(SUM(AP$8:AP$11)>0,$E25*$I25,0)","v":0},null,{"$f":"IF(SUM(AR$8:AR$11)>0,$E25*$I25,0)","v":0},null,{"$f":"IF(SUM(AT$8:AT$11)>0,$E25*$I25,0)","v":0},null,{"$f":"IF(SUM(AV$8:AV$11)>0,$E25*$I25,0)","v":0},null,{"$f":"IF(SUM(AX$8:AX$11)>0,$E25*$I25,0)","v":0},null,{"$f":"IF(SUM(AZ$8:AZ$11)>0,$E25*$I25,0)","v":0},null,{"$f":"IF(SUM(BB$8:BB$11)>0,$E25*$I25,0)","v":0},null,{"$f":"IF(SUM(BD$8:BD$11)>0,$E25*$I25,0)","v":0},null,{"$f":"IF(SUM(BF$8:BF$11)>0,$E25*$I25,0)","v":0},null,{"$f":"IF(SUM(BH$8:BH$11)>0,$E25*$I25,0)","v":0},null,{"$f":"IF(SUM(BJ$8:BJ$11)>0,$E25*$I25,0)","v":0},null,{"$f":"IF(SUM(BL$8:BL$11)>0,$E25*$I25,0)","v":0},null,{"$f":"IF(SUM(BN$8:BN$11)>0,$E25*$I25,0)","v":0},null,{"$f":"IF(SUM(BP$8:BP$11)>0,$E25*$I25,0)","v":0},null,{"$f":"IF(SUM(BR$8:BR$11)>0,$E25*$I25,0)","v":0},null,{"$f":"IF(SUM(BT$8:BT$11)>0,$E25*$I25,0)","v":0},null,{"$f":"IF(SUM(BV$8:BV$11)>0,$E25*$I25,0)","v":0},null,{"$f":"IF(SUM(BX$8:BX$11)>0,$E25*$I25,0)","v":0},null,{"$f":"IF(SUM(BZ$8:BZ$11)>0,$E25*$I25,0)","v":0},null,{"$f":"IF(SUM(CB$8:CB$11)>0,$E25*$I25,0)","v":0},null,{"$f":"IF(SUM(CD$8:CD$11)>0,$E25*$I25,0)","v":0},null,{"$f":"IF(SUM(CF$8:CF$11)>0,$E25*$I25,0)","v":0},null,{"$f":"IF(SUM(CH$8:CH$11)>0,$E25*$I25,0)","v":0},null,{"$f":"IF(SUM(CJ$8:CJ$11)>0,$E25*$I25,0)","v":0},null,{"$f":"IF(SUM(CL$8:CL$11)>0,$E25*$I25,0)","v":0},null,{"$f":"IF(SUM(CN$8:CN$11)>0,$E25*$I25,0)","v":0},null,{"$f":"IF(SUM(CP$8:CP$11)>0,$E25*$I25,0)","v":0},null,{"$f":"IF(SUM(CR$8:CR$11)>0,$E25*$I25,0)","v":0},null,{"$f":"IF(SUM(CT$8:CT$11)>0,$E25*$I25,0)","v":0},null,{"$f":"IF(SUM(CV$8:CV$11)>0,$E25*$I25,0)","v":0},null,{"$f":"IF(SUM(CX$8:CX$11)>0,$E25*$I25,0)","v":0},null,{"$f":"IF(SUM(CZ$8:CZ$11)>0,$E25*$I25,0)","v":0},null,{"$f":"IF(SUM(DB$8:DB$11)>0,$E25*$I25,0)","v":0},null,{"$f":"IF(SUM(DD$8:DD$11)>0,$E25*$I25,0)","v":0},null,{"$f":"IF(SUM(DF$8:DF$11)>0,$E25*$I25,0)","v":0},null,{"$f":"IF(SUM(DH$8:DH$11)>0,$E25*$I25,0)","v":0},null,{"$f":"IF(SUM(DJ$8:DJ$11)>0,$E25*$I25,0)","v":0},null,{"$f":"IF(SUM(DL$8:DL$11)>0,$E25*$I25,0)","v":0},null,{"$f":"IF(SUM(DN$8:DN$11)>0,$E25*$I25,0)","v":0},null,{"$f":"IF(SUM(DP$8:DP$11)>0,$E25*$I25,0)","v":0},null,{"$f":"IF(SUM(DR$8:DR$11)>0,$E25*$I25,0)","v":0},null,{"$f":"IF(SUM(DT$8:DT$11)>0,$E25*$I25,0)","v":0},null,{"$f":"IF(SUM(DV$8:DV$11)>0,$E25*$I25,0)","v":0},null,{"$f":"IF(SUM(DX$8:DX$11)>0,$E25*$I25,0)","v":0},null,{"$f":"IF(SUM(DZ$8:DZ$11)>0,$E25*$I25,0)","v":0}]
[]
[null,null,"CATEGORIAS",null,null,null,null,null,"QUANTIDADE"]
[null,null,null,null,null,null,null,null,null,null,null,{"$f":"IF($C28=L$4,1,0)","v":0},null,{"$f":"IF($C28=N$4,1,0)","v":0},null,{"$f":"IF($C28=P$4,1,0)","v":0},null,{"$f":"IF($C28=R$4,1,0)","v":0},null,{"$f":"IF($C28=T$4,1,0)","v":0},null,{"$f":"IF($C28=V$4,1,0)","v":0},null,{"$f":"IF($C28=X$4,1,0)","v":0},null,{"$f":"IF($C28=Z$4,1,0)","v":0},null,{"$f":"IF($C28=AB$4,1,0)","v":0},null,{"$f":"IF($C28=AD$4,1,0)","v":0},null,0,null,0,null,0,null,0,null,0,null,0,null,0,null,0,null,0,null,0,null,0,null,0,null,0,null,0,null,0,null,0,null,0,null,0,null,0,null,0,null,0,null,0,null,0,null,0,null,0,null,0,null,0,null,0,null,0,null,0,null,0,null,{"$f":"IF($C28=CP$4,1,0)","v":0},null,0,null,0,null,0,null,0,null,0,null,0,null,0,null,0,null,0,null,0,null,0,null,0,null,0,null,0,null,0,null,0,null,0,null,0]
[null,null,null,{"$f":"HLOOKUP($C29,'Dados Gerais'!$D$5:$BK$10,6)","v":{"$error":"#N/A"}},null,null,null,null,{"$f":"HLOOKUP($C29,'Dados Gerais'!$D$5:$BK$14,10)","v":{"$error":"#N/A"}},null,null,{"$f":"IF($C29=L$4,1,0)","v":0},null,0,null,0,null,0,null,0,null,0,null,0,null,0,null,0,null,0,null,0,null,0,null,0,null,0,null,0,null,0,null,0,null,0,null,0,null,0,null,0,null,0,null,0,null,0,null,0,null,0,null,0,null,0,null,0,null,0,null,0,null,0,null,0,null,0,null,0,null,0,null,0,null,0,null,0,null,0,null,0,null,0,null,0,null,0,null,0,null,0,null,0,null,0,null,0,null,0,null,0,null,0,null,0,null,0,null,0,null,0,null,0,null,0,null,0,null,0]
[null,null,null,{"$f":"HLOOKUP($C30,'Dados Gerais'!$D$5:$BK$10,6)","v":{"$error":"#N/A"}},null,null,null,null,{"$f":"HLOOKUP($C30,'Dados Gerais'!$D$5:$BK$14,10)","v":{"$error":"#N/A"}},null,null,0,null,0,null,0,null,{"$f":"IF($C30=R$4,1,0)","v":0},null,0,null,0,null,0,null,0,null,0,null,0,null,0,null,0,null,0,null,0,null,0,null,0,null,0,null,0,null,0,null,0,null,0,null,0,null,0,null,0,null,0,null,0,null,0,null,0,null,0,null,0,null,0,null,0,null,0,null,0,null,0,null,0,null,0,null,0,null,0,null,0,null,0,null,0,null,0,null,0,null,0,null,0,null,0,null,0,null,0,null,0,null,0,null,0,null,0,null,0,null,0,null,0,null,0,null,0,null,0,null,0]
[null,null,null,null,null,null,null,null,null,null,null,{"$f":"IF($C31=L$4,1,0)","v":0},null,{"$f":"IF($C31=N$4,1,0)","v":0},null,{"$f":"IF($C31=P$4,1,0)","v":0},null,0,null,0,null,0,null,0,null,0,null,0,null,0,null,{"$f":"IF($C31=AF$4,1,0)","v":0},null,0,null,0,null,0,null,0,null,0,null,0,null,0,null,0,null,0,null,0,null,0,null,0,null,0,null,0,null,0,null,0,null,0,null,0,null,0,null,0,null,0,null,0,null,0,null,0,null,0,null,0,null,0,null,0,null,0,null,0,null,0,null,0,null,0,null,0,null,0,null,0,null,0,null,0,null,0,null,0,null,0,null,0,null,0,null,0,null,0,null,0,null,0,null,0,null,0]
[]
[null,null,"ITEM","DESCRIÇÃO","QUANT ANUAL\nPOR POSTO",null,"Nº DE POSTOS","QUANT ANUAL\nTOTAL","VALOR"]
[null,null,null,null,null,null,null,null,null,null,null,null,{"$f":"IF(SUM(L$8:L$11)>0,$E34*$I34,0)","v":0},null,{"$f":"IF(SUM(N$8:N$11)>0,$E34*$I34,0)","v":0},null,{"$f":"IF(SUM(P$8:P$11)>0,$E34*$I34,0)","v":0},null,{"$f":"IF(SUM(R$8:R$11)>0,$E34*$I34,0)","v":0},null,{"$f":"IF(SUM(T$8:T$11)>0,$E34*$I34,0)","v":0},null,{"$f":"IF(SUM(V$8:V$11)>0,$E34*$I34,0)","v":0},null,{"$f":"IF(SUM(X$8:X$11)>0,$E34*$I34,0)","v":0},null,{"$f":"IF(SUM(Z$8:Z$11)>0,$E34*$I34,0)","v":0},null,{"$f":"IF(SUM(AB$8:AB$11)>0,$E34*$I34,0)","v":0},null,{"$f":"IF(SUM(AD$8:AD$11)>0,$E34*$I34,0)","v":0},null,{"$f":"IF(SUM(AF$8:AF$11)>0,$E34*$I34,0)","v":0},null,{"$f":"IF(SUM(AH$8:AH$11)>0,$E34*$I34,0)","v":0},null,{"$f":"IF(SUM(AJ$8:AJ$11)>0,$E34*$I34,0)","v":0},null,{"$f":"IF(SUM(AL$8:AL$11)>0,$E34*$I34,0)","v":0},null,{"$f":"IF(SUM(AN$8:AN$11)>0,$E34*$I34,0)","v":0},null,{"$f":"IF(SUM(AP$8:AP$11)>0,$E34*$I34,0)","v":0},null,{"$f":"IF(SUM(AR$8:AR$11)>0,$E34*$I34,0)","v":0},null,{"$f":"IF(SUM(AT$8:AT$11)>0,$E34*$I34,0)","v":0},null,{"$f":"IF(SUM(AV$8:AV$11)>0,$E34*$I34,0)","v":0},null,{"$f":"IF(SUM(AX$8:AX$11)>0,$E34*$I34,0)","v":0},null,{"$f":"IF(SUM(AZ$8:AZ$11)>0,$E34*$I34,0)","v":0},null,{"$f":"IF(SUM(BB$8:BB$11)>0,$E34*$I34,0)","v":0},null,{"$f":"IF(SUM(BD$8:BD$11)>0,$E34*$I34,0)","v":0},null,{"$f":"IF(SUM(BF$8:BF$11)>0,$E34*$I34,0)","v":0},null,{"$f":"IF(SUM(BH$8:BH$11)>0,$E34*$I34,0)","v":0},null,{"$f":"IF(SUM(BJ$8:BJ$11)>0,$E34*$I34,0)","v":0},null,{"$f":"IF(SUM(BL$8:BL$11)>0,$E34*$I34,0)","v":0},null,{"$f":"IF(SUM(BN$8:BN$11)>0,$E34*$I34,0)","v":0},null,{"$f":"IF(SUM(BP$8:BP$11)>0,$E34*$I34,0)","v":0},null,{"$f":"IF(SUM(BR$8:BR$11)>0,$E34*$I34,0)","v":0},null,{"$f":"IF(SUM(BT$8:BT$11)>0,$E34*$I34,0)","v":0},null,{"$f":"IF(SUM(BV$8:BV$11)>0,$E34*$I34,0)","v":0},null,{"$f":"IF(SUM(BX$8:BX$11)>0,$E34*$I34,0)","v":0},null,{"$f":"IF(SUM(BZ$8:BZ$11)>0,$E34*$I34,0)","v":0},null,{"$f":"IF(SUM(CB$8:CB$11)>0,$E34*$I34,0)","v":0},null,{"$f":"IF(SUM(CD$8:CD$11)>0,$E34*$I34,0)","v":0},null,{"$f":"IF(SUM(CF$8:CF$11)>0,$E34*$I34,0)","v":0},null,{"$f":"IF(SUM(CH$8:CH$11)>0,$E34*$I34,0)","v":0},null,{"$f":"IF(SUM(CJ$8:CJ$11)>0,$E34*$I34,0)","v":0},null,{"$f":"IF(SUM(CL$8:CL$11)>0,$E34*$I34,0)","v":0},null,{"$f":"IF(SUM(CN$8:CN$11)>0,$E34*$I34,0)","v":0},null,{"$f":"IF(SUM(CP$8:CP$11)>0,$E34*$I34,0)","v":0},null,{"$f":"IF(SUM(CR$8:CR$11)>0,$E34*$I34,0)","v":0},null,{"$f":"IF(SUM(CT$8:CT$11)>0,$E34*$I34,0)","v":0},null,{"$f":"IF(SUM(CV$8:CV$11)>0,$E34*$I34,0)","v":0},null,{"$f":"IF(SUM(CX$8:CX$11)>0,$E34*$I34,0)","v":0},null,{"$f":"IF(SUM(CZ$8:CZ$11)>0,$E34*$I34,0)","v":0},null,{"$f":"IF(SUM(DB$8:DB$11)>0,$E34*$I34,0)","v":0},null,{"$f":"IF(SUM(DD$8:DD$11)>0,$E34*$I34,0)","v":0},null,{"$f":"IF(SUM(DF$8:DF$11)>0,$E34*$I34,0)","v":0},null,{"$f":"IF(SUM(DH$8:DH$11)>0,$E34*$I34,0)","v":0},null,{"$f":"IF(SUM(DJ$8:DJ$11)>0,$E34*$I34,0)","v":0},null,{"$f":"IF(SUM(DL$8:DL$11)>0,$E34*$I34,0)","v":0},null,{"$f":"IF(SUM(DN$8:DN$11)>0,$E34*$I34,0)","v":0},null,{"$f":"IF(SUM(DP$8:DP$11)>0,$E34*$I34,0)","v":0},null,{"$f":"IF(SUM(DR$8:DR$11)>0,$E34*$I34,0)","v":0},null,{"$f":"IF(SUM(DT$8:DT$11)>0,$E34*$I34,0)","v":0},null,{"$f":"IF(SUM(DV$8:DV$11)>0,$E34*$I34,0)","v":0},null,{"$f":"IF(SUM(DX$8:DX$11)>0,$E34*$I34,0)","v":0},null,{"$f":"IF(SUM(DZ$8:DZ$11)>0,$E34*$I34,0)","v":0}]
[null,null,7,null,4,null,{"$f":"I29+I30","v":{"$error":"#N/A"}},{"$f":"G35*E35","v":{"$error":"#N/A"}},null,null,null,null,{"$f":"IF(SUM(L$29:L$31)>0,$E35*$I35,0)","v":0},null,{"$f":"IF(SUM(N$29:N$31)>0,$E35*$I35,0)","v":0},null,{"$f":"IF(SUM(P$29:P$31)>0,$E35*$I35,0)","v":0},null,{"$f":"IF(SUM(R$29:R$31)>0,$E35*$I35,0)","v":0},null,{"$f":"IF(SUM(T$29:T$31)>0,$E35*$I35,0)","v":0},null,{"$f":"IF(SUM(V$29:V$31)>0,$E35*$I35,0)","v":0},null,{"$f":"IF(SUM(X$29:X$31)>0,$E35*$I35,0)","v":0},null,{"$f":"IF(SUM(Z$29:Z$31)>0,$E35*$I35,0)","v":0},null,{"$f":"IF(SUM(AB$29:AB$31)>0,$E35*$I35,0)","v":0},null,{"$f":"IF(SUM(AD$29:AD$31)>0,$E35*$I35,0)","v":0},null,{"$f":"IF(SUM(AF$29:AF$31)>0,$E35*$I35,0)","v":0},null,{"$f":"IF(SUM(AH$29:AH$31)>0,$E35*$I35,0)","v":0},null,{"$f":"IF(SUM(AJ$29:AJ$31)>0,$E35*$I35,0)","v":0},null,{"$f":"IF(SUM(AL$29:AL$31)>0,$E35*$I35,0)","v":0},null,{"$f":"IF(SUM(AN$29:AN$31)>0,$E35*$I35,0)","v":0},null,{"$f":"IF(SUM(AP$29:AP$31)>0,$E35*$I35,0)","v":0},null,{"$f":"IF(SUM(AR$29:AR$31)>0,$E35*$I35,0)","v":0},null,{"$f":"IF(SUM(AT$29:AT$31)>0,$E35*$I35,0)","v":0},null,{"$f":"IF(SUM(AV$29:AV$31)>0,$E35*$I35,0)","v":0},null,{"$f":"IF(SUM(AX$29:AX$31)>0,$E35*$I35,0)","v":0},null,{"$f":"IF(SUM(AZ$29:AZ$31)>0,$E35*$I35,0)","v":0},null,{"$f":"IF(SUM(BB$29:BB$31)>0,$E35*$I35,0)","v":0},null,{"$f":"IF(SUM(BD$29:BD$31)>0,$E35*$I35,0)","v":0},null,{"$f":"IF(SUM(BF$29:BF$31)>0,$E35*$I35,0)","v":0},null,{"$f":"IF(SUM(BH$29:BH$31)>0,$E35*$I35,0)","v":0},null,{"$f":"IF(SUM(BJ$29:BJ$31)>0,$E35*$I35,0)","v":0},null,{"$f":"IF(SUM(BL$29:BL$31)>0,$E35*$I35,0)","v":0},null,{"$f":"IF(SUM(BN$29:BN$31)>0,$E35*$I35,0)","v":0},null,{"$f":"IF(SUM(BP$29:BP$31)>0,$E35*$I35,0)","v":0},null,{"$f":"IF(SUM(BR$29:BR$31)>0,$E35*$I35,0)","v":0},null,{"$f":"IF(SUM(BT$29:BT$31)>0,$E35*$I35,0)","v":0},null,{"$f":"IF(SUM(BV$29:BV$31)>0,$E35*$I35,0)","v":0},null,{"$f":"IF(SUM(BX$29:BX$31)>0,$E35*$I35,0)","v":0},null,{"$f":"IF(SUM(BZ$29:BZ$31)>0,$E35*$I35,0)","v":0},null,{"$f":"IF(SUM(CB$29:CB$31)>0,$E35*$I35,0)","v":0},null,{"$f":"IF(SUM(CD$29:CD$31)>0,$E35*$I35,0)","v":0},null,{"$f":"IF(SUM(CF$29:CF$31)>0,$E35*$I35,0)","v":0},null,{"$f":"IF(SUM(CH$29:CH$31)>0,$E35*$I35,0)","v":0},null,{"$f":"IF(SUM(CJ$29:CJ$31)>0,$E35*$I35,0)","v":0},null,{"$f":"IF(SUM(CL$29:CL$31)>0,$E35*$I35,0)","v":0},null,{"$f":"IF(SUM(CN$29:CN$31)>0,$E35*$I35,0)","v":0},null,{"$f":"IF(SUM(CP$29:CP$31)>0,$E35*$I35,0)","v":0},null,{"$f":"IF(SUM(CR$29:CR$31)>0,$E35*$I35,0)","v":0},null,{"$f":"IF(SUM(CT$29:CT$31)>0,$E35*$I35,0)","v":0},null,{"$f":"IF(SUM(CV$29:CV$31)>0,$E35*$I35,0)","v":0},null,{"$f":"IF(SUM(CX$29:CX$31)>0,$E35*$I35,0)","v":0},null,{"$f":"IF(SUM(CZ$29:CZ$31)>0,$E35*$I35,0)","v":0},null,{"$f":"IF(SUM(DB$29:DB$31)>0,$E35*$I35,0)","v":0},null,{"$f":"IF(SUM(DD$29:DD$31)>0,$E35*$I35,0)","v":0},null,{"$f":"IF(SUM(DF$29:DF$31)>0,$E35*$I35,0)","v":0},null,{"$f":"IF(SUM(DH$29:DH$31)>0,$E35*$I35,0)","v":0},null,{"$f":"IF(SUM(DJ$29:DJ$31)>0,$E35*$I35,0)","v":0},null,{"$f":"IF(SUM(DL$29:DL$31)>0,$E35*$I35,0)","v":0},null,{"$f":"IF(SUM(DN$29:DN$31)>0,$E35*$I35,0)","v":0},null,{"$f":"IF(SUM(DP$29:DP$31)>0,$E35*$I35,0)","v":0},null,{"$f":"IF(SUM(DR$29:DR$31)>0,$E35*$I35,0)","v":0},null,{"$f":"IF(SUM(DT$29:DT$31)>0,$E35*$I35,0)","v":0},null,{"$f":"IF(SUM(DV$29:DV$31)>0,$E35*$I35,0)","v":0},null,{"$f":"IF(SUM(DX$29:DX$31)>0,$E35*$I35,0)","v":0},null,{"$f":"IF(SUM(DZ$29:DZ$31)>0,$E35*$I35,0)","v":0}]
[null,null,8,null,{"$f":"E35","v":4},null,{"$f":"G35","v":{"$error":"#N/A"}},{"$error":"#N/A"},null,null,null,null,0,null,0,null,0,null,0,null,0,null,0,null,0,null,0,null,0,null,0,null,0,null,0,null,0,null,0,null,0,null,0,null,0,null,0,null,0,null,0,null,0,null,0,null,0,null,0,null,0,null,0,null,0,null,0,null,0,null,0,null,0,null,0,null,0,null,0,null,0,null,0,null,0,null,0,null,0,null,0,null,0,null,0,null,0,null,0,null,0,null,0,null,0,null,0,null,0,null,0,null,0,null,0,null,0,null,0,null,0,null,0,null,0,null,0,null,0,null,0]
[null,null,9,null,{"$f":"E36","v":4},null,{"$f":"G36","v":{"$error":"#N/A"}},{"$error":"#N/A"},null,null,null,null,0,null,0,null,0,null,0,null,0,null,0,null,0,null,0,null,0,null,0,null,0,null,0,null,0,null,0,null,0,null,0,null,0,null,0,null,0,null,0,null,0,null,0,null,0,null,0,null,0,null,0,null,0,null,0,null,0,null,0,null,0,null,0,null,0,null,0,null,0,null,0,null,0,null,0,null,0,null,0,null,0,null,0,null,0,null,0,null,0,null,0,null,0,null,0,null,0,null,0,null,0,null,0,null,0,null,0,null,0,null,0,null,0,null,0,null,0,null,0]
[null,null,10,null,4,null,{"$error":"#N/A"},{"$error":"#N/A"},null,null,null,null,0,null,0,null,0,null,0,null,0,null,0,null,0,null,0,null,0,null,0,null,0,null,0,null,0,null,0,null,0,null,0,null,0,null,0,null,0,null,0,null,0,null,0,null,0,null,0,null,0,null,0,null,0,null,0,null,0,null,0,null,0,null,0,null,0,null,0,null,0,null,0,null,0,null,0,null,0,null,0,null,0,null,0,null,0,null,0,null,0,null,0,null,0,null,0,null,0,null,0,null,0,null,0,null,0,null,0,null,0,null,0,null,0,null,0,null,0,null,0]
[null,null,11,null,4,null,{"$error":"#N/A"},{"$error":"#N/A"},null,null,null,null,0,null,0,null,0,null,0,null,0,null,0,null,0,null,0,null,0,null,0,null,0,null,0,null,0,null,0,null,0,null,0,null,0,null,0,null,0,null,0,null,0,null,0,null,0,null,0,null,0,null,0,null,0,null,0,null,0,null,0,null,0,null,0,null,0,null,0,null,0,null,0,null,0,null,0,null,0,null,0,null,0,null,0,null,0,null,0,null,0,null,0,null,0,null,0,null,0,null,0,null,0,null,0,null,0,null,0,null,0,null,0,null,0,null,0,null,0,null,0]
[null,null,12,null,4,null,{"$error":"#N/A"},{"$error":"#N/A"},null,null,null,null,0,null,0,null,0,null,0,null,0,null,0,null,0,null,0,null,0,null,0,null,0,null,0,null,0,null,0,null,0,null,0,null,0,null,0,null,0,null,0,null,0,null,0,null,0,null,0,null,0,null,0,null,0,null,0,null,0,null,0,null,0,null,0,null,0,null,0,null,0,null,0,null,0,null,0,null,0,null,0,null,0,null,0,null,0,null,0,null,0,null,0,null,0,null,0,null,0,null,0,null,0,null,0,null,0,null,0,null,0,null,0,null,0,null,0,null,0,null,0]
[null,null,null,null,null,null,null,null,null,null,null,null,0,null,0,null,0,null,0,null,0,null,0,null,0,null,0,null,0,null,0,null,0,null,0,null,0,null,0,null,0,null,0,null,0,null,0,null,0,null,0,null,0,null,0,null,0,null,0,null,0,null,0,null,0,null,0,null,0,null,0,null,0,null,0,null,0,null,0,null,0,null,0,null,0,null,0,null,0,null,0,null,0,null,0,null,0,null,0,null,0,null,0,null,0,null,0,null,0,null,0,null,0,null,0,null,0,null,0,null,0,null,0,null,0,null,0,null,0,null,0]
[null,null,"CATEGORIAS",null,null,null,null,null,"QUANTIDADE"]
[null,null,null,null,null,null,null,null,null,null,null,{"$f":"IF($C43=L$4,1,0)","v":0},null,{"$f":"IF($C43=N$4,1,0)","v":0},null,{"$f":"IF($C43=P$4,1,0)","v":0},null,{"$f":"IF($C43=R$4,1,0)","v":0},null,{"$f":"IF($C43=T$4,1,0)","v":0},null,{"$f":"IF($C43=V$4,1,0)","v":0},null,{"$f":"IF($C43=X$4,1,0)","v":0},null,{"$f":"IF($C43=Z$4,1,0)","v":0},null,{"$f":"IF($C43=AB$4,1,0)","v":0},null,{"$f":"IF($C43=AD$4,1,0)","v":0},null,0,null,0,null,0,null,0,null,0,null,0,null,0,null,0,null,0,null,0,null,0,null,0,null,0,null,0,null,0,null,0,null,0,null,0,null,0,null,0,null,0,null,0,null,0,null,0,null,0,null,0,null,0,null,0,null,0,null,0,null,0,null,{"$f":"IF($C43=CP$4,1,0)","v":0},null,0,null,0,null,0,null,0,null,0,null,0,null,0,null,0,null,0,null,0,null,0,null,0,null,0,null,0,null,0,null,0,null,0,null,0]
[null,null,null,{"$f":"HLOOKUP($C44,'Dados Gerais'!$D$5:$BK$10,6)","v":{"$error":"#N/A"}},null,null,null,null,{"$f":"HLOOKUP($C44,'Dados Gerais'!$D$5:$BK$14,10)","v":{"$error":"#N/A"}},null,null,{"$f":"IF($C44=L$4,1,0)","v":0},null,0,null,0,null,0,null,0,null,0,null,0,null,0,null,0,null,0,null,0,null,0,null,0,null,0,null,0,null,0,null,0,null,0,null,0,null,0,null,0,null,0,null,0,null,0,null,0,null,0,null,0,null,0,null,0,null,0,null,0,null,0,null,0,null,0,null,0,null,0,null,0,null,0,null,0,null,0,null,0,null,0,null,0,null,0,null,0,null,0,null,0,null,0,null,0,null,0,null,0,null,0,null,0,null,0,null,0,null,0,null,0,null,0,null,0,null,0]
[null,null,null,{"$f":"HLOOKUP($C45,'Dados Gerais'!$D$5:$BK$10,6)","v":{"$error":"#N/A"}},null,null,null,null,{"$f":"HLOOKUP($C45,'Dados Gerais'!$D$5:$BK$14,10)","v":{"$error":"#N/A"}},null,null,0,null,0,null,0,null,{"$f":"IF($C45=R$4,1,0)","v":0},null,0,null,0,null,0,null,0,null,0,null,0,null,0,null,0,null,0,null,0,null,0,null,0,null,0,null,0,null,0,null,0,null,0,null,0,null,0,null,0,null,0,null,0,null,0,null,0,null,0,null,0,null,0,null,0,null,0,null,0,null,0,null,0,null,0,null,0,null,0,null,0,null,0,null,0,null,0,null,0,null,0,null,0,null,0,null,0,null,0,null,0,null,0,null,0,null,0,null,0,null,0,null,0,null,0,null,0,null,0,null,0]
[null,null,null,null,null,null,null,null,null,null,null,{"$f":"IF($C46=L$4,1,0)","v":0},null,{"$f":"IF($C46=N$4,1,0)","v":0},null,{"$f":"IF($C46=P$4,1,0)","v":0},null,0,null,0,null,0,null,0,null,0,null,0,null,0,null,{"$f":"IF($C46=AF$4,1,0)","v":0},null,0,null,0,null,0,null,0,null,0,null,0,null,0,null,0,null,0,null,0,null,0,null,0,null,0,null,0,null,0,null,0,null,0,null,0,null,0,null,0,null,0,null,0,null,0,null,0,null,0,null,0,null,0,null,0,null,0,null,0,null,0,null,0,null,0,null,0,null,0,null,0,null,0,null,0,null,0,null,0,null,0,null,0,null,0,null,0,null,0,null,0,null,0,null,0,null,0]
[]
[null,null,"ITEM","DESCRIÇÃO","QUANT ANUAL\nPOR POSTO",null,"Nº DE POSTOS","QUANT ANUAL\nTOTAL","VALOR"]
[null,null,null,null,null,null,null,null,null,null,null,null,{"$f":"IF(SUM(L$8:L$11)>0,$E49*$I49,0)","v":0},null,{"$f":"IF(SUM(N$8:N$11)>0,$E49*$I49,0)","v":0},null,{"$f":"IF(SUM(P$8:P$11)>0,$E49*$I49,0)","v":0},null,{"$f":"IF(SUM(R$8:R$11)>0,$E49*$I49,0)","v":0},null,{"$f":"IF(SUM(T$8:T$11)>0,$E49*$I49,0)","v":0},null,{"$f":"IF(SUM(V$8:V$11)>0,$E49*$I49,0)","v":0},null,{"$f":"IF(SUM(X$8:X$11)>0,$E49*$I49,0)","v":0},null,{"$f":"IF(SUM(Z$8:Z$11)>0,$E49*$I49,0)","v":0},null,{"$f":"IF(SUM(AB$8:AB$11)>0,$E49*$I49,0)","v":0},null,{"$f":"IF(SUM(AD$8:AD$11)>0,$E49*$I49,0)","v":0},null,{"$f":"IF(SUM(AF$8:AF$11)>0,$E49*$I49,0)","v":0},null,{"$f":"IF(SUM(AH$8:AH$11)>0,$E49*$I49,0)","v":0},null,{"$f":"IF(SUM(AJ$8:AJ$11)>0,$E49*$I49,0)","v":0},null,{"$f":"IF(SUM(AL$8:AL$11)>0,$E49*$I49,0)","v":0},null,{"$f":"IF(SUM(AN$8:AN$11)>0,$E49*$I49,0)","v":0},null,{"$f":"IF(SUM(AP$8:AP$11)>0,$E49*$I49,0)","v":0},null,{"$f":"IF(SUM(AR$8:AR$11)>0,$E49*$I49,0)","v":0},null,{"$f":"IF(SUM(AT$8:AT$11)>0,$E49*$I49,0)","v":0},null,{"$f":"IF(SUM(AV$8:AV$11)>0,$E49*$I49,0)","v":0},null,{"$f":"IF(SUM(AX$8:AX$11)>0,$E49*$I49,0)","v":0},null,{"$f":"IF(SUM(AZ$8:AZ$11)>0,$E49*$I49,0)","v":0},null,{"$f":"IF(SUM(BB$8:BB$11)>0,$E49*$I49,0)","v":0},null,{"$f":"IF(SUM(BD$8:BD$11)>0,$E49*$I49,0)","v":0},null,{"$f":"IF(SUM(BF$8:BF$11)>0,$E49*$I49,0)","v":0},null,{"$f":"IF(SUM(BH$8:BH$11)>0,$E49*$I49,0)","v":0},null,{"$f":"IF(SUM(BJ$8:BJ$11)>0,$E49*$I49,0)","v":0},null,{"$f":"IF(SUM(BL$8:BL$11)>0,$E49*$I49,0)","v":0},null,{"$f":"IF(SUM(BN$8:BN$11)>0,$E49*$I49,0)","v":0},null,{"$f":"IF(SUM(BP$8:BP$11)>0,$E49*$I49,0)","v":0},null,{"$f":"IF(SUM(BR$8:BR$11)>0,$E49*$I49,0)","v":0},null,{"$f":"IF(SUM(BT$8:BT$11)>0,$E49*$I49,0)","v":0},null,{"$f":"IF(SUM(BV$8:BV$11)>0,$E49*$I49,0)","v":0},null,{"$f":"IF(SUM(BX$8:BX$11)>0,$E49*$I49,0)","v":0},null,{"$f":"IF(SUM(BZ$8:BZ$11)>0,$E49*$I49,0)","v":0},null,{"$f":"IF(SUM(CB$8:CB$11)>0,$E49*$I49,0)","v":0},null,{"$f":"IF(SUM(CD$8:CD$11)>0,$E49*$I49,0)","v":0},null,{"$f":"IF(SUM(CF$8:CF$11)>0,$E49*$I49,0)","v":0},null,{"$f":"IF(SUM(CH$8:CH$11)>0,$E49*$I49,0)","v":0},null,{"$f":"IF(SUM(CJ$8:CJ$11)>0,$E49*$I49,0)","v":0},null,{"$f":"IF(SUM(CL$8:CL$11)>0,$E49*$I49,0)","v":0},null,{"$f":"IF(SUM(CN$8:CN$11)>0,$E49*$I49,0)","v":0},null,{"$f":"IF(SUM(CP$8:CP$11)>0,$E49*$I49,0)","v":0},null,{"$f":"IF(SUM(CR$8:CR$11)>0,$E49*$I49,0)","v":0},null,{"$f":"IF(SUM(CT$8:CT$11)>0,$E49*$I49,0)","v":0},null,{"$f":"IF(SUM(CV$8:CV$11)>0,$E49*$I49,0)","v":0},null,{"$f":"IF(SUM(CX$8:CX$11)>0,$E49*$I49,0)","v":0},null,{"$f":"IF(SUM(CZ$8:CZ$11)>0,$E49*$I49,0)","v":0},null,{"$f":"IF(SUM(DB$8:DB$11)>0,$E49*$I49,0)","v":0},null,{"$f":"IF(SUM(DD$8:DD$11)>0,$E49*$I49,0)","v":0},null,{"$f":"IF(SUM(DF$8:DF$11)>0,$E49*$I49,0)","v":0},null,{"$f":"IF(SUM(DH$8:DH$11)>0,$E49*$I49,0)","v":0},null,{"$f":"IF(SUM(DJ$8:DJ$11)>0,$E49*$I49,0)","v":0},null,{"$f":"IF(SUM(DL$8:DL$11)>0,$E49*$I49,0)","v":0},null,{"$f":"IF(SUM(DN$8:DN$11)>0,$E49*$I49,0)","v":0},null,{"$f":"IF(SUM(DP$8:DP$11)>0,$E49*$I49,0)","v":0},null,{"$f":"IF(SUM(DR$8:DR$11)>0,$E49*$I49,0)","v":0},null,{"$f":"IF(SUM(DT$8:DT$11)>0,$E49*$I49,0)","v":0},null,{"$f":"IF(SUM(DV$8:DV$11)>0,$E49*$I49,0)","v":0},null,{"$f":"IF(SUM(DX$8:DX$11)>0,$E49*$I49,0)","v":0},null,{"$f":"IF(SUM(DZ$8:DZ$11)>0,$E49*$I49,0)","v":0}]
[null,null,13,null,4,null,{"$f":"I44+I45","v":{"$error":"#N/A"}},{"$f":"G50*E50","v":{"$error":"#N/A"}},null,null,null,null,{"$f":"IF(SUM(L$43:L$46)>0,$E50*$I50,0)","v":0},null,{"$f":"IF(SUM(N$43:N$46)>0,$E50*$I50,0)","v":0},null,{"$f":"IF(SUM(P$43:P$46)>0,$E50*$I50,0)","v":0},null,{"$f":"IF(SUM(R$43:R$46)>0,$E50*$I50,0)","v":0},null,{"$f":"IF(SUM(T$43:T$46)>0,$E50*$I50,0)","v":0},null,{"$f":"IF(SUM(V$43:V$46)>0,$E50*$I50,0)","v":0},null,{"$f":"IF(SUM(X$43:X$46)>0,$E50*$I50,0)","v":0},null,{"$f":"IF(SUM(Z$43:Z$46)>0,$E50*$I50,0)","v":0},null,{"$f":"IF(SUM(AB$43:AB$46)>0,$E50*$I50,0)","v":0},null,{"$f":"IF(SUM(AD$43:AD$46)>0,$E50*$I50,0)","v":0},null,{"$f":"IF(SUM(AF$43:AF$46)>0,$E50*$I50,0)","v":0},null,{"$f":"IF(SUM(AH$43:AH$46)>0,$E50*$I50,0)","v":0},null,{"$f":"IF(SUM(AJ$43:AJ$46)>0,$E50*$I50,0)","v":0},null,{"$f":"IF(SUM(AL$43:AL$46)>0,$E50*$I50,0)","v":0},null,{"$f":"IF(SUM(AN$43:AN$46)>0,$E50*$I50,0)","v":0},null,{"$f":"IF(SUM(AP$43:AP$46)>0,$E50*$I50,0)","v":0},null,{"$f":"IF(SUM(AR$43:AR$46)>0,$E50*$I50,0)","v":0},null,{"$f":"IF(SUM(AT$43:AT$46)>0,$E50*$I50,0)","v":0},null,{"$f":"IF(SUM(AV$43:AV$46)>0,$E50*$I50,0)","v":0},null,{"$f":"IF(SUM(AX$43:AX$46)>0,$E50*$I50,0)","v":0},null,{"$f":"IF(SUM(AZ$43:AZ$46)>0,$E50*$I50,0)","v":0},null,{"$f":"IF(SUM(BB$43:BB$46)>0,$E50*$I50,0)","v":0},null,{"$f":"IF(SUM(BD$43:BD$46)>0,$E50*$I50,0)","v":0},null,{"$f":"IF(SUM(BF$43:BF$46)>0,$E50*$I50,0)","v":0},null,{"$f":"IF(SUM(BH$43:BH$46)>0,$E50*$I50,0)","v":0},null,{"$f":"IF(SUM(BJ$43:BJ$46)>0,$E50*$I50,0)","v":0},null,{"$f":"IF(SUM(BL$43:BL$46)>0,$E50*$I50,0)","v":0},null,{"$f":"IF(SUM(BN$43:BN$46)>0,$E50*$I50,0)","v":0},null,{"$f":"IF(SUM(BP$43:BP$46)>0,$E50*$I50,0)","v":0},null,{"$f":"IF(SUM(BR$43:BR$46)>0,$E50*$I50,0)","v":0},null,{"$f":"IF(SUM(BT$43:BT$46)>0,$E50*$I50,0)","v":0},null,{"$f":"IF(SUM(BV$43:BV$46)>0,$E50*$I50,0)","v":0},null,{"$f":"IF(SUM(BX$43:BX$46)>0,$E50*$I50,0)","v":0},null,{"$f":"IF(SUM(BZ$43:BZ$46)>0,$E50*$I50,0)","v":0},null,{"$f":"IF(SUM(CB$43:CB$46)>0,$E50*$I50,0)","v":0},null,{"$f":"IF(SUM(CD$43:CD$46)>0,$E50*$I50,0)","v":0},null,{"$f":"IF(SUM(CF$43:CF$46)>0,$E50*$I50,0)","v":0},null,{"$f":"IF(SUM(CH$43:CH$46)>0,$E50*$I50,0)","v":0},null,{"$f":"IF(SUM(CJ$43:CJ$46)>0,$E50*$I50,0)","v":0},null,{"$f":"IF(SUM(CL$43:CL$46)>0,$E50*$I50,0)","v":0},null,{"$f":"IF(SUM(CN$43:CN$46)>0,$E50*$I50,0)","v":0},null,{"$f":"IF(SUM(CP$43:CP$46)>0,$E50*$I50,0)","v":0},null,{"$f":"IF(SUM(CR$43:CR$46)>0,$E50*$I50,0)","v":0},null,{"$f":"IF(SUM(CT$43:CT$46)>0,$E50*$I50,0)","v":0},null,{"$f":"IF(SUM(CV$43:CV$46)>0,$E50*$I50,0)","v":0},null,{"$f":"IF(SUM(CX$43:CX$46)>0,$E50*$I50,0)","v":0},null,{"$f":"IF(SUM(CZ$43:CZ$46)>0,$E50*$I50,0)","v":0},null,{"$f":"IF(SUM(DB$43:DB$46)>0,$E50*$I50,0)","v":0},null,{"$f":"IF(SUM(DD$43:DD$46)>0,$E50*$I50,0)","v":0},null,{"$f":"IF(SUM(DF$43:DF$46)>0,$E50*$I50,0)","v":0},null,{"$f":"IF(SUM(DH$43:DH$46)>0,$E50*$I50,0)","v":0},null,{"$f":"IF(SUM(DJ$43:DJ$46)>0,$E50*$I50,0)","v":0},null,{"$f":"IF(SUM(DL$43:DL$46)>0,$E50*$I50,0)","v":0},null,{"$f":"IF(SUM(DN$43:DN$46)>0,$E50*$I50,0)","v":0},null,{"$f":"IF(SUM(DP$43:DP$46)>0,$E50*$I50,0)","v":0},null,{"$f":"IF(SUM(DR$43:DR$46)>0,$E50*$I50,0)","v":0},null,{"$f":"IF(SUM(DT$43:DT$46)>0,$E50*$I50,0)","v":0},null,{"$f":"IF(SUM(DV$43:DV$46)>0,$E50*$I50,0)","v":0},null,{"$f":"IF(SUM(DX$43:DX$46)>0,$E50*$I50,0)","v":0},null,{"$f":"IF(SUM(DZ$43:DZ$46)>0,$E50*$I50,0)","v":0}]
[null,null,14,null,{"$f":"E50","v":4},null,{"$f":"G50","v":{"$error":"#N/A"}},{"$error":"#N/A"},null,null,null,null,{"$f":"IF(SUM(L$43:L$46)>0,$E51*$I51,0)","v":0},null,{"$f":"IF(SUM(N$43:N$46)>0,$E51*$I51,0)","v":0},null,{"$f":"IF(SUM(P$43:P$46)>0,$E51*$I51,0)","v":0},null,{"$f":"IF(SUM(R$43:R$46)>0,$E51*$I51,0)","v":0},null,{"$f":"IF(SUM(T$43:T$46)>0,$E51*$I51,0)","v":0},null,{"$f":"IF(SUM(V$43:V$46)>0,$E51*$I51,0)","v":0},null,{"$f":"IF(SUM(X$43:X$46)>0,$E51*$I51,0)","v":0},null,{"$f":"IF(SUM(Z$43:Z$46)>0,$E51*$I51,0)","v":0},null,{"$f":"IF(SUM(AB$43:AB$46)>0,$E51*$I51,0)","v":0},null,{"$f":"IF(SUM(AD$43:AD$46)>0,$E51*$I51,0)","v":0},null,0,null,0,null,0,null,0,null,0,null,0,null,0,null,0,null,0,null,0,null,0,null,0,null,0,null,0,null,0,null,0,null,0,null,0,null,0,null,0,null,0,null,0,null,0,null,0,null,0,null,0,null,0,null,0,null,0,null,0,null,0,null,0,null,0,null,0,null,0,null,0,null,0,null,0,null,0,null,0,null,0,null,0,null,0,null,0,null,0,null,0,null,0,null,0,null,0,null,0]
[null,null,15,null,4,null,{"$error":"#N/A"},{"$error":"#N/A"},null,null,null,null,{"$f":"IF(SUM(L$43:L$46)>0,$E52*$I52,0)","v":0},null,{"$f":"IF(SUM(N$43:N$46)>0,$E52*$I52,0)","v":0},null,{"$f":"IF(SUM(P$43:P$46)>0,$E52*$I52,0)","v":0},null,{"$f":"IF(SUM(R$43:R$46)>0,$E52*$I52,0)","v":0},null,{"$f":"IF(SUM(T$43:T$46)>0,$E52*$I52,0)","v":0},null,{"$f":"IF(SUM(V$43:V$46)>0,$E52*$I52,0)","v":0},null,{"$f":"IF(SUM(X$43:X$46)>0,$E52*$I52,0)","v":0},null,{"$f":"IF(SUM(Z$43:Z$46)>0,$E52*$I52,0)","v":0},null,{"$f":"IF(SUM(AB$43:AB$46)>0,$E52*$I52,0)","v":0},null,{"$f":"IF(SUM(AD$43:AD$46)>0,$E52*$I52,0)","v":0},null,0,null,0,null,0,null,0,null,0,null,0,null,0,null,0,null,0,null,0,null,0,null,0,null,0,null,0,null,0,null,0,null,0,null,0,null,0,null,0,null,0,null,0,null,0,null,0,null,0,null,0,null,0,null,0,null,0,null,0,null,0,null,0,null,0,null,0,null,0,null,0,null,0,null,0,null,0,null,0,null,0,null,0,null,0,null,0,null,0,null,0,null,0,null,0,null,0,null,0]
[null,null,"CATEGORIAS",null,null,null,null,null,"QUANTIDADE",null,null,{"$f":"SUM(L8:L51)","v":1}]
[null,null,null,null,null,null,null,null,null,null,null,{"$f":"IF($C54=L$4,1,0)","v":0},null,0,null,0,null,0,null,0,null,0,null,0,null,0,null,{"$f":"IF($C54=AB$4,1,0)","v":0},null,0,null,0,null,0,null,0,null,0,null,0,null,0,null,0,null,0,null,0,null,0,null,0,null,0,null,0,null,0,null,0,null,0,null,0,null,0,null,0,null,0,null,0,null,0,null,0,null,0,null,0,null,0,null,0,null,0,null,0,null,0,null,{"$f":"IF($C54=CN$4,1,0)","v":0},null,0,null,0,null,0,null,0,null,0,null,0,null,0,null,0,null,0,null,0,null,0,null,0,null,0,null,0,null,0,null,0,null,0,null,0,null,0]
[null,null,3,{"$f":"HLOOKUP($C55,'Dados Gerais'!$D$5:$BK$10,6)","v":"ENCARREGADO DE SERVIÇO"},null,6,7,null,{"$f":"HLOOKUP($C55,'Dados Gerais'!$D$5:$BK$14,10)","v":12},null,null,0,null,0,null,1,null,{"$f":"IF($C55=R$4,1,0)","v":0},null,0,null,0,null,0,null,0,null,0,null,0,null,0,null,0,null,0,null,0,null,0,null,0,null,0,null,0,null,0,null,0,null,0,null,0,null,0,null,0,null,0,null,0,null,0,null,0,null,0,null,0,null,0,null,0,null,0,null,0,null,0,null,0,null,0,null,0,null,0,null,0,null,0,null,0,null,0,null,0,null,0,null,0,null,0,null,0,null,0,null,0,null,0,null,0,null,0,null,0,null,0,null,0,null,0,null,0,null,0,null,0]
[null,null,4,{"$f":"HLOOKUP($C56,'Dados Gerais'!$D$5:$BK$10,6)","v":"AUXILIAR DE ENCARREGADO"},null,null,null,null,{"$f":"HLOOKUP($C56,'Dados Gerais'!$D$5:$BK$14,10)","v":1},null,null,0,null,0,null,0,null,1,null,0,null,0,null,0,null,0,null,0,null,0,null,{"$f":"IF($C56=AF$4,1,0)","v":0},null,0,null,0,null,0,null,0,null,0,null,0,null,0,null,0,null,0,null,0,null,0,null,0,null,0,null,0,null,0,null,0,null,0,null,0,null,0,null,0,null,0,null,0,null,0,null,0,null,0,null,0,null,0,null,0,null,0,null,0,null,0,null,0,null,0,null,0,null,0,null,0,null,0,null,0,null,0,null,0,null,0,null,0,null,0,null,0,null,0,null,0,null,0,null,0,null,0]
[null,null,null,null,null,null,null,null,null,null,null,0,null,0,null,0,null,0,null,0,null,0,null,0,null,0,null,0,null,0,null,0,null,0,null,0,null,0,null,0,null,0,null,0,null,0,null,0,null,0,null,0,null,0,null,0,null,0,null,0,null,0,null,0,null,0,null,0,null,0,null,0,null,0,null,0,null,0,null,0,null,0,null,0,null,0,null,0,null,0,null,0,null,0,null,0,null,0,null,0,null,0,null,0,null,0,null,0,null,0,null,0,null,0,null,0,null,0,null,0,null,0,null,0,null,0,null,0,null,0]
[]
[null,null,"ITEM","DESCRIÇÃO","QUANT ANUAL\nPOR POSTO","% ESTIMADO POR GÊNERO","Nº DE POSTOS","QUANT ANUAL\nTOTAL ESTIMADA","VALOR"]
[null,null,null,null,null,null,null,null,null,null,null,null,{"$f":"IF(SUM(L$8:L$11)>0,$E60*$I60,0)","v":0},null,{"$f":"IF(SUM(N$8:N$11)>0,$E60*$I60,0)","v":0},null,{"$f":"IF(SUM(P$8:P$11)>0,$E60*$I60,0)","v":0},null,{"$f":"IF(SUM(R$8:R$11)>0,$E60*$I60,0)","v":0},null,{"$f":"IF(SUM(T$8:T$11)>0,$E60*$I60,0)","v":0},null,{"$f":"IF(SUM(V$8:V$11)>0,$E60*$I60,0)","v":0},null,{"$f":"IF(SUM(X$8:X$11)>0,$E60*$I60,0)","v":0},null,{"$f":"IF(SUM(Z$8:Z$11)>0,$E60*$I60,0)","v":0},null,{"$f":"IF(SUM(AB$8:AB$11)>0,$E60*$I60,0)","v":0},null,{"$f":"IF(SUM(AD$8:AD$11)>0,$E60*$I60,0)","v":0},null,{"$f":"IF(SUM(AF$8:AF$11)>0,$E60*$I60,0)","v":0},null,{"$f":"IF(SUM(AH$8:AH$11)>0,$E60*$I60,0)","v":0},null,{"$f":"IF(SUM(AJ$8:AJ$11)>0,$E60*$I60,0)","v":0},null,{"$f":"IF(SUM(AL$8:AL$11)>0,$E60*$I60,0)","v":0},null,{"$f":"IF(SUM(AN$8:AN$11)>0,$E60*$I60,0)","v":0},null,{"$f":"IF(SUM(AP$8:AP$11)>0,$E60*$I60,0)","v":0},null,{"$f":"IF(SUM(AR$8:AR$11)>0,$E60*$I60,0)","v":0},null,{"$f":"IF(SUM(AT$8:AT$11)>0,$E60*$I60,0)","v":0},null,{"$f":"IF(SUM(AV$8:AV$11)>0,$E60*$I60,0)","v":0},null,{"$f":"IF(SUM(AX$8:AX$11)>0,$E60*$I60,0)","v":0},null,{"$f":"IF(SUM(AZ$8:AZ$11)>0,$E60*$I60,0)","v":0},null,{"$f":"IF(SUM(BB$8:BB$11)>0,$E60*$I60,0)","v":0},null,{"$f":"IF(SUM(BD$8:BD$11)>0,$E60*$I60,0)","v":0},null,{"$f":"IF(SUM(BF$8:BF$11)>0,$E60*$I60,0)","v":0},null,{"$f":"IF(SUM(BH$8:BH$11)>0,$E60*$I60,0)","v":0},null,{"$f":"IF(SUM(BJ$8:BJ$11)>0,$E60*$I60,0)","v":0},null,{"$f":"IF(SUM(BL$8:BL$11)>0,$E60*$I60,0)","v":0},null,{"$f":"IF(SUM(BN$8:BN$11)>0,$E60*$I60,0)","v":0},null,{"$f":"IF(SUM(BP$8:BP$11)>0,$E60*$I60,0)","v":0},null,{"$f":"IF(SUM(BR$8:BR$11)>0,$E60*$I60,0)","v":0},null,{"$f":"IF(SUM(BT$8:BT$11)>0,$E60*$I60,0)","v":0},null,{"$f":"IF(SUM(BV$8:BV$11)>0,$E60*$I60,0)","v":0},null,{"$f":"IF(SUM(BX$8:BX$11)>0,$E60*$I60,0)","v":0},null,{"$f":"IF(SUM(BZ$8:BZ$11)>0,$E60*$I60,0)","v":0},null,{"$f":"IF(SUM(CB$8:CB$11)>0,$E60*$I60,0)","v":0},null,{"$f":"IF(SUM(CD$8:CD$11)>0,$E60*$I60,0)","v":0},null,{"$f":"IF(SUM(CF$8:CF$11)>0,$E60*$I60,0)","v":0},null,{"$f":"IF(SUM(CH$8:CH$11)>0,$E60*$I60,0)","v":0},null,{"$f":"IF(SUM(CJ$8:CJ$11)>0,$E60*$I60,0)","v":0},null,{"$f":"IF(SUM(CL$8:CL$11)>0,$E60*$I60,0)","v":0},null,{"$f":"IF(SUM(CN$8:CN$11)>0,$E60*$I60,0)","v":0},null,{"$f":"IF(SUM(CP$8:CP$11)>0,$E60*$I60,0)","v":0},null,{"$f":"IF(SUM(CR$8:CR$11)>0,$E60*$I60,0)","v":0},null,{"$f":"IF(SUM(CT$8:CT$11)>0,$E60*$I60,0)","v":0},null,{"$f":"IF(SUM(CV$8:CV$11)>0,$E60*$I60,0)","v":0},null,{"$f":"IF(SUM(CX$8:CX$11)>0,$E60*$I60,0)","v":0},null,{"$f":"IF(SUM(CZ$8:CZ$11)>0,$E60*$I60,0)","v":0},null,{"$f":"IF(SUM(DB$8:DB$11)>0,$E60*$I60,0)","v":0},null,{"$f":"IF(SUM(DD$8:DD$11)>0,$E60*$I60,0)","v":0},null,{"$f":"IF(SUM(DF$8:DF$11)>0,$E60*$I60,0)","v":0},null,{"$f":"IF(SUM(DH$8:DH$11)>0,$E60*$I60,0)","v":0},null,{"$f":"IF(SUM(DJ$8:DJ$11)>0,$E60*$I60,0)","v":0},null,{"$f":"IF(SUM(DL$8:DL$11)>0,$E60*$I60,0)","v":0},null,{"$f":"IF(SUM(DN$8:DN$11)>0,$E60*$I60,0)","v":0},null,{"$f":"IF(SUM(DP$8:DP$11)>0,$E60*$I60,0)","v":0},null,{"$f":"IF(SUM(DR$8:DR$11)>0,$E60*$I60,0)","v":0},null,{"$f":"IF(SUM(DT$8:DT$11)>0,$E60*$I60,0)","v":0},null,{"$f":"IF(SUM(DV$8:DV$11)>0,$E60*$I60,0)","v":0},null,{"$f":"IF(SUM(DX$8:DX$11)>0,$E60*$I60,0)","v":0},null,{"$f":"IF(SUM(DZ$8:DZ$11)>0,$E60*$I60,0)","v":0}]
[null,null,"MASCULINO","Calça social de tecido leve, na cor preta, em microfibra",4,{"$f":"ROUNDUP(9/16,2)","v":0.57000000000000006},{"$f":"SUM($I$55:$I$56)","v":13},{"$f":"ROUNDUP(E61*F61*G61,0)","v":30},72.45,null,null,null,{"$f":"IF(SUM(L$54:L$57)>0,$H61*$I61,0)/SUM($I$55:$I56)","v":0},null,{"$f":"IF(SUM(N$54:N$57)>0,$H61*$I61,0)/SUM($I$55:$I56)","v":0},null,{"$f":"IF(SUM(P$54:P$57)>0,$H61*$I61,0)/SUM($I$55:$I$56)","v":167.19230769230768},null,{"$f":"IF(SUM(R$54:R$57)>0,$H61*$I61,0)/SUM($I$55:$I$56)","v":167.19230769230768},null,{"$f":"IF(SUM(T$54:T$57)>0,$H61*$I61,0)/SUM($I$55:$I$56)","v":0},null,{"$f":"IF(SUM(V$54:V$57)>0,$H61*$I61,0)","v":0},null,{"$f":"IF(SUM(X$54:X$57)>0,$H61*$I61,0)","v":0},null,{"$f":"IF(SUM(Z$54:Z$57)>0,$H61*$I61,0)","v":0},null,{"$f":"IF(SUM(AB$54:AB$57)>0,$H61*$I61,0)","v":0},null,{"$f":"IF(SUM(AD$54:AD$57)>0,$H61*$I61,0)","v":0},null,{"$f":"IF(SUM(AF$54:AF$57)>0,$H61*$I61,0)","v":0},null,{"$f":"IF(SUM(AH$54:AH$57)>0,$H61*$I61,0)","v":0},null,{"$f":"IF(SUM(AJ$54:AJ$57)>0,$H61*$I61,0)","v":0},null,{"$f":"IF(SUM(AL$54:AL$57)>0,$H61*$I61,0)","v":0},null,{"$f":"IF(SUM(AN$54:AN$57)>0,$H61*$I61,0)","v":0},null,{"$f":"IF(SUM(AP$54:AP$57)>0,$H61*$I61,0)","v":0},null,{"$f":"IF(SUM(AR$54:AR$57)>0,$H61*$I61,0)","v":0},null,{"$f":"IF(SUM(AT$54:AT$57)>0,$H61*$I61,0)","v":0},null,{"$f":"IF(SUM(AV$54:AV$57)>0,$H61*$I61,0)","v":0},null,{"$f":"IF(SUM(AX$54:AX$57)>0,$H61*$I61,0)","v":0},null,{"$f":"IF(SUM(AZ$54:AZ$57)>0,$H61*$I61,0)","v":0},null,{"$f":"IF(SUM(BB$54:BB$57)>0,$H61*$I61,0)","v":0},null,{"$f":"IF(SUM(BD$54:BD$57)>0,$H61*$I61,0)","v":0},null,{"$f":"IF(SUM(BF$54:BF$57)>0,$H61*$I61,0)","v":0},null,{"$f":"IF(SUM(BH$54:BH$57)>0,$H61*$I61,0)","v":0},null,{"$f":"IF(SUM(BJ$54:BJ$57)>0,$H61*$I61,0)","v":0},null,{"$f":"IF(SUM(BL$54:BL$57)>0,$H61*$I61,0)","v":0},null,{"$f":"IF(SUM(BN$54:BN$57)>0,$H61*$I61,0)","v":0},null,{"$f":"IF(SUM(BP$54:BP$57)>0,$H61*$I61,0)","v":0},null,{"$f":"IF(SUM(BR$54:BR$57)>0,$H61*$I61,0)","v":0},null,{"$f":"IF(SUM(BT$54:BT$57)>0,$H61*$I61,0)","v":0},null,{"$f":"IF(SUM(BV$54:BV$57)>0,$H61*$I61,0)","v":0},null,{"$f":"IF(SUM(BX$54:BX$57)>0,$H61*$I61,0)","v":0},null,{"$f":"IF(SUM(BZ$54:BZ$57)>0,$H61*$I61,0)","v":0},null,{"$f":"IF(SUM(CB$54:CB$57)>0,$H61*$I61,0)","v":0},null,{"$f":"IF(SUM(CD$54:CD$57)>0,$H61*$I61,0)","v":0},null,{"$f":"IF(SUM(CF$54:CF$57)>0,$H61*$I61,0)","v":0},null,{"$f":"IF(SUM(CH$54:CH$57)>0,$H61*$I61,0)","v":0},null,{"$f":"IF(SUM(CJ$54:CJ$57)>0,$H61*$I61,0)","v":0},null,{"$f":"IF(SUM(CL$54:CL$57)>0,$H61*$I61,0)","v":0},null,{"$f":"IF(SUM(CN$54:CN$57)>0,$H61*$I61,0)","v":0},null,{"$f":"IF(SUM(CP$54:CP$57)>0,$H61*$I61,0)","v":0},null,{"$f":"IF(SUM(CR$54:CR$57)>0,$H61*$I61,0)","v":0},null,{"$f":"IF(SUM(CT$54:CT$57)>0,$H61*$I61,0)","v":0},null,{"$f":"IF(SUM(CV$54:CV$57)>0,$H61*$I61,0)","v":0},null,{"$f":"IF(SUM(CX$54:CX$57)>0,$H61*$I61,0)","v":0},null,{"$f":"IF(SUM(CZ$54:CZ$57)>0,$H61*$I61,0)","v":0},null,{"$f":"IF(SUM(DB$54:DB$57)>0,$H61*$I61,0)","v":0},null,{"$f":"IF(SUM(DD$54:DD$57)>0,$H61*$I61,0)","v":0},null,{"$f":"IF(SUM(DF$54:DF$57)>0,$H61*$I61,0)","v":0},null,{"$f":"IF(SUM(DH$54:DH$57)>0,$H61*$I61,0)","v":0},null,{"$f":"IF(SUM(DJ$54:DJ$57)>0,$H61*$I61,0)","v":0},null,{"$f":"IF(SUM(DL$54:DL$57)>0,$H61*$I61,0)","v":0},null,{"$f":"IF(SUM(DN$54:DN$57)>0,$H61*$I61,0)","v":0},null,{"$f":"IF(SUM(DP$54:DP$57)>0,$H61*$I61,0)","v":0},null,{"$f":"IF(SUM(DR$54:DR$57)>0,$H61*$I61,0)","v":0},null,{"$f":"IF(SUM(DT$54:DT$57)>0,$H61*$I61,0)","v":0},null,{"$f":"IF(SUM(DV$54:DV$57)>0,$H61*$I61,0)","v":0},null,{"$f":"IF(SUM(DX$54:DX$57)>0,$H61*$I61,0)","v":0},null,{"$f":"IF(SUM(DZ$54:DZ$57)>0,$H61*$I61,0)","v":0}]
[null,null,null,"Camisa social branca, tecido leve em algodão",4,{"$f":"F61","v":0.57000000000000006},13,{"$f":"ROUNDUP(E62*F62*G62,0)","v":30},79.95,null,null,null,{"$f":"IF(SUM(L$54:L$57)>0,$H62*$I62,0)/SUM($I$55:$I57)","v":0},null,{"$f":"IF(SUM(N$54:N$57)>0,$H62*$I62,0)/SUM($I$55:$I57)","v":0},null,{"$f":"IF(SUM(P$54:P$57)>0,$H62*$I62,0)/SUM($I$55:$I$56)","v":184.5},null,{"$f":"IF(SUM(R$54:R$57)>0,$H62*$I62,0)/SUM($I$55:$I$56)","v":184.5},null,0,null,0,null,0,null,0,null,0,null,0,null,0,null,0,null,0,null,0,null,0,null,0,null,0,null,0,null,0,null,0,null,0,null,0,null,0,null,0,null,0,null,0,null,0,null,0,null,0,null,0,null,0,null,0,null,0,null,0,null,0,null,0,null,0,null,0,null,0,null,0,null,0,null,0,null,0,null,0,null,0,null,0,null,0,null,0,null,0,null,0,null,0,null,0,null,0,null,0,null,0,null,0,null,0,null,0,null,0,null,0]
[null,null,null,"Cinto em couro na cor preta",2,{"$f":"F62","v":0.57000000000000006},13,{"$f":"ROUNDUP(E63*F63*G63,0)","v":15},{"$f":"I17","v":59.18},null,null,null,{"$f":"IF(SUM(L$54:L$57)>0,$H63*$I63,0)/SUM($I$55:$I59)","v":0},null,{"$f":"IF(SUM(N$54:N$57)>0,$H63*$I63,0)/SUM($I$55:$I59)","v":0},null,68.284615384615392,null,68.284615384615392,null,0,null,0,null,0,null,0,null,0,null,0,null,0,null,0,null,0,null,0,null,0,null,0,null,0,null,0,null,0,null,0,null,0,null,0,null,0,null,0,null,0,null,0,null,0,null,0,null,0,null,0,null,0,null,0,null,0,null,0,null,0,null,0,null,0,null,0,null,0,null,0,null,0,null,0,null,0,null,0,null,0,null,0,null,0,null,0,null,0,null,0,null,0,null,0,null,0,null,0,null,0,null,0,null,0,null,0,null,0,null,0]
[null,null,null,"Meia social na cor preta",4,0.57000000000000006,13,{"$f":"ROUNDUP(E64*F64*G64,0)","v":30},{"$f":"I18","v":11.54},null,null,null,{"$f":"IF(SUM(L$54:L$57)>0,$H64*$I64,0)/SUM($I$55:$I60)","v":0},null,{"$f":"IF(SUM(N$54:N$57)>0,$H64*$I64,0)/SUM($I$55:$I60)","v":0},null,26.630769230769229,null,26.630769230769229,null,0,null,0,null,0,null,0,null,0,null,0,null,0,null,0,null,0,null,0,null,0,null,0,null,0,null,0,null,0,null,0,null,0,null,0,null,0,null,0,null,0,null,0,null,0,null,0,null,0,null,0,null,0,null,0,null,0,null,0,null,0,null,0,null,0,null,0,null,0,null,0,null,0,null,0,null,0,null,0,null,0,null,0,null,0,null,0,null,0,null,0,null,0,null,0,null,0,null,0,null,0,null,0,null,0,null,0,null,0,null,0]
[null,null,null,"Sapato social preto, em couro acolchoado, com solo antiderrapante",4,0.57000000000000006,13,{"$f":"ROUNDUP(E65*F65*G65,0)","v":30},{"$f":"I19","v":153.94999999999999},null,null,null,{"$f":"IF(SUM(L$54:L$57)>0,$H65*$I65,0)/SUM($I$55:$I61)","v":0},null,{"$f":"IF(SUM(N$54:N$57)>0,$H65*$I65,0)/SUM($I$55:$I61)","v":0},null,355.26923076923077,null,355.26923076923077,null,0,null,0,null,0,null,0,null,0,null,0,null,0,null,0,null,0,null,0,null,0,null,0,null,0,null,0,null,0,null,0,null,0,null,0,null,0,null,0,null,0,null,0,null,0,null,0,null,0,null,0,null,0,null,0,null,0,null,0,null,0,null,0,null,0,null,0,null,0,null,0,null,0,null,0,null,0,null,0,null,0,null,0,null,0,null,0,null,0,null,0,null,0,null,0,null,0,null,0,null,0,null,0,null,0,null,0,null,0,null,0]
[null,null,"FEMININO","Saia de tecido leve, na cor preta, em microfibra",{"$f":"E61","v":4},{"$f":"100%-F65","v":0.42999999999999994},13,23,72.45,null,null,null,{"$f":"IF(SUM(L$54:L$57)>0,$H66*$I66,0)/SUM($I$55:$I62)","v":0},null,{"$f":"IF(SUM(N$54:N$57)>0,$H66*$I66,0)/SUM($I$55:$I62)","v":0},null,128.18076923076924,null,128.18076923076924,null,0,null,0,null,0,null,0,null,0,null,0,null,0,null,0,null,0,null,0,null,0,null,0,null,0,null,0,null,0,null,0,null,0,null,0,null,0,null,0,null,0,null,0,null,0,null,0,null,0,null,0,null,0,null,0,null,0,null,0,null,0,null,0,null,0,null,0,null,0,null,0,null,0,null,0,null,0,null,0,null,0,null,0,null,0,null,0,null,0,null,0,null,0,null,0,null,0,null,0,null,0,null,0,null,0,null,0,null,0,null,0]
[null,null,null,"Blusa social branca, tecido leve em algodão",{"$f":"E62","v":4},{"$f":"F66","v":0.42999999999999994},13,23,82.45,null,null,null,{"$f":"IF(SUM(L$54:L$57)>0,$H67*$I67,0)/SUM($I$55:$I62)","v":0},null,{"$f":"IF(SUM(N$54:N$57)>0,$H67*$I67,0)/SUM($I$55:$I62)","v":0},null,{"$f":"IF(SUM(P$54:P$57)>0,$H67*$I67,0)/SUM($I$55:$I$56)","v":145.87307692307692},null,145.87307692307692,null,0,null,0,null,0,null,0,null,0,null,0,null,0,null,0,null,0,null,0,null,0,null,0,null,0,null,0,null,0,null,0,null,0,null,0,null,0,null,0,null,0,null,0,null,0,null,0,null,0,null,0,null,0,null,0,null,0,null,0,null,0,null,0,null,0,null,0,null,0,null,0,null,0,null,0,null,0,null,0,null,0,null,0,null,0,null,0,null,0,null,0,null,0,null,0,null,0,null,0,null,0,null,0,null,0,null,0,null,0,null,0]
[null,null,null,"Cinto em couro na cor preta",{"$f":"E63","v":2},0.42999999999999994,13,{"$f":"ROUNDUP(E68*F68*G68,0)","v":12},59.95,null,null,null,{"$f":"IF(SUM(L$54:L$57)>0,$H68*$I68,0)/SUM($I$55:$I64)","v":0},null,{"$f":"IF(SUM(N$54:N$57)>0,$H68*$I68,0)/SUM($I$55:$I64)","v":0},null,55.338461538461544,null,55.338461538461544,null,0,null,0,null,0,null,0,null,0,null,0,null,0,null,0,null,0,null,0,null,0,null,0,null,0,null,0,null,0,null,0,null,0,null,0,null,0,null,0,null,0,null,0,null,0,null,0,null,0,null,0,null,0,null,0,null,0,null,0,null,0,null,0,null,0,null,0,null,0,null,0,null,0,null,0,null,0,null,0,null,0,null,0,null,0,null,0,null,0,null,0,null,0,null,0,null,0,null,0,null,0,null,0,null,0,null,0,null,0,null,0]
[null,null,null,"Meia social na cor preta",{"$f":"E64","v":4},0.42999999999999994,13,23,{"$f":"I23","v":21},null,null,null,{"$f":"IF(SUM(L$54:L$57)>0,$H69*$I69,0)/SUM($I$55:$I65)","v":0},null,{"$f":"IF(SUM(N$54:N$57)>0,$H69*$I69,0)/SUM($I$55:$I65)","v":0},null,37.153846153846153,null,37.153846153846153,null,0,null,0,null,0,null,0,null,0,null,0,null,0,null,0,null,0,null,0,null,0,null,0,null,0,null,0,null,0,null,0,null,0,null,0,null,0,null,0,null,0,null,0,null,0,null,0,null,0,null,0,null,0,null,0,null,0,null,0,null,0,null,0,null,0,null,0,null,0,null,0,null,0,null,0,null,0,null,0,null,0,null,0,null,0,null,0,null,0,null,0,null,0,null,0,null,0,null,0,null,0,null,0,null,0,null,0,null,0,null,0]
[null,null,null,"Sapato social preto, em couro acolchoado, com solo antiderrapante",{"$f":"E65","v":4},0.42999999999999994,13,23,{"$f":"I24","v":105},null,null,null,{"$f":"IF(SUM(L$54:L$57)>0,$H70*$I70,0)/SUM($I$55:$I66)","v":0},null,{"$f":"IF(SUM(N$54:N$57)>0,$H70*$I70,0)/SUM($I$55:$I66)","v":0},null,185.76923076923077,null,{"$f":"IF(SUM(R$54:R$57)>0,$H70*$I70,0)/SUM($I$55:$I$56)","v":185.76923076923077},null,0,null,0,null,0,null,0,null,0,null,0,null,0,null,0,null,0,null,0,null,0,null,0,null,0,null,0,null,0,null,0,null,0,null,0,null,0,null,0,null,0,null,0,null,0,null,0,null,0,null,0,null,0,null,0,null,0,null,0,null,0,null,0,null,0,null,0,null,0,null,0,null,0,null,0,null,0,null,0,null,0,null,0,null,0,null,0,null,0,null,0,null,0,null,0,null,0,null,0,null,0,null,0,null,0,null,0,null,0,null,0]
[null,null,null,null,null,null,null,null,null,null,null,null,{"$f":"IF(SUM(L$8:L$11)>0,$E71*$I71,0)","v":0},null,{"$f":"IF(SUM(N$8:N$11)>0,$E71*$I71,0)","v":0},null,0,null,0,null,0,null,{"$f":"IF(SUM(V$8:V$11)>0,$E71*$I71,0)","v":0},null,{"$f":"IF(SUM(X$8:X$11)>0,$E71*$I71,0)","v":0},null,{"$f":"IF(SUM(Z$8:Z$11)>0,$E71*$I71,0)","v":0},null,{"$f":"IF(SUM(AB$8:AB$11)>0,$E71*$I71,0)","v":0},null,{"$f":"IF(SUM(AD$8:AD$11)>0,$E71*$I71,0)","v":0},null,{"$f":"IF(SUM(AF$8:AF$11)>0,$E71*$I71,0)","v":0},null,{"$f":"IF(SUM(AH$8:AH$11)>0,$E71*$I71,0)","v":0},null,{"$f":"IF(SUM(AJ$8:AJ$11)>0,$E71*$I71,0)","v":0},null,{"$f":"IF(SUM(AL$8:AL$11)>0,$E71*$I71,0)","v":0},null,{"$f":"IF(SUM(AN$8:AN$11)>0,$E71*$I71,0)","v":0},null,{"$f":"IF(SUM(AP$8:AP$11)>0,$E71*$I71,0)","v":0},null,{"$f":"IF(SUM(AR$8:AR$11)>0,$E71*$I71,0)","v":0},null,{"$f":"IF(SUM(AT$8:AT$11)>0,$E71*$I71,0)","v":0},null,{"$f":"IF(SUM(AV$8:AV$11)>0,$E71*$I71,0)","v":0},null,{"$f":"IF(SUM(AX$8:AX$11)>0,$E71*$I71,0)","v":0},null,{"$f":"IF(SUM(AZ$8:AZ$11)>0,$E71*$I71,0)","v":0},null,{"$f":"IF(SUM(BB$8:BB$11)>0,$E71*$I71,0)","v":0},null,{"$f":"IF(SUM(BD$8:BD$11)>0,$E71*$I71,0)","v":0},null,{"$f":"IF(SUM(BF$8:BF$11)>0,$E71*$I71,0)","v":0},null,{"$f":"IF(SUM(BH$8:BH$11)>0,$E71*$I71,0)","v":0},null,{"$f":"IF(SUM(BJ$8:BJ$11)>0,$E71*$I71,0)","v":0},null,{"$f":"IF(SUM(BL$8:BL$11)>0,$E71*$I71,0)","v":0},null,{"$f":"IF(SUM(BN$8:BN$11)>0,$E71*$I71,0)","v":0},null,{"$f":"IF(SUM(BP$8:BP$11)>0,$E71*$I71,0)","v":0},null,{"$f":"IF(SUM(BR$8:BR$11)>0,$E71*$I71,0)","v":0},null,{"$f":"IF(SUM(BT$8:BT$11)>0,$E71*$I71,0)","v":0},null,{"$f":"IF(SUM(BV$8:BV$11)>0,$E71*$I71,0)","v":0},null,{"$f":"IF(SUM(BX$8:BX$11)>0,$E71*$I71,0)","v":0},null,{"$f":"IF(SUM(BZ$8:BZ$11)>0,$E71*$I71,0)","v":0},null,{"$f":"IF(SUM(CB$8:CB$11)>0,$E71*$I71,0)","v":0},null,{"$f":"IF(SUM(CD$8:CD$11)>0,$E71*$I71,0)","v":0},null,{"$f":"IF(SUM(CF$8:CF$11)>0,$E71*$I71,0)","v":0},null,{"$f":"IF(SUM(CH$8:CH$11)>0,$E71*$I71,0)","v":0},null,{"$f":"IF(SUM(CJ$8:CJ$11)>0,$E71*$I71,0)","v":0},null,{"$f":"IF(SUM(CL$8:CL$11)>0,$E71*$I71,0)","v":0},null,{"$f":"IF(SUM(CN$8:CN$11)>0,$E71*$I71,0)","v":0},null,{"$f":"IF(SUM(CP$8:CP$11)>0,$E71*$I71,0)","v":0},null,{"$f":"IF(SUM(CR$8:CR$11)>0,$E71*$I71,0)","v":0},null,{"$f":"IF(SUM(CT$8:CT$11)>0,$E71*$I71,0)","v":0},null,{"$f":"IF(SUM(CV$8:CV$11)>0,$E71*$I71,0)","v":0},null,{"$f":"IF(SUM(CX$8:CX$11)>0,$E71*$I71,0)","v":0},null,{"$f":"IF(SUM(CZ$8:CZ$11)>0,$E71*$I71,0)","v":0},null,{"$f":"IF(SUM(DB$8:DB$11)>0,$E71*$I71,0)","v":0},null,{"$f":"IF(SUM(DD$8:DD$11)>0,$E71*$I71,0)","v":0},null,{"$f":"IF(SUM(DF$8:DF$11)>0,$E71*$I71,0)","v":0},null,{"$f":"IF(SUM(DH$8:DH$11)>0,$E71*$I71,0)","v":0},null,{"$f":"IF(SUM(DJ$8:DJ$11)>0,$E71*$I71,0)","v":0},null,{"$f":"IF(SUM(DL$8:DL$11)>0,$E71*$I71,0)","v":0},null,{"$f":"IF(SUM(DN$8:DN$11)>0,$E71*$I71,0)","v":0},null,{"$f":"IF(SUM(DP$8:DP$11)>0,$E71*$I71,0)","v":0},null,{"$f":"IF(SUM(DR$8:DR$11)>0,$E71*$I71,0)","v":0},null,{"$f":"IF(SUM(DT$8:DT$11)>0,$E71*$I71,0)","v":0},null,{"$f":"IF(SUM(DV$8:DV$11)>0,$E71*$I71,0)","v":0},null,{"$f":"IF(SUM(DX$8:DX$11)>0,$E71*$I71,0)","v":0},null,{"$f":"IF(SUM(DZ$8:DZ$11)>0,$E71*$I71,0)","v":0}]
[]
[null,null,"CATEGORIAS",null,null,null,null,null,"QUANTIDADE"]
[null,null,null,null,null,null,null,null,null,null,null,{"$f":"IF($C74=L$4,1,0)","v":0},null,0,null,0,null,0,null,0,null,0,null,0,null,0,null,{"$f":"IF($C74=AB$4,1,0)","v":0},null,0,null,0,null,0,null,0,null,{"$f":"IF($C74=AL$4,1,0)","v":0},null,0,null,0,null,0,null,0,null,0,null,0,null,0,null,0,null,0,null,0,null,0,null,0,null,0,null,0,null,0,null,0,null,0,null,0,null,0,null,0,null,0,null,0,null,0,null,0,null,0,null,0,null,0,null,0,null,0,null,0,null,0,null,{"$f":"IF($C74=CX$4,1,0)","v":0},null,0,null,0,null,0,null,0,null,0,null,0,null,0,null,0,null,0,null,0,null,0,null,0,null,0,null,0]
[null,null,5,{"$f":"HLOOKUP($C75,'Dados Gerais'!$D$5:$BK$10,6)","v":"ALMOXARIFE"},null,1,1,null,{"$f":"HLOOKUP($C75,'Dados Gerais'!$D$5:$BK$14,10)","v":2},null,null,0,null,0,null,0,null,0,null,1,null,0,null,0,null,0,null,0,null,0,null,{"$f":"IF($C75=AF$4,1,0)","v":0},null,0,null,0,null,0,null,0,null,0,null,0,null,0,null,0,null,0,null,0,null,0,null,0,null,0,null,0,null,0,null,0,null,0,null,0,null,0,null,0,null,0,null,0,null,0,null,0,null,0,null,0,null,0,null,0,null,0,null,0,null,0,null,0,null,0,null,0,null,0,null,0,null,0,null,0,null,0,null,0,null,0,null,0,null,0,null,0,null,0,null,0,null,0,null,0,null,0]
[null,null,6,{"$f":"HLOOKUP($C76,'Dados Gerais'!$D$5:$BK$10,6)","v":"SERVENTE"},null,{"$f":"I76-G76","v":125},64,null,{"$f":"HLOOKUP($C76,'Dados Gerais'!$D$5:$BK$14,10)","v":189},null,null,0,null,0,null,0,null,0,null,0,null,{"$f":"IF($C76=V$4,1,0)","v":1},null,0,null,0,null,0,null,0,null,0,null,0,null,0,null,0,null,0,null,0,null,0,null,0,null,0,null,0,null,0,null,0,null,0,null,0,null,0,null,0,null,0,null,0,null,0,null,0,null,0,null,0,null,0,null,0,null,0,null,0,null,0,null,0,null,0,null,0,null,0,null,0,null,0,null,0,null,0,null,0,null,0,null,0,null,0,null,0,null,0,null,0,null,0,null,0,null,0,null,0,null,0,null,0,null,0,null,0]
[null,null,null,null,null,null,null,null,null,null,null,0,null,0,null,0,null,0,null,0,null,0,null,0,null,0,null,0,null,0,null,{"$f":"IF($C77=AF$4,1,0)","v":0},null,0,null,0,null,0,null,0,null,0,null,0,null,0,null,0,null,0,null,0,null,0,null,0,null,0,null,0,null,0,null,0,null,0,null,0,null,0,null,0,null,0,null,0,null,0,null,0,null,0,null,0,null,0,null,0,null,0,null,0,null,0,null,0,null,0,null,0,null,0,null,0,null,0,null,0,null,0,null,0,null,0,null,0,null,0,null,0,null,0,null,0,null,0,null,0,null,0]
[]
[null,null,"ITEM","DESCRIÇÃO","QUANT ANUAL\nPOR POSTO","% ESTIMADO POR GÊNERO","Nº DE POSTOS","QUANT ANUAL\nTOTAL ESTIMADA","VALOR"]
[null,null,null,null,null,null,null,null,null,null,null,null,{"$f":"IF(SUM(L$8:L$11)>0,$E80*$I80,0)","v":0},null,{"$f":"IF(SUM(N$8:N$11)>0,$E80*$I80,0)","v":0},null,{"$f":"IF(SUM(P$54:P$57)>0,$H80*$I80,0)/SUM($I$55:$I$56)","v":0},null,{"$f":"IF(SUM(R$54:R$57)>0,$H80*$I80,0)/SUM($I$55:$I$56)","v":0},null,{"$f":"IF(SUM(T$54:T$57)>0,$H80*$I80,0)/SUM($I$55:$I$56)","v":0},null,{"$f":"IF(SUM(V$8:V$11)>0,$E80*$I80,0)","v":0},null,{"$f":"IF(SUM(X$8:X$11)>0,$E80*$I80,0)","v":0},null,{"$f":"IF(SUM(Z$8:Z$11)>0,$E80*$I80,0)","v":0},null,{"$f":"IF(SUM(AB$8:AB$11)>0,$E80*$I80,0)","v":0},null,{"$f":"IF(SUM(AD$8:AD$11)>0,$E80*$I80,0)","v":0},null,{"$f":"IF(SUM(AF$8:AF$11)>0,$E80*$I80,0)","v":0},null,{"$f":"IF(SUM(AH$8:AH$11)>0,$E80*$I80,0)","v":0},null,{"$f":"IF(SUM(AJ$8:AJ$11)>0,$E80*$I80,0)","v":0},null,{"$f":"IF(SUM(AL$8:AL$11)>0,$E80*$I80,0)","v":0},null,{"$f":"IF(SUM(AN$8:AN$11)>0,$E80*$I80,0)","v":0},null,{"$f":"IF(SUM(AP$8:AP$11)>0,$E80*$I80,0)","v":0},null,{"$f":"IF(SUM(AR$8:AR$11)>0,$E80*$I80,0)","v":0},null,{"$f":"IF(SUM(AT$8:AT$11)>0,$E80*$I80,0)","v":0},null,{"$f":"IF(SUM(AV$8:AV$11)>0,$E80*$I80,0)","v":0},null,{"$f":"IF(SUM(AX$8:AX$11)>0,$E80*$I80,0)","v":0},null,{"$f":"IF(SUM(AZ$8:AZ$11)>0,$E80*$I80,0)","v":0},null,{"$f":"IF(SUM(BB$8:BB$11)>0,$E80*$I80,0)","v":0},null,{"$f":"IF(SUM(BD$8:BD$11)>0,$E80*$I80,0)","v":0},null,{"$f":"IF(SUM(BF$8:BF$11)>0,$E80*$I80,0)","v":0},null,{"$f":"IF(SUM(BH$8:BH$11)>0,$E80*$I80,0)","v":0},null,{"$f":"IF(SUM(BJ$8:BJ$11)>0,$E80*$I80,0)","v":0},null,{"$f":"IF(SUM(BL$8:BL$11)>0,$E80*$I80,0)","v":0},null,{"$f":"IF(SUM(BN$8:BN$11)>0,$E80*$I80,0)","v":0},null,{"$f":"IF(SUM(BP$8:BP$11)>0,$E80*$I80,0)","v":0},null,{"$f":"IF(SUM(BR$8:BR$11)>0,$E80*$I80,0)","v":0},null,{"$f":"IF(SUM(BT$8:BT$11)>0,$E80*$I80,0)","v":0},null,{"$f":"IF(SUM(BV$8:BV$11)>0,$E80*$I80,0)","v":0},null,{"$f":"IF(SUM(BX$8:BX$11)>0,$E80*$I80,0)","v":0},null,{"$f":"IF(SUM(BZ$8:BZ$11)>0,$E80*$I80,0)","v":0},null,{"$f":"IF(SUM(CB$8:CB$11)>0,$E80*$I80,0)","v":0},null,{"$f":"IF(SUM(CD$8:CD$11)>0,$E80*$I80,0)","v":0},null,{"$f":"IF(SUM(CF$8:CF$11)>0,$E80*$I80,0)","v":0},null,{"$f":"IF(SUM(CH$8:CH$11)>0,$E80*$I80,0)","v":0},null,{"$f":"IF(SUM(CJ$8:CJ$11)>0,$E80*$I80,0)","v":0},null,{"$f":"IF(SUM(CL$8:CL$11)>0,$E80*$I80,0)","v":0},null,{"$f":"IF(SUM(CN$8:CN$11)>0,$E80*$I80,0)","v":0},null,{"$f":"IF(SUM(CP$8:CP$11)>0,$E80*$I80,0)","v":0},null,{"$f":"IF(SUM(CR$8:CR$11)>0,$E80*$I80,0)","v":0},null,{"$f":"IF(SUM(CT$8:CT$11)>0,$E80*$I80,0)","v":0},null,{"$f":"IF(SUM(CV$8:CV$11)>0,$E80*$I80,0)","v":0},null,{"$f":"IF(SUM(CX$8:CX$11)>0,$E80*$I80,0)","v":0},null,{"$f":"IF(SUM(CZ$8:CZ$11)>0,$E80*$I80,0)","v":0},null,{"$f":"IF(SUM(DB$8:DB$11)>0,$E80*$I80,0)","v":0},null,{"$f":"IF(SUM(DD$8:DD$11)>0,$E80*$I80,0)","v":0},null,{"$f":"IF(SUM(DF$8:DF$11)>0,$E80*$I80,0)","v":0},null,{"$f":"IF(SUM(DH$8:DH$11)>0,$E80*$I80,0)","v":0},null,{"$f":"IF(SUM(DJ$8:DJ$11)>0,$E80*$I80,0)","v":0},null,{"$f":"IF(SUM(DL$8:DL$11)>0,$E80*$I80,0)","v":0},null,{"$f":"IF(SUM(DN$8:DN$11)>0,$E80*$I80,0)","v":0},null,{"$f":"IF(SUM(DP$8:DP$11)>0,$E80*$I80,0)","v":0},null,{"$f":"IF(SUM(DR$8:DR$11)>0,$E80*$I80,0)","v":0},null,{"$f":"IF(SUM(DT$8:DT$11)>0,$E80*$I80,0)","v":0},null,{"$f":"IF(SUM(DV$8:DV$11)>0,$E80*$I80,0)","v":0},null,{"$f":"IF(SUM(DX$8:DX$11)>0,$E80*$I80,0)","v":0},null,{"$f":"IF(SUM(DZ$8:DZ$11)>0,$E80*$I80,0)","v":0}]
[null,null,"MASCULINO","Calça com elástico e bolso laterais, na cor azul marinho, tecido brim 100% algodão",4,{"$f":"ROUNDUP(78/180,2)","v":0.44},{"$f":"SUM($I$75:$I$76)","v":191},{"$f":"ROUNDUP(E81*F81*G81,0)","v":337},59.95,null,null,null,{"$f":"IF(SUM(L$74:L$76)>0,$H81*$I81,0)/SUM($I$75:$I$76)","v":0},null,{"$f":"IF(SUM(N$74:N$76)>0,$H81*$I81,0)/SUM($I$75:$I$76)","v":0},null,{"$f":"IF(SUM(P$74:P$78)>0,$H81*$I81,0)/SUM($I$55:$I$56)","v":0},null,{"$f":"IF(SUM(R$74:R$78)>0,$H81*$I81,0)/SUM($I$55:$I$56)","v":0},null,{"$f":"IF(SUM(T$74:T$78)>0,$H81*$I81,0)/SUM($I$75:$I$76)","v":105.77565445026178},null,{"$f":"IF(SUM(V$74:V$76)>0,$H81*$I81,0)/SUM($I$75:$I$76)","v":105.77565445026178},null,{"$f":"IF(SUM(X$74:X$76)>0,$H81*$I81,0)/SUM($I$75:$I$76)","v":0},null,{"$f":"IF(SUM(Z$74:Z$76)>0,$H81*$I81,0)/SUM($I$75:$I$76)","v":0},null,{"$f":"IF(SUM(AB$74:AB$76)>0,$H81*$I81,0)/SUM($I$75:$I$76)","v":0},null,{"$f":"IF(SUM(AD$74:AD$76)>0,$H81*$I81,0)/SUM($I$75:$I$76)","v":0},null,{"$f":"IF(SUM(AF$74:AF$76)>0,$H81*$I81,0)/SUM($I$75:$I$76)","v":0},null,{"$f":"IF(SUM(AH$74:AH$76)>0,$H81*$I81,0)/SUM($I$75:$I$76)","v":0},null,{"$f":"IF(SUM(AJ$74:AJ$76)>0,$H81*$I81,0)/SUM($I$75:$I$76)","v":0},null,{"$f":"IF(SUM(AL$74:AL$76)>0,$H81*$I81,0)/SUM($I$75:$I$76)","v":0},null,{"$f":"IF(SUM(AN$74:AN$76)>0,$H81*$I81,0)/SUM($I$75:$I$76)","v":0},null,{"$f":"IF(SUM(AP$74:AP$76)>0,$H81*$I81,0)/SUM($I$75:$I$76)","v":0},null,{"$f":"IF(SUM(AR$74:AR$76)>0,$H81*$I81,0)/SUM($I$75:$I$76)","v":0},null,{"$f":"IF(SUM(AT$74:AT$76)>0,$H81*$I81,0)/SUM($I$75:$I$76)","v":0},null,{"$f":"IF(SUM(AV$74:AV$76)>0,$H81*$I81,0)/SUM($I$75:$I$76)","v":0},null,{"$f":"IF(SUM(AX$74:AX$76)>0,$H81*$I81,0)/SUM($I$75:$I$76)","v":0},null,{"$f":"IF(SUM(AZ$74:AZ$76)>0,$H81*$I81,0)/SUM($I$75:$I$76)","v":0},null,{"$f":"IF(SUM(BB$74:BB$76)>0,$H81*$I81,0)/SUM($I$75:$I$76)","v":0},null,{"$f":"IF(SUM(BD$74:BD$76)>0,$H81*$I81,0)/SUM($I$75:$I$76)","v":0},null,{"$f":"IF(SUM(BF$74:BF$76)>0,$H81*$I81,0)/SUM($I$75:$I$76)","v":0},null,{"$f":"IF(SUM(BH$74:BH$76)>0,$H81*$I81,0)/SUM($I$75:$I$76)","v":0},null,{"$f":"IF(SUM(BJ$74:BJ$76)>0,$H81*$I81,0)/SUM($I$75:$I$76)","v":0},null,{"$f":"IF(SUM(BL$74:BL$76)>0,$H81*$I81,0)/SUM($I$75:$I$76)","v":0},null,{"$f":"IF(SUM(BN$74:BN$76)>0,$H81*$I81,0)/SUM($I$75:$I$76)","v":0},null,{"$f":"IF(SUM(BP$74:BP$76)>0,$H81*$I81,0)/SUM($I$75:$I$76)","v":0},null,{"$f":"IF(SUM(BR$74:BR$76)>0,$H81*$I81,0)/SUM($I$75:$I$76)","v":0},null,{"$f":"IF(SUM(BT$74:BT$76)>0,$H81*$I81,0)/SUM($I$75:$I$76)","v":0},null,{"$f":"IF(SUM(BV$74:BV$76)>0,$H81*$I81,0)/SUM($I$75:$I$76)","v":0},null,{"$f":"IF(SUM(BX$74:BX$76)>0,$H81*$I81,0)/SUM($I$75:$I$76)","v":0},null,{"$f":"IF(SUM(BZ$74:BZ$76)>0,$H81*$I81,0)/SUM($I$75:$I$76)","v":0},null,{"$f":"IF(SUM(CB$74:CB$76)>0,$H81*$I81,0)/SUM($I$75:$I$76)","v":0},null,{"$f":"IF(SUM(CD$74:CD$76)>0,$H81*$I81,0)/SUM($I$75:$I$76)","v":0},null,{"$f":"IF(SUM(CF$74:CF$76)>0,$H81*$I81,0)/SUM($I$75:$I$76)","v":0},null,{"$f":"IF(SUM(CH$74:CH$76)>0,$H81*$I81,0)/SUM($I$75:$I$76)","v":0},null,{"$f":"IF(SUM(CJ$74:CJ$76)>0,$H81*$I81,0)/SUM($I$75:$I$76)","v":0},null,{"$f":"IF(SUM(CL$74:CL$76)>0,$H81*$I81,0)/SUM($I$75:$I$76)","v":0},null,{"$f":"IF(SUM(CN$74:CN$76)>0,$H81*$I81,0)/SUM($I$75:$I$76)","v":0},null,{"$f":"IF(SUM(CP$74:CP$76)>0,$H81*$I81,0)/SUM($I$75:$I$76)","v":0},null,{"$f":"IF(SUM(CR$74:CR$76)>0,$H81*$I81,0)/SUM($I$75:$I$76)","v":0},null,{"$f":"IF(SUM(CT$74:CT$76)>0,$H81*$I81,0)/SUM($I$75:$I$76)","v":0},null,{"$f":"IF(SUM(CV$74:CV$76)>0,$H81*$I81,0)/SUM($I$75:$I$76)","v":0},null,{"$f":"IF(SUM(CX$74:CX$76)>0,$H81*$I81,0)/SUM($I$75:$I$76)","v":0},null,{"$f":"IF(SUM(CZ$74:CZ$76)>0,$H81*$I81,0)/SUM($I$75:$I$76)","v":0},null,{"$f":"IF(SUM(DB$74:DB$76)>0,$H81*$I81,0)/SUM($I$75:$I$76)","v":0},null,{"$f":"IF(SUM(DD$74:DD$76)>0,$H81*$I81,0)/SUM($I$75:$I$76)","v":0},null,{"$f":"IF(SUM(DF$74:DF$76)>0,$H81*$I81,0)/SUM($I$75:$I$76)","v":0},null,{"$f":"IF(SUM(DH$74:DH$76)>0,$H81*$I81,0)/SUM($I$75:$I$76)","v":0},null,{"$f":"IF(SUM(DJ$74:DJ$76)>0,$H81*$I81,0)/SUM($I$75:$I$76)","v":0},null,{"$f":"IF(SUM(DL$74:DL$76)>0,$H81*$I81,0)/SUM($I$75:$I$76)","v":0},null,{"$f":"IF(SUM(DN$74:DN$76)>0,$H81*$I81,0)/SUM($I$75:$I$76)","v":0},null,{"$f":"IF(SUM(DP$74:DP$76)>0,$H81*$I81,0)/SUM($I$75:$I$76)","v":0},null,{"$f":"IF(SUM(DR$74:DR$76)>0,$H81*$I81,0)/SUM($I$75:$I$76)","v":0},null,{"$f":"IF(SUM(DT$74:DT$76)>0,$H81*$I81,0)/SUM($I$75:$I$76)","v":0},null,{"$f":"IF(SUM(DV$74:DV$76)>0,$H81*$I81,0)/SUM($I$75:$I$76)","v":0},null,{"$f":"IF(SUM(DX$74:DX$76)>0,$H81*$I81,0)/SUM($I$75:$I$76)","v":0},null,{"$f":"IF(SUM(DZ$74:DZ$76)>0,$H81*$I81,0)/SUM($I$75:$I$76)","v":0}]
[null,null,null,"Camisa nas cores cinza e azul marinho, tecido leve 100% algodão",4,{"$f":"F81","v":0.44},{"$f":"G81","v":191},{"$f":"ROUNDUP(E82*F82*G82,0)","v":337},34.950000000000003,null,null,null,0,null,0,null,0,null,0,null,{"$f":"IF(SUM(T$74:T$78)>0,$H82*$I82,0)/SUM($I$75:$I$76)","v":61.665706806282728},null,{"$f":"IF(SUM(V$74:V$76)>0,$H82*$I82,0)/SUM($I$75:$I$76)","v":61.665706806282728},null,0,null,0,null,0,null,0,null,0,null,0,null,0,null,0,null,0,null,0,null,0,null,0,null,0,null,0,null,0,null,0,null,0,null,0,null,0,null,0,null,0,null,0,null,0,null,0,null,0,null,0,null,0,null,0,null,0,null,0,null,0,null,0,null,0,null,0,null,0,null,0,null,0,null,0,null,0,null,0,null,0,null,0,null,0,null,0,null,0,null,0,null,0,null,0,null,0,null,0,null,0,null,0,null,0,null,0]
[null,null,null,"Meia social na cor preta",4,{"$f":"F82","v":0.44},{"$f":"G82","v":191},337,{"$f":"I64","v":11.54},null,null,null,0,null,0,null,0,null,0,null,20.361151832460731,null,20.361151832460731,null,0,null,0,null,0,null,0,null,0,null,0,null,0,null,0,null,0,null,0,null,0,null,0,null,0,null,0,null,0,null,0,null,0,null,0,null,0,null,0,null,0,null,0,null,0,null,0,null,0,null,0,null,0,null,0,null,0,null,0,null,0,null,0,null,0,null,0,null,0,null,0,null,0,null,0,null,0,null,0,null,0,null,0,null,0,null,0,null,0,null,0,null,0,null,0,null,0,null,0,null,0,null,0,null,0,null,0]
[null,null,"FEMININO","Calça com elástico e bolso laterais, na cor azul marinho, tecido brim 100% algodão",{"$f":"E81","v":4},{"$f":"100%-F83","v":0.56000000000000005},191,428,{"$f":"I81","v":59.95},null,null,null,0,null,0,null,0,null,0,null,134.33821989528798,null,134.33821989528798,null,0,null,0,null,0,null,0,null,0,null,0,null,0,null,0,null,0,null,0,null,0,null,0,null,0,null,0,null,0,null,0,null,0,null,0,null,0,null,0,null,0,null,0,null,0,null,0,null,0,null,0,null,0,null,0,null,0,null,0,null,0,null,0,null,0,null,0,null,0,null,0,null,0,null,0,null,0,null,0,null,0,null,0,null,0,null,0,null,0,null,0,null,0,null,0,null,0,null,0,null,0,null,0,null,0,null,0]
[null,null,null,"Blusa nas cores cinza e azul marinho, tecido leve 100% algodão",{"$f":"E82","v":4},{"$f":"F84","v":0.56000000000000005},191,428,34.950000000000003,null,null,null,0,null,0,null,0,null,0,null,78.317277486910996,null,78.317277486910996,null,0,null,0,null,0,null,0,null,0,null,0,null,0,null,0,null,0,null,0,null,0,null,0,null,0,null,0,null,0,null,0,null,0,null,0,null,0,null,0,null,0,null,0,null,0,null,0,null,0,null,0,null,0,null,0,null,0,null,0,null,0,null,0,null,0,null,0,null,0,null,0,null,0,null,0,null,0,null,0,null,0,null,0,null,0,null,0,null,0,null,0,null,0,null,0,null,0,null,0,null,0,null,0,null,0,null,0]
[null,null,null,"Meia social na cor preta",4,{"$f":"F85","v":0.56000000000000005},191,428,{"$f":"I69","v":21},null,null,null,0,null,0,null,0,null,0,null,47.05759162303665,null,{"$f":"IF(SUM(V$74:V$76)>0,$H86*$I86,0)/SUM($I$75:$I$76)","v":47.05759162303665},null,0,null,0,null,0,null,0,null,0,null,0,null,0,null,0,null,0,null,0,null,0,null,0,null,0,null,0,null,0,null,0,null,0,null,0,null,0,null,0,null,0,null,0,null,0,null,0,null,0,null,0,null,0,null,0,null,0,null,0,null,0,null,0,null,0,null,0,null,0,null,0,null,0,null,0,null,0,null,0,null,0,null,0,null,0,null,0,null,0,null,0,null,0,null,0,null,0,null,0,null,0,null,0,null,0,null,0]
[null,null,null,null,null,null,null,null,null,null,null,null,{"$f":"IF(SUM(L$74:L$76)>0,$H87*$I87,0)/SUM($I79:$I82)","v":0},null,{"$f":"IF(SUM(N$74:N$76)>0,$H87*$I87,0)","v":0},null,0,null,0,null,{"$f":"IF(SUM(T$74:T$76)>0,$H87*$I87,0)","v":0},null,{"$f":"IF(SUM(V$74:V$76)>0,$H87*$I87,0)","v":0},null,{"$f":"IF(SUM(X$74:X$76)>0,$H87*$I87,0)","v":0},null,{"$f":"IF(SUM(Z$74:Z$76)>0,$H87*$I87,0)","v":0},null,{"$f":"IF(SUM(AB$74:AB$76)>0,$H87*$I87,0)","v":0},null,{"$f":"IF(SUM(AD$74:AD$76)>0,$H87*$I87,0)","v":0},null,{"$f":"IF(SUM(AF$74:AF$76)>0,$H87*$I87,0)","v":0},null,{"$f":"IF(SUM(AH$74:AH$76)>0,$H87*$I87,0)","v":0},null,{"$f":"IF(SUM(AJ$74:AJ$76)>0,$H87*$I87,0)","v":0},null,{"$f":"IF(SUM(AL$74:AL$76)>0,$H87*$I87,0)","v":0},null,{"$f":"IF(SUM(AN$74:AN$76)>0,$H87*$I87,0)","v":0},null,{"$f":"IF(SUM(AP$74:AP$76)>0,$H87*$I87,0)","v":0},null,{"$f":"IF(SUM(AR$74:AR$76)>0,$H87*$I87,0)","v":0},null,{"$f":"IF(SUM(AT$74:AT$76)>0,$H87*$I87,0)","v":0},null,{"$f":"IF(SUM(AV$74:AV$76)>0,$H87*$I87,0)","v":0},null,{"$f":"IF(SUM(AX$74:AX$76)>0,$H87*$I87,0)","v":0},null,{"$f":"IF(SUM(AZ$74:AZ$76)>0,$H87*$I87,0)","v":0},null,{"$f":"IF(SUM(BB$74:BB$76)>0,$H87*$I87,0)","v":0},null,{"$f":"IF(SUM(BD$74:BD$76)>0,$H87*$I87,0)","v":0},null,{"$f":"IF(SUM(BF$74:BF$76)>0,$H87*$I87,0)","v":0},null,{"$f":"IF(SUM(BH$74:BH$76)>0,$H87*$I87,0)","v":0},null,{"$f":"IF(SUM(BJ$74:BJ$76)>0,$H87*$I87,0)","v":0},null,{"$f":"IF(SUM(BL$74:BL$76)>0,$H87*$I87,0)","v":0},null,{"$f":"IF(SUM(BN$74:BN$76)>0,$H87*$I87,0)","v":0},null,{"$f":"IF(SUM(BP$74:BP$76)>0,$H87*$I87,0)","v":0},null,{"$f":"IF(SUM(BR$74:BR$76)>0,$H87*$I87,0)","v":0},null,{"$f":"IF(SUM(BT$74:BT$76)>0,$H87*$I87,0)","v":0},null,{"$f":"IF(SUM(BV$74:BV$76)>0,$H87*$I87,0)","v":0},null,{"$f":"IF(SUM(BX$74:BX$76)>0,$H87*$I87,0)","v":0},null,{"$f":"IF(SUM(BZ$74:BZ$76)>0,$H87*$I87,0)","v":0},null,{"$f":"IF(SUM(CB$74:CB$76)>0,$H87*$I87,0)","v":0},null,{"$f":"IF(SUM(CD$74:CD$76)>0,$H87*$I87,0)","v":0},null,{"$f":"IF(SUM(CF$74:CF$76)>0,$H87*$I87,0)","v":0},null,{"$f":"IF(SUM(CH$74:CH$76)>0,$H87*$I87,0)","v":0},null,{"$f":"IF(SUM(CJ$74:CJ$76)>0,$H87*$I87,0)","v":0},null,{"$f":"IF(SUM(CL$74:CL$76)>0,$H87*$I87,0)","v":0},null,{"$f":"IF(SUM(CN$74:CN$76)>0,$H87*$I87,0)","v":0},null,{"$f":"IF(SUM(CP$74:CP$76)>0,$H87*$I87,0)","v":0},null,{"$f":"IF(SUM(CR$74:CR$76)>0,$H87*$I87,0)","v":0},null,{"$f":"IF(SUM(CT$74:CT$76)>0,$H87*$I87,0)","v":0},null,{"$f":"IF(SUM(CV$74:CV$76)>0,$H87*$I87,0)","v":0},null,{"$f":"IF(SUM(CX$74:CX$76)>0,$H87*$I87,0)","v":0},null,{"$f":"IF(SUM(CZ$74:CZ$76)>0,$H87*$I87,0)","v":0},null,{"$f":"IF(SUM(DB$74:DB$76)>0,$H87*$I87,0)","v":0},null,{"$f":"IF(SUM(DD$74:DD$76)>0,$H87*$I87,0)","v":0},null,{"$f":"IF(SUM(DF$74:DF$76)>0,$H87*$I87,0)","v":0},null,{"$f":"IF(SUM(DH$74:DH$76)>0,$H87*$I87,0)","v":0},null,{"$f":"IF(SUM(DJ$74:DJ$76)>0,$H87*$I87,0)","v":0},null,{"$f":"IF(SUM(DL$74:DL$76)>0,$H87*$I87,0)","v":0},null,{"$f":"IF(SUM(DN$74:DN$76)>0,$H87*$I87,0)","v":0},null,{"$f":"IF(SUM(DP$74:DP$76)>0,$H87*$I87,0)","v":0},null,{"$f":"IF(SUM(DR$74:DR$76)>0,$H87*$I87,0)","v":0},null,{"$f":"IF(SUM(DT$74:DT$76)>0,$H87*$I87,0)","v":0},null,{"$f":"IF(SUM(DV$74:DV$76)>0,$H87*$I87,0)","v":0},null,{"$f":"IF(SUM(DX$74:DX$76)>0,$H87*$I87,0)","v":0},null,{"$f":"IF(SUM(DZ$74:DZ$76)>0,$H87*$I87,0)","v":0}]

{"sheet":"EPI","index":17,"n_rows":73,"n_cols":129,"rows_kept":73,"cut":false,"hidden":false,"merged":[[2,1,2,3],[3,1,3,6]]}
[]
[]
[]
[null,"EQUIPAMENTOS DE PROTEÇÃO INDIVIDUAL - AQUISIÇÃO",null,null,null,null,null,null,null,1,null,{"$f":"J4+1","v":2},null,{"$f":"L4+1","v":3},null,{"$f":"N4+1","v":4},null,{"$f":"P4+1","v":5},null,{"$f":"R4+1","v":6},null,{"$f":"T4+1","v":7},null,{"$f":"V4+1","v":8},null,{"$f":"X4+1","v":9},null,{"$f":"Z4+1","v":10},null,{"$f":"AB4+1","v":11},null,{"$f":"AD4+1","v":12},null,{"$f":"AF4+1","v":13},null,{"$f":"AH4+1","v":14},null,{"$f":"AJ4+1","v":15},null,{"$f":"AL4+1","v":16},null,{"$f":"AN4+1","v":17},null,{"$f":"AP4+1","v":18},null,{"$f":"AR4+1","v":19},null,{"$f":"AT4+1","v":20},null,{"$f":"AV4+1","v":21},null,{"$f":"AX4+1","v":22},null,{"$f":"AZ4+1","v":23},null,{"$f":"BB4+1","v":24},null,{"$f":"BD4+1","v":25},null,{"$f":"BF4+1","v":26},null,{"$f":"BH4+1","v":27},null,{"$f":"BJ4+1","v":28},null,{"$f":"BL4+1","v":29},null,{"$f":"BN4+1","v":30},null,{"$f":"BP4+1","v":31},null,{"$f":"BR4+1","v":32},null,{"$f":"BT4+1","v":33},null,{"$f":"BV4+1","v":34},null,{"$f":"BX4+1","v":35},null,{"$f":"BZ4+1","v":36},null,{"$f":"CB4+1","v":37},null,{"$f":"CD4+1","v":38},null,{"$f":"CF4+1","v":39},null,{"$f":"CH4+1","v":40},null,{"$f":"CJ4+1","v":41},null,{"$f":"CL4+1","v":42},null,{"$f":"CN4+1","v":43},null,{"$f":"CP4+1","v":44},null,{"$f":"CR4+1","v":45},null,{"$f":"CT4+1","v":46},null,{"$f":"CV4+1","v":47},null,{"$f":"CX4+1","v":48},null,{"$f":"CZ4+1","v":49},null,{"$f":"DB4+1","v":50},null,{"$f":"DD4+1","v":51},null,{"$f":"DF4+1","v":52},null,{"$f":"DH4+1","v":53},null,{"$f":"DJ4+1","v":54},null,{"$f":"DL4+1","v":55},null,{"$f":"DN4+1","v":56},null,{"$f":"DP4+1","v":57},null,{"$f":"DR4+1","v":58},null,{"$f":"DT4+1","v":59},null,{"$f":"DV4+1","v":60}]
[]
[null,null,null,null,null,null,null,null,null,{"$f":"ROUND(SUM(K5:K110),2)","v":1.62},null,{"$f":"ROUND(SUM(M5:M110),2)","v":4.1100000000000003},null,{"$f":"ROUND(SUM(O5:O110),2)","v":4.1100000000000003},null,{"$f":"ROUND(SUM(Q5:Q110),2)","v":4.1100000000000003},null,{"$f":"ROUND(SUM(S5:S110),2)","v":276.33999999999997},null,{"$f":"ROUND(SUM(U5:U110),2)","v":291.77},null,{"$f":"ROUND(SUM(W5:W110),2)","v":0},null,{"$f":"ROUND(SUM(Y5:Y110),2)","v":0},null,{"$f":"ROUND(SUM(AA5:AA110),2)","v":0},null,{"$f":"ROUND(SUM(AC5:AC110),2)","v":0},null,{"$f":"ROUND(SUM(AE5:AE110),2)","v":0},null,{"$f":"ROUND(SUM(AG5:AG110),2)","v":0},null,{"$f":"ROUND(SUM(AI5:AI110),2)","v":0},null,{"$f":"ROUND(SUM(AK5:AK110),2)","v":0},null,{"$f":"ROUND(SUM(AM5:AM110),2)","v":0},null,{"$f":"ROUND(SUM(AO5:AO110),2)","v":0},null,{"$f":"ROUND(SUM(AQ5:AQ110),2)","v":0},null,{"$f":"ROUND(SUM(AS5:AS110),2)","v":0},null,{"$f":"ROUND(SUM(AU5:AU110),2)","v":0},null,{"$f":"ROUND(SUM(AW5:AW110),2)","v":0},null,{"$f":"ROUND(SUM(AY5:AY110),2)","v":0},null,{"$f":"ROUND(SUM(BA5:BA110),2)","v":0},null,{"$f":"ROUND(SUM(BC5:BC110),2)","v":0},null,{"$f":"ROUND(SUM(BE5:BE110),2)","v":0},null,{"$f":"ROUND(SUM(BG5:BG110),2)","v":0},null,{"$f":"ROUND(SUM(BI5:BI110),2)","v":0},null,{"$f":"ROUND(SUM(BK5:BK110),2)","v":0},null,{"$f":"ROUND(SUM(BM5:BM110),2)","v":0},null,{"$f":"ROUND(SUM(BO5:BO110),2)","v":0},null,{"$f":"ROUND(SUM(BQ5:BQ110),2)","v":0},null,{"$f":"ROUND(SUM(BS5:BS110),2)","v":0},null,{"$f":"ROUND(SUM(BU5:BU110),2)","v":0},null,{"$f":"ROUND(SUM(BW5:BW110),2)","v":0},null,{"$f":"ROUND(SUM(BY5:BY110),2)","v":0},null,{"$f":"ROUND(SUM(CA5:CA110),2)","v":0},null,{"$f":"ROUND(SUM(CC5:CC110),2)","v":0},null,{"$f":"ROUND(SUM(CE5:CE110),2)","v":0},null,{"$f":"ROUND(SUM(CG5:CG110),2)","v":0},null,{"$f":"ROUND(SUM(CI5:CI110),2)","v":0},null,{"$f":"ROUND(SUM(CK5:CK110),2)","v":0},null,{"$f":"ROUND(SUM(CM5:CM110),2)","v":0},null,{"$f":"ROUND(SUM(CO5:CO110),2)","v":0},null,{"$f":"ROUND(SUM(CQ5:CQ110),2)","v":0},null,{"$f":"ROUND(SUM(CS5:CS110),2)","v":0},null,{"$f":"ROUND(SUM(CU5:CU110),2)","v":0},null,{"$f":"ROUND(SUM(CW5:CW110),2)","v":0},null,{"$f":"ROUND(SUM(CY5:CY110),2)","v":0},null,{"$f":"ROUND(SUM(DA5:DA110),2)","v":0},null,{"$f":"ROUND(SUM(DC5:DC110),2)","v":0},null,{"$f":"ROUND(SUM(DE5:DE110),2)","v":0},null,{"$f":"ROUND(SUM(DG5:DG110),2)","v":0},null,{"$f":"ROUND(SUM(DI5:DI110),2)","v":0},null,{"$f":"ROUND(SUM(DK5:DK110),2)","v":0},null,{"$f":"ROUND(SUM(DM5:DM110),2)","v":0},null,{"$f":"ROUND(SUM(DO5:DO110),2)","v":0},null,{"$f":"ROUND(SUM(DQ5:DQ110),2)","v":0},null,{"$f":"ROUND(SUM(DS5:DS110),2)","v":0},null,{"$f":"ROUND(SUM(DU5:DU110),2)","v":0},null,{"$f":"ROUND(SUM(DW5:DW110),2)","v":0},null,{"$f":"ROUND(SUM(DY5:DY110),2)","v":0}]
[null,null,"CATEGORIAS",null,null,null,"QUANTIDADE"]
[null,null,null,null,null,null,null,null,null,{"$f":"IF($C8=J$4,1,0)","v":0},null,{"$f":"IF($C8=L$4,1,0)","v":0},null,{"$f":"IF($C8=N$4,1,0)","v":0},null,{"$f":"IF($C8=P$4,1,0)","v":0},null,{"$f":"IF($C8=R$4,1,0)","v":0},null,{"$f":"IF($C8=T$4,1,0)","v":0},null,{"$f":"IF($C8=V$4,1,0)","v":0},null,{"$f":"IF($C8=X$4,1,0)","v":0},null,{"$f":"IF($C8=Z$4,1,0)","v":0},null,{"$f":"IF($C8=AB$4,1,0)","v":0},null,{"$f":"IF($C8=AD$4,1,0)","v":0},null,{"$f":"IF($C8=AF$4,1,0)","v":0},null,{"$f":"IF($C8=AH$4,1,0)","v":0},null,{"$f":"IF($C8=AJ$4,1,0)","v":0},null,{"$f":"IF($C8=AL$4,1,0)","v":0},null,{"$f":"IF($C8=AN$4,1,0)","v":0},null,{"$f":"IF($C8=AP$4,1,0)","v":0},null,{"$f":"IF($C8=AR$4,1,0)","v":0},null,{"$f":"IF($C8=AT$4,1,0)","v":0},null,{"$f":"IF($C8=AV$4,1,0)","v":0},null,{"$f":"IF($C8=AX$4,1,0)","v":0},null,{"$f":"IF($C8=AZ$4,1,0)","v":0},null,{"$f":"IF($C8=BB$4,1,0)","v":0},null,{"$f":"IF($C8=BD$4,1,0)","v":0},null,{"$f":"IF($C8=BF$4,1,0)","v":0},null,{"$f":"IF($C8=BH$4,1,0)","v":0},null,{"$f":"IF($C8=BJ$4,1,0)","v":0},null,{"$f":"IF($C8=BL$4,1,0)","v":0},null,{"$f":"IF($C8=BN$4,1,0)","v":0},null,{"$f":"IF($C8=BP$4,1,0)","v":0},null,{"$f":"IF($C8=BR$4,1,0)","v":0},null,{"$f":"IF($C8=BT$4,1,0)","v":0},null,{"$f":"IF($C8=BV$4,1,0)","v":0},null,{"$f":"IF($C8=BX$4,1,0)","v":0},null,{"$f":"IF($C8=BZ$4,1,0)","v":0},null,{"$f":"IF($C8=CB$4,1,0)","v":0},null,{"$f":"IF($C8=CD$4,1,0)","v":0},null,{"$f":"IF($C8=CF$4,1,0)","v":0},null,{"$f":"IF($C8=CH$4,1,0)","v":0},null,{"$f":"IF($C8=CJ$4,1,0)","v":0},null,{"$f":"IF($C8=CL$4,1,0)","v":0},null,{"$f":"IF($C8=CN$4,1,0)","v":0},null,{"$f":"IF($C8=CP$4,1,0)","v":0},null,{"$f":"IF($C8=CR$4,1,0)","v":0},null,{"$f":"IF($C8=CT$4,1,0)","v":0},null,{"$f":"IF($C8=CV$4,1,0)","v":0},null,{"$f":"IF($C8=CX$4,1,0)","v":0},null,{"$f":"IF($C8=CZ$4,1,0)","v":0},null,{"$f":"IF($C8=DB$4,1,0)","v":0},null,{"$f":"IF($C8=DD$4,1,0)","v":0},null,{"$f":"IF($C8=DF$4,1,0)","v":0},null,{"$f":"IF($C8=DH$4,1,0)","v":0},null,{"$f":"IF($C8=DJ$4,1,0)","v":0},null,{"$f":"IF($C8=DL$4,1,0)","v":0},null,{"$f":"IF($C8=DN$4,1,0)","v":0},null,{"$f":"IF($C8=DP$4,1,0)","v":0},null,{"$f":"IF($C8=DR$4,1,0)","v":0},null,{"$f":"IF($C8=DT$4,1,0)","v":0},null,{"$f":"IF($C8=DV$4,1,0)","v":0},null,{"$f":"IF($C8=DX$4,1,0)","v":0}]
[null,null,1,{"$f":"HLOOKUP($C9,'Dados Gerais'!$D$5:$BK$10,6)","v":"ENCARREGADO GERAL"},null,null,{"$f":"HLOOKUP($C9,'Dados Gerais'!$D$5:$BK$14,10)","v":1},null,null,{"$f":"IF($C9=J$4,1,0)","v":1},null,0,null,0,null,0,null,0,null,0,null,0,null,0,null,0,null,0,null,0,null,0,null,0,null,0,null,0,null,0,null,0,null,0,null,0,null,0,null,0,null,0,null,0,null,0,null,0,null,0,null,0,null,0,null,0,null,0,null,0,null,0,null,0,null,0,null,0,null,0,null,0,null,0,null,0,null,0,null,0,null,0,null,0,null,0,null,0,null,0,null,0,null,0,null,0,null,0,null,0,null,0,null,0,null,0,null,0,null,0,null,0,null,0,null,0,null,0]
[null,null,null,null,null,null,null,null,null,{"$f":"IF($C10=J$4,1,0)","v":0},null,0,null,0,null,0,null,0,null,0,null,0,null,0,null,0,null,0,null,0,null,0,null,0,null,0,null,0,null,0,null,0,null,0,null,0,null,0,null,0,null,0,null,0,null,0,null,0,null,0,null,0,null,0,null,0,null,0,null,0,null,0,null,0,null,0,null,0,null,0,null,0,null,0,null,0,null,0,null,0,null,0,null,0,null,0,null,0,null,0,null,0,null,0,null,0,null,0,null,0,null,0,null,0,null,0,null,0,null,0,null,0,null,0,null,0,null,0]
[]
[null,null,"ITEM","DESCRIÇÃO","QUANT ANUAL POR POSTO","UNIDADE","VALOR"]
[null,null,null,null,null,null,null,null,null,null,{"$f":"IF(SUM(J$8:J$10)>0,$E13*$G13,0)","v":0},null,{"$f":"IF(SUM(L$8:L$10)>0,$E13*$G13,0)","v":0},null,{"$f":"IF(SUM(N$8:N$10)>0,$E13*$G13,0)","v":0},null,{"$f":"IF(SUM(P$8:P$10)>0,$E13*$G13,0)","v":0},null,{"$f":"IF(SUM(R$8:R$10)>0,$E13*$G13,0)","v":0},null,{"$f":"IF(SUM(T$8:T$10)>0,$E13*$G13,0)","v":0},null,{"$f":"IF(SUM(V$8:V$10)>0,$E13*$G13,0)","v":0},null,{"$f":"IF(SUM(X$8:X$10)>0,$E13*$G13,0)","v":0},null,{"$f":"IF(SUM(Z$8:Z$10)>0,$E13*$G13,0)","v":0},null,{"$f":"IF(SUM(AB$8:AB$10)>0,$E13*$G13,0)","v":0},null,{"$f":"IF(SUM(AD$8:AD$10)>0,$E13*$G13,0)","v":0},null,{"$f":"IF(SUM(AF$8:AF$10)>0,$E13*$G13,0)","v":0},null,{"$f":"IF(SUM(AH$8:AH$10)>0,$E13*$G13,0)","v":0},null,{"$f":"IF(SUM(AJ$8:AJ$10)>0,$E13*$G13,0)","v":0},null,{"$f":"IF(SUM(AL$8:AL$10)>0,$E13*$G13,0)","v":0},null,{"$f":"IF(SUM(AN$8:AN$10)>0,$E13*$G13,0)","v":0},null,{"$f":"IF(SUM(AP$8:AP$10)>0,$E13*$G13,0)","v":0},null,{"$f":"IF(SUM(AR$8:AR$10)>0,$E13*$G13,0)","v":0},null,{"$f":"IF(SUM(AT$8:AT$10)>0,$E13*$G13,0)","v":0},null,{"$f":"IF(SUM(AV$8:AV$10)>0,$E13*$G13,0)","v":0},null,{"$f":"IF(SUM(AX$8:AX$10)>0,$E13*$G13,0)","v":0},null,{"$f":"IF(SUM(AZ$8:AZ$10)>0,$E13*$G13,0)","v":0},null,{"$f":"IF(SUM(BB$8:BB$10)>0,$E13*$G13,0)","v":0},null,{"$f":"IF(SUM(BD$8:BD$10)>0,$E13*$G13,0)","v":0},null,{"$f":"IF(SUM(BF$8:BF$10)>0,$E13*$G13,0)","v":0},null,{"$f":"IF(SUM(BH$8:BH$10)>0,$E13*$G13,0)","v":0},null,{"$f":"IF(SUM(BJ$8:BJ$10)>0,$E13*$G13,0)","v":0},null,{"$f":"IF(SUM(BL$8:BL$10)>0,$E13*$G13,0)","v":0},null,{"$f":"IF(SUM(BN$8:BN$10)>0,$E13*$G13,0)","v":0},null,{"$f":"IF(SUM(BP$8:BP$10)>0,$E13*$G13,0)","v":0},null,{"$f":"IF(SUM(BR$8:BR$10)>0,$E13*$G13,0)","v":0},null,{"$f":"IF(SUM(BT$8:BT$10)>0,$E13*$G13,0)","v":0},null,{"$f":"IF(SUM(BV$8:BV$10)>0,$E13*$G13,0)","v":0},null,{"$f":"IF(SUM(BX$8:BX$10)>0,$E13*$G13,0)","v":0},null,{"$f":"IF(SUM(BZ$8:BZ$10)>0,$E13*$G13,0)","v":0},null,{"$f":"IF(SUM(CB$8:CB$10)>0,$E13*$G13,0)","v":0},null,{"$f":"IF(SUM(CD$8:CD$10)>0,$E13*$G13,0)","v":0},null,{"$f":"IF(SUM(CF$8:CF$10)>0,$E13*$G13,0)","v":0},null,{"$f":"IF(SUM(CH$8:CH$10)>0,$E13*$G13,0)","v":0},null,{"$f":"IF(SUM(CJ$8:CJ$10)>0,$E13*$G13,0)","v":0},null,{"$f":"IF(SUM(CL$8:CL$10)>0,$E13*$G13,0)","v":0},null,{"$f":"IF(SUM(CN$8:CN$10)>0,$E13*$G13,0)","v":0},null,{"$f":"IF(SUM(CP$8:CP$10)>0,$E13*$G13,0)","v":0},null,{"$f":"IF(SUM(CR$8:CR$10)>0,$E13*$G13,0)","v":0},null,{"$f":"IF(SUM(CT$8:CT$10)>0,$E13*$G13,0)","v":0},null,{"$f":"IF(SUM(CV$8:CV$10)>0,$E13*$G13,0)","v":0},null,{"$f":"IF(SUM(CX$8:CX$10)>0,$E13*$G13,0)","v":0},null,{"$f":"IF(SUM(CZ$8:CZ$10)>0,$E13*$G13,0)","v":0},null,{"$f":"IF(SUM(DB$8:DB$10)>0,$E13*$G13,0)","v":0},null,{"$f":"IF(SUM(DD$8:DD$10)>0,$E13*$G13,0)","v":0},null,{"$f":"IF(SUM(DF$8:DF$10)>0,$E13*$G13,0)","v":0},null,{"$f":"IF(SUM(DH$8:DH$10)>0,$E13*$G13,0)","v":0},null,{"$f":"IF(SUM(DJ$8:DJ$10)>0,$E13*$G13,0)","v":0},null,{"$f":"IF(SUM(DL$8:DL$10)>0,$E13*$G13,0)","v":0},null,{"$f":"IF(SUM(DN$8:DN$10)>0,$E13*$G13,0)","v":0},null,{"$f":"IF(SUM(DP$8:DP$10)>0,$E13*$G13,0)","v":0},null,{"$f":"IF(SUM(DR$8:DR$10)>0,$E13*$G13,0)","v":0},null,{"$f":"IF(SUM(DT$8:DT$10)>0,$E13*$G13,0)","v":0},null,{"$f":"IF(SUM(DV$8:DV$10)>0,$E13*$G13,0)","v":0},null,{"$f":"IF(SUM(DX$8:DX$10)>0,$E13*$G13,0)","v":0}]
[null,null,1,"Respirador purificador de ar tipo, peça semifacial filtrante para partículas (PFF2), com formato dobrável, solda ultra-sônica em todo o seu perímetro. Fita elástica branca fixada nas laterais externas do respirador, perfazendo uma alça na para fixação na parte superior da cabeça e a outra na parte inferior, para fixação na altura da nuca do usuário. A parte superior externa da peça possui tira de material metálico moldável, utilizada para ajuste no septo nasal. Com válvula de exalação. DEVERÁ APRESENTAR O SELO DE APROVAÇÃO DO INMETRO. Ref. 3M ",1,"UND",1.62,null,null,null,{"$f":"IF(SUM(J$8:J$10)>0,$E14*$G14,0)","v":1.62},null,{"$f":"IF(SUM(L$8:L$10)>0,$E14*$G14,0)","v":0},null,{"$f":"IF(SUM(N$8:N$10)>0,$E14*$G14,0)","v":0},null,{"$f":"IF(SUM(P$8:P$10)>0,$E14*$G14,0)","v":0},null,{"$f":"IF(SUM(R$8:R$10)>0,$E14*$G14,0)","v":0},null,{"$f":"IF(SUM(T$8:T$10)>0,$E14*$G14,0)","v":0},null,{"$f":"IF(SUM(V$8:V$10)>0,$E14*$G14,0)","v":0},null,{"$f":"IF(SUM(X$8:X$10)>0,$E14*$G14,0)","v":0},null,{"$f":"IF(SUM(Z$8:Z$10)>0,$E14*$G14,0)","v":0},null,{"$f":"IF(SUM(AB$8:AB$10)>0,$E14*$G14,0)","v":0},null,{"$f":"IF(SUM(AD$8:AD$10)>0,$E14*$G14,0)","v":0},null,{"$f":"IF(SUM(AF$8:AF$10)>0,$E14*$G14,0)","v":0},null,{"$f":"IF(SUM(AH$8:AH$10)>0,$E14*$G14,0)","v":0},null,{"$f":"IF(SUM(AJ$8:AJ$10)>0,$E14*$G14,0)","v":0},null,{"$f":"IF(SUM(AL$8:AL$10)>0,$E14*$G14,0)","v":0},null,{"$f":"IF(SUM(AN$8:AN$10)>0,$E14*$G14,0)","v":0},null,{"$f":"IF(SUM(AP$8:AP$10)>0,$E14*$G14,0)","v":0},null,{"$f":"IF(SUM(AR$8:AR$10)>0,$E14*$G14,0)","v":0},null,{"$f":"IF(SUM(AT$8:AT$10)>0,$E14*$G14,0)","v":0},null,{"$f":"IF(SUM(AV$8:AV$10)>0,$E14*$G14,0)","v":0},null,{"$f":"IF(SUM(AX$8:AX$10)>0,$E14*$G14,0)","v":0},null,{"$f":"IF(SUM(AZ$8:AZ$10)>0,$E14*$G14,0)","v":0},null,{"$f":"IF(SUM(BB$8:BB$10)>0,$E14*$G14,0)","v":0},null,{"$f":"IF(SUM(BD$8:BD$10)>0,$E14*$G14,0)","v":0},null,{"$f":"IF(SUM(BF$8:BF$10)>0,$E14*$G14,0)","v":0},null,{"$f":"IF(SUM(BH$8:BH$10)>0,$E14*$G14,0)","v":0},null,{"$f":"IF(SUM(BJ$8:BJ$10)>0,$E14*$G14,0)","v":0},null,{"$f":"IF(SUM(BL$8:BL$10)>0,$E14*$G14,0)","v":0},null,{"$f":"IF(SUM(BN$8:BN$10)>0,$E14*$G14,0)","v":0},null,{"$f":"IF(SUM(BP$8:BP$10)>0,$E14*$G14,0)","v":0},null,{"$f":"IF(SUM(BR$8:BR$10)>0,$E14*$G14,0)","v":0},null,{"$f":"IF(SUM(BT$8:BT$10)>0,$E14*$G14,0)","v":0},null,{"$f":"IF(SUM(BV$8:BV$10)>0,$E14*$G14,0)","v":0},null,{"$f":"IF(SUM(BX$8:BX$10)>0,$E14*$G14,0)","v":0},null,{"$f":"IF(SUM(BZ$8:BZ$10)>0,$E14*$G14,0)","v":0},null,{"$f":"IF(SUM(CB$8:CB$10)>0,$E14*$G14,0)","v":0},null,{"$f":"IF(SUM(CD$8:CD$10)>0,$E14*$G14,0)","v":0},null,{"$f":"IF(SUM(CF$8:CF$10)>0,$E14*$G14,0)","v":0},null,{"$f":"IF(SUM(CH$8:CH$10)>0,$E14*$G14,0)","v":0},null,{"$f":"IF(SUM(CJ$8:CJ$10)>0,$E14*$G14,0)","v":0},null,{"$f":"IF(SUM(CL$8:CL$10)>0,$E14*$G14,0)","v":0},null,{"$f":"IF(SUM(CN$8:CN$10)>0,$E14*$G14,0)","v":0},null,{"$f":"IF(SUM(CP$8:CP$10)>0,$E14*$G14,0)","v":0},null,{"$f":"IF(SUM(CR$8:CR$10)>0,$E14*$G14,0)","v":0},null,{"$f":"IF(SUM(CT$8:CT$10)>0,$E14*$G14,0)","v":0},null,{"$f":"IF(SUM(CV$8:CV$10)>0,$E14*$G14,0)","v":0},null,{"$f":"IF(SUM(CX$8:CX$10)>0,$E14*$G14,0)","v":0},null,{"$f":"IF(SUM(CZ$8:CZ$10)>0,$E14*$G14,0)","v":0},null,{"$f":"IF(SUM(DB$8:DB$10)>0,$E14*$G14,0)","v":0},null,{"$f":"IF(SUM(DD$8:DD$10)>0,$E14*$G14,0)","v":0},null,{"$f":"IF(SUM(DF$8:DF$10)>0,$E14*$G14,0)","v":0},null,{"$f":"IF(SUM(DH$8:DH$10)>0,$E14*$G14,0)","v":0},null,{"$f":"IF(SUM(DJ$8:DJ$10)>0,$E14*$G14,0)","v":0},null,{"$f":"IF(SUM(DL$8:DL$10)>0,$E14*$G14,0)","v":0},null,{"$f":"IF(SUM(DN$8:DN$10)>0,$E14*$G14,0)","v":0},null,{"$f":"IF(SUM(DP$8:DP$10)>0,$E14*$G14,0)","v":0},null,{"$f":"IF(SUM(DR$8:DR$10)>0,$E14*$G14,0)","v":0},null,{"$f":"IF(SUM(DT$8:DT$10)>0,$E14*$G14,0)","v":0},null,{"$f":"IF(SUM(DV$8:DV$10)>0,$E14*$G14,0)","v":0},null,0]
[]
[null,null,"CATEGORIAS",null,null,null,"QUANTIDADE"]
[null,null,null,null,null,null,null,null,null,{"$f":"IF($C17=J$4,1,0)","v":0},null,{"$f":"IF($C17=L$4,1,0)","v":0},null,{"$f":"IF($C17=N$4,1,0)","v":0},null,{"$f":"IF($C17=P$4,1,0)","v":0},null,{"$f":"IF($C17=R$4,1,0)","v":0},null,{"$f":"IF($C17=T$4,1,0)","v":0},null,{"$f":"IF($C17=V$4,1,0)","v":0},null,{"$f":"IF($C17=X$4,1,0)","v":0},null,{"$f":"IF($C17=Z$4,1,0)","v":0},null,{"$f":"IF($C17=AB$4,1,0)","v":0},null,{"$f":"IF($C17=AD$4,1,0)","v":0},null,{"$f":"IF($C17=AF$4,1,0)","v":0},null,{"$f":"IF($C17=AH$4,1,0)","v":0},null,{"$f":"IF($C17=AJ$4,1,0)","v":0},null,{"$f":"IF($C17=AL$4,1,0)","v":0},null,{"$f":"IF($C17=AN$4,1,0)","v":0},null,{"$f":"IF($C17=AP$4,1,0)","v":0},null,{"$f":"IF($C17=AR$4,1,0)","v":0},null,{"$f":"IF($C17=AT$4,1,0)","v":0},null,{"$f":"IF($C17=AV$4,1,0)","v":0},null,{"$f":"IF($C17=AX$4,1,0)","v":0},null,{"$f":"IF($C17=AZ$4,1,0)","v":0},null,{"$f":"IF($C17=BB$4,1,0)","v":0},null,{"$f":"IF($C17=BD$4,1,0)","v":0},null,{"$f":"IF($C17=BF$4,1,0)","v":0},null,{"$f":"IF($C17=BH$4,1,0)","v":0},null,{"$f":"IF($C17=BJ$4,1,0)","v":0},null,{"$f":"IF($C17=BL$4,1,0)","v":0},null,{"$f":"IF($C17=BN$4,1,0)","v":0},null,{"$f":"IF($C17=BP$4,1,0)","v":0},null,{"$f":"IF($C17=BR$4,1,0)","v":0},null,{"$f":"IF($C17=BT$4,1,0)","v":0},null,{"$f":"IF($C17=BV$4,1,0)","v":0},null,{"$f":"IF($C17=BX$4,1,0)","v":0},null,{"$f":"IF($C17=BZ$4,1,0)","v":0},null,{"$f":"IF($C17=CB$4,1,0)","v":0},null,{"$f":"IF($C17=CD$4,1,0)","v":0},null,{"$f":"IF($C17=CF$4,1,0)","v":0},null,{"$f":"IF($C17=CH$4,1,0)","v":0},null,{"$f":"IF($C17=CJ$4,1,0)","v":0},null,{"$f":"IF($C17=CL$4,1,0)","v":0},null,{"$f":"IF($C17=CN$4,1,0)","v":0},null,{"$f":"IF($C17=CP$4,1,0)","v":0},null,{"$f":"IF($C17=CR$4,1,0)","v":0},null,{"$f":"IF($C17=CT$4,1,0)","v":0},null,{"$f":"IF($C17=CV$4,1,0)","v":0},null,{"$f":"IF($C17=CX$4,1,0)","v":0},null,{"$f":"IF($C17=CZ$4,1,0)","v":0},null,{"$f":"IF($C17=DB$4,1,0)","v":0},null,{"$f":"IF($C17=DD$4,1,0)","v":0},null,{"$f":"IF($C17=DF$4,1,0)","v":0},null,{"$f":"IF($C17=DH$4,1,0)","v":0},null,{"$f":"IF($C17=DJ$4,1,0)","v":0},null,{"$f":"IF($C17=DL$4,1,0)","v":0},null,{"$f":"IF($C17=DN$4,1,0)","v":0},null,{"$f":"IF($C17=DP$4,1,0)","v":0},null,{"$f":"IF($C17=DR$4,1,0)","v":0},null,{"$f":"IF($C17=DT$4,1,0)","v":0},null,{"$f":"IF($C17=DV$4,1,0)","v":0},null,{"$f":"IF($C17=DX$4,1,0)","v":0}]
[null,null,2,{"$f":"HLOOKUP($C18,'Dados Gerais'!$D$5:$BK$10,6)","v":"ENCARREGADO SETORIAL"},null,null,{"$f":"HLOOKUP($C18,'Dados Gerais'!$D$5:$BK$14,10)","v":2},null,null,{"$f":"IF($C18=J$4,1,0)","v":0},null,1,null,0,null,0,null,0,null,0,null,0,null,0,null,0,null,0,null,0,null,0,null,0,null,0,null,0,null,0,null,0,null,0,null,0,null,0,null,0,null,0,null,0,null,0,null,0,null,0,null,0,null,0,null,0,null,0,null,0,null,0,null,0,null,0,null,0,null,0,null,0,null,0,null,0,null,0,null,0,null,0,null,0,null,0,null,0,null,0,null,0,null,0,null,0,null,0,null,0,null,0,null,0,null,0,null,0,null,0,null,0,null,0,null,0,null,0]
[null,null,null,null,null,null,null,null,null,{"$f":"IF($C19=J$4,1,0)","v":0},null,0,null,0,null,0,null,0,null,0,null,0,null,0,null,0,null,0,null,0,null,0,null,0,null,0,null,0,null,0,null,0,null,0,null,0,null,0,null,0,null,0,null,0,null,0,null,0,null,0,null,0,null,0,null,0,null,0,null,0,null,0,null,0,null,0,null,0,null,0,null,0,null,0,null,0,null,0,null,0,null,0,null,0,null,0,null,0,null,0,null,0,null,0,null,0,null,0,null,0,null,0,null,0,null,0,null,0,null,0,null,0,null,0,null,0,null,0]
[]
[null,null,"ITEM","DESCRIÇÃO","QUANT ANUAL POR POSTO","UNIDADE","VALOR"]
[null,null,null,null,null,null,null,null,null,null,{"$f":"IF(SUM(J$8:J$10)>0,$E22*$G22,0)","v":0},null,{"$f":"IF(SUM(L$8:L$10)>0,$E22*$G22,0)","v":0},null,{"$f":"IF(SUM(N$8:N$10)>0,$E22*$G22,0)","v":0},null,{"$f":"IF(SUM(P$8:P$10)>0,$E22*$G22,0)","v":0},null,{"$f":"IF(SUM(R$8:R$10)>0,$E22*$G22,0)","v":0},null,{"$f":"IF(SUM(T$8:T$10)>0,$E22*$G22,0)","v":0},null,{"$f":"IF(SUM(V$8:V$10)>0,$E22*$G22,0)","v":0},null,{"$f":"IF(SUM(X$8:X$10)>0,$E22*$G22,0)","v":0},null,{"$f":"IF(SUM(Z$8:Z$10)>0,$E22*$G22,0)","v":0},null,{"$f":"IF(SUM(AB$8:AB$10)>0,$E22*$G22,0)","v":0},null,{"$f":"IF(SUM(AD$8:AD$10)>0,$E22*$G22,0)","v":0},null,{"$f":"IF(SUM(AF$8:AF$10)>0,$E22*$G22,0)","v":0},null,{"$f":"IF(SUM(AH$8:AH$10)>0,$E22*$G22,0)","v":0},null,{"$f":"IF(SUM(AJ$8:AJ$10)>0,$E22*$G22,0)","v":0},null,{"$f":"IF(SUM(AL$8:AL$10)>0,$E22*$G22,0)","v":0},null,{"$f":"IF(SUM(AN$8:AN$10)>0,$E22*$G22,0)","v":0},null,{"$f":"IF(SUM(AP$8:AP$10)>0,$E22*$G22,0)","v":0},null,{"$f":"IF(SUM(AR$8:AR$10)>0,$E22*$G22,0)","v":0},null,{"$f":"IF(SUM(AT$8:AT$10)>0,$E22*$G22,0)","v":0},null,{"$f":"IF(SUM(AV$8:AV$10)>0,$E22*$G22,0)","v":0},null,{"$f":"IF(SUM(AX$8:AX$10)>0,$E22*$G22,0)","v":0},null,{"$f":"IF(SUM(AZ$8:AZ$10)>0,$E22*$G22,0)","v":0},null,{"$f":"IF(SUM(BB$8:BB$10)>0,$E22*$G22,0)","v":0},null,{"$f":"IF(SUM(BD$8:BD$10)>0,$E22*$G22,0)","v":0},null,{"$f":"IF(SUM(BF$8:BF$10)>0,$E22*$G22,0)","v":0},null,{"$f":"IF(SUM(BH$8:BH$10)>0,$E22*$G22,0)","v":0},null,{"$f":"IF(SUM(BJ$8:BJ$10)>0,$E22*$G22,0)","v":0},null,{"$f":"IF(SUM(BL$8:BL$10)>0,$E22*$G22,0)","v":0},null,{"$f":"IF(SUM(BN$8:BN$10)>0,$E22*$G22,0)","v":0},null,{"$f":"IF(SUM(BP$8:BP$10)>0,$E22*$G22,0)","v":0},null,{"$f":"IF(SUM(BR$8:BR$10)>0,$E22*$G22,0)","v":0},null,{"$f":"IF(SUM(BT$8:BT$10)>0,$E22*$G22,0)","v":0},null,{"$f":"IF(SUM(BV$8:BV$10)>0,$E22*$G22,0)","v":0},null,{"$f":"IF(SUM(BX$8:BX$10)>0,$E22*$G22,0)","v":0},null,{"$f":"IF(SUM(BZ$8:BZ$10)>0,$E22*$G22,0)","v":0},null,{"$f":"IF(SUM(CB$8:CB$10)>0,$E22*$G22,0)","v":0},null,{"$f":"IF(SUM(CD$8:CD$10)>0,$E22*$G22,0)","v":0},null,{"$f":"IF(SUM(CF$8:CF$10)>0,$E22*$G22,0)","v":0},null,{"$f":"IF(SUM(CH$8:CH$10)>0,$E22*$G22,0)","v":0},null,{"$f":"IF(SUM(CJ$8:CJ$10)>0,$E22*$G22,0)","v":0},null,{"$f":"IF(SUM(CL$8:CL$10)>0,$E22*$G22,0)","v":0},null,{"$f":"IF(SUM(CN$8:CN$10)>0,$E22*$G22,0)","v":0},null,{"$f":"IF(SUM(CP$8:CP$10)>0,$E22*$G22,0)","v":0},null,{"$f":"IF(SUM(CR$8:CR$10)>0,$E22*$G22,0)","v":0},null,{"$f":"IF(SUM(CT$8:CT$10)>0,$E22*$G22,0)","v":0},null,{"$f":"IF(SUM(CV$8:CV$10)>0,$E22*$G22,0)","v":0},null,{"$f":"IF(SUM(CX$8:CX$10)>0,$E22*$G22,0)","v":0},null,{"$f":"IF(SUM(CZ$8:CZ$10)>0,$E22*$G22,0)","v":0},null,{"$f":"IF(SUM(DB$8:DB$10)>0,$E22*$G22,0)","v":0},null,{"$f":"IF(SUM(DD$8:DD$10)>0,$E22*$G22,0)","v":0},null,{"$f":"IF(SUM(DF$8:DF$10)>0,$E22*$G22,0)","v":0},null,{"$f":"IF(SUM(DH$8:DH$10)>0,$E22*$G22,0)","v":0},null,{"$f":"IF(SUM(DJ$8:DJ$10)>0,$E22*$G22,0)","v":0},null,{"$f":"IF(SUM(DL$8:DL$10)>0,$E22*$G22,0)","v":0},null,{"$f":"IF(SUM(DN$8:DN$10)>0,$E22*$G22,0)","v":0},null,{"$f":"IF(SUM(DP$8:DP$10)>0,$E22*$G22,0)","v":0},null,{"$f":"IF(SUM(DR$8:DR$10)>0,$E22*$G22,0)","v":0},null,{"$f":"IF(SUM(DT$8:DT$10)>0,$E22*$G22,0)","v":0},null,{"$f":"IF(SUM(DV$8:DV$10)>0,$E22*$G22,0)","v":0},null,{"$f":"IF(SUM(DX$8:DX$10)>0,$E22*$G22,0)","v":0}]
[null,null,1,"Respirador purificador de ar tipo, peça semifacial filtrante para partículas (PFF2), com formato dobrável, solda ultra-sônica em todo o seu perímetro. Fita elástica branca fixada nas laterais externas do respirador, perfazendo uma alça na para fixação na parte superior da cabeça e a outra na parte inferior, para fixação na altura da nuca do usuário. A parte superior externa da peça possui tira de material metálico moldável, utilizada para ajuste no septo nasal. Com válvula de exalação. DEVERÁ APRESENTAR O SELO DE APROVAÇÃO DO INMETRO. Ref. 3M ",1,"UND",{"$f":"G14","v":1.62},null,null,null,{"$f":"IF(SUM(J$17:J$19)>0,$E23*$G23,0)","v":0},null,{"$f":"IF(SUM(L$17:L$19)>0,$E23*$G23,0)","v":1.62},null,{"$f":"IF(SUM(N$17:N$19)>0,$E23*$G23,0)","v":0},null,{"$f":"IF(SUM(P$17:P$19)>0,$E23*$G23,0)","v":0},null,{"$f":"IF(SUM(R$17:R$19)>0,$E23*$G23,0)","v":0},null,{"$f":"IF(SUM(T$17:T$19)>0,$E23*$G23,0)","v":0},null,{"$f":"IF(SUM(V$17:V$19)>0,$E23*$G23,0)","v":0},null,{"$f":"IF(SUM(X$17:X$19)>0,$E23*$G23,0)","v":0},null,{"$f":"IF(SUM(Z$17:Z$19)>0,$E23*$G23,0)","v":0},null,{"$f":"IF(SUM(AB$17:AB$19)>0,$E23*$G23,0)","v":0},null,{"$f":"IF(SUM(AD$17:AD$19)>0,$E23*$G23,0)","v":0},null,{"$f":"IF(SUM(AF$17:AF$19)>0,$E23*$G23,0)","v":0},null,{"$f":"IF(SUM(AH$17:AH$19)>0,$E23*$G23,0)","v":0},null,{"$f":"IF(SUM(AJ$17:AJ$19)>0,$E23*$G23,0)","v":0},null,{"$f":"IF(SUM(AL$17:AL$19)>0,$E23*$G23,0)","v":0},null,{"$f":"IF(SUM(AN$17:AN$19)>0,$E23*$G23,0)","v":0},null,{"$f":"IF(SUM(AP$17:AP$19)>0,$E23*$G23,0)","v":0},null,{"$f":"IF(SUM(AR$17:AR$19)>0,$E23*$G23,0)","v":0},null,{"$f":"IF(SUM(AT$17:AT$19)>0,$E23*$G23,0)","v":0},null,{"$f":"IF(SUM(AV$17:AV$19)>0,$E23*$G23,0)","v":0},null,{"$f":"IF(SUM(AX$17:AX$19)>0,$E23*$G23,0)","v":0},null,{"$f":"IF(SUM(AZ$17:AZ$19)>0,$E23*$G23,0)","v":0},null,{"$f":"IF(SUM(BB$17:BB$19)>0,$E23*$G23,0)","v":0},null,{"$f":"IF(SUM(BD$17:BD$19)>0,$E23*$G23,0)","v":0},null,{"$f":"IF(SUM(BF$17:BF$19)>0,$E23*$G23,0)","v":0},null,{"$f":"IF(SUM(BH$17:BH$19)>0,$E23*$G23,0)","v":0},null,{"$f":"IF(SUM(BJ$17:BJ$19)>0,$E23*$G23,0)","v":0},null,{"$f":"IF(SUM(BL$17:BL$19)>0,$E23*$G23,0)","v":0},null,{"$f":"IF(SUM(BN$17:BN$19)>0,$E23*$G23,0)","v":0},null,{"$f":"IF(SUM(BP$17:BP$19)>0,$E23*$G23,0)","v":0},null,{"$f":"IF(SUM(BR$17:BR$19)>0,$E23*$G23,0)","v":0},null,{"$f":"IF(SUM(BT$17:BT$19)>0,$E23*$G23,0)","v":0},null,{"$f":"IF(SUM(BV$17:BV$19)>0,$E23*$G23,0)","v":0},null,{"$f":"IF(SUM(BX$17:BX$19)>0,$E23*$G23,0)","v":0},null,{"$f":"IF(SUM(BZ$17:BZ$19)>0,$E23*$G23,0)","v":0},null,{"$f":"IF(SUM(CB$17:CB$19)>0,$E23*$G23,0)","v":0},null,{"$f":"IF(SUM(CD$17:CD$19)>0,$E23*$G23,0)","v":0},null,{"$f":"IF(SUM(CF$17:CF$19)>0,$E23*$G23,0)","v":0},null,{"$f":"IF(SUM(CH$17:CH$19)>0,$E23*$G23,0)","v":0},null,{"$f":"IF(SUM(CJ$17:CJ$19)>0,$E23*$G23,0)","v":0},null,{"$f":"IF(SUM(CL$17:CL$19)>0,$E23*$G23,0)","v":0},null,{"$f":"IF(SUM(CN$17:CN$19)>0,$E23*$G23,0)","v":0},null,{"$f":"IF(SUM(CP$17:CP$19)>0,$E23*$G23,0)","v":0},null,{"$f":"IF(SUM(CR$17:CR$19)>0,$E23*$G23,0)","v":0},null,{"$f":"IF(SUM(CT$17:CT$19)>0,$E23*$G23,0)","v":0},null,{"$f":"IF(SUM(CV$17:CV$19)>0,$E23*$G23,0)","v":0},null,{"$f":"IF(SUM(CX$17:CX$19)>0,$E23*$G23,0)","v":0},null,{"$f":"IF(SUM(CZ$17:CZ$19)>0,$E23*$G23,0)","v":0},null,{"$f":"IF(SUM(DB$17:DB$19)>0,$E23*$G23,0)","v":0},null,{"$f":"IF(SUM(DD$17:DD$19)>0,$E23*$G23,0)","v":0},null,{"$f":"IF(SUM(DF$17:DF$19)>0,$E23*$G23,0)","v":0},null,{"$f":"IF(SUM(DH$17:DH$19)>0,$E23*$G23,0)","v":0},null,{"$f":"IF(SUM(DJ$17:DJ$19)>0,$E23*$G23,0)","v":0},null,{"$f":"IF(SUM(DL$17:DL$19)>0,$E23*$G23,0)","v":0},null,{"$f":"IF(SUM(DN$17:DN$19)>0,$E23*$G23,0)","v":0},null,{"$f":"IF(SUM(DP$17:DP$19)>0,$E23*$G23,0)","v":0},null,{"$f":"IF(SUM(DR$17:DR$19)>0,$E23*$G23,0)","v":0},null,{"$f":"IF(SUM(DT$17:DT$19)>0,$E23*$G23,0)","v":0},null,{"$f":"IF(SUM(DV$17:DV$19)>0,$E23*$G23,0)","v":0},null,{"$f":"IF(SUM(DX$17:DX$19)>0,$E23*$G23,0)","v":0}]
[null,null,2,"Protetor auditivo, do tipo inserção pré-moldado, de silicone, lavável, com cordão e tamanho único,  com proteção mínima de 18 Db(A) de atenuação pelo método NRRsf. Ref: 3M",1,"UND",2.4900000000000002,null,null,null,{"$f":"IF(SUM(J$17:J$19)>0,$E24*$G24,0)","v":0},null,{"$f":"IF(SUM(L$17:L$19)>0,$E24*$G24,0)","v":2.4900000000000002},null,{"$f":"IF(SUM(N$17:N$19)>0,$E24*$G24,0)","v":0},null,{"$f":"IF(SUM(P$17:P$19)>0,$E24*$G24,0)","v":0},null,{"$f":"IF(SUM(R$17:R$19)>0,$E24*$G24,0)","v":0},null,{"$f":"IF(SUM(T$17:T$19)>0,$E24*$G24,0)","v":0},null,{"$f":"IF(SUM(V$17:V$19)>0,$E24*$G24,0)","v":0},null,{"$f":"IF(SUM(X$17:X$19)>0,$E24*$G24,0)","v":0},null,{"$f":"IF(SUM(Z$17:Z$19)>0,$E24*$G24,0)","v":0},null,{"$f":"IF(SUM(AB$17:AB$19)>0,$E24*$G24,0)","v":0},null,{"$f":"IF(SUM(AD$17:AD$19)>0,$E24*$G24,0)","v":0},null,{"$f":"IF(SUM(AF$17:AF$19)>0,$E24*$G24,0)","v":0},null,{"$f":"IF(SUM(AH$17:AH$19)>0,$E24*$G24,0)","v":0},null,{"$f":"IF(SUM(AJ$17:AJ$19)>0,$E24*$G24,0)","v":0},null,{"$f":"IF(SUM(AL$17:AL$19)>0,$E24*$G24,0)","v":0},null,{"$f":"IF(SUM(AN$17:AN$19)>0,$E24*$G24,0)","v":0},null,{"$f":"IF(SUM(AP$17:AP$19)>0,$E24*$G24,0)","v":0},null,{"$f":"IF(SUM(AR$17:AR$19)>0,$E24*$G24,0)","v":0},null,{"$f":"IF(SUM(AT$17:AT$19)>0,$E24*$G24,0)","v":0},null,{"$f":"IF(SUM(AV$17:AV$19)>0,$E24*$G24,0)","v":0},null,{"$f":"IF(SUM(AX$17:AX$19)>0,$E24*$G24,0)","v":0},null,{"$f":"IF(SUM(AZ$17:AZ$19)>0,$E24*$G24,0)","v":0},null,{"$f":"IF(SUM(BB$17:BB$19)>0,$E24*$G24,0)","v":0},null,{"$f":"IF(SUM(BD$17:BD$19)>0,$E24*$G24,0)","v":0},null,{"$f":"IF(SUM(BF$17:BF$19)>0,$E24*$G24,0)","v":0},null,{"$f":"IF(SUM(BH$17:BH$19)>0,$E24*$G24,0)","v":0},null,{"$f":"IF(SUM(BJ$17:BJ$19)>0,$E24*$G24,0)","v":0},null,{"$f":"IF(SUM(BL$17:BL$19)>0,$E24*$G24,0)","v":0},null,{"$f":"IF(SUM(BN$17:BN$19)>0,$E24*$G24,0)","v":0},null,{"$f":"IF(SUM(BP$17:BP$19)>0,$E24*$G24,0)","v":0},null,{"$f":"IF(SUM(BR$17:BR$19)>0,$E24*$G24,0)","v":0},null,{"$f":"IF(SUM(BT$17:BT$19)>0,$E24*$G24,0)","v":0},null,{"$f":"IF(SUM(BV$17:BV$19)>0,$E24*$G24,0)","v":0},null,{"$f":"IF(SUM(BX$17:BX$19)>0,$E24*$G24,0)","v":0},null,{"$f":"IF(SUM(BZ$17:BZ$19)>0,$E24*$G24,0)","v":0},null,{"$f":"IF(SUM(CB$17:CB$19)>0,$E24*$G24,0)","v":0},null,{"$f":"IF(SUM(CD$17:CD$19)>0,$E24*$G24,0)","v":0},null,{"$f":"IF(SUM(CF$17:CF$19)>0,$E24*$G24,0)","v":0},null,{"$f":"IF(SUM(CH$17:CH$19)>0,$E24*$G24,0)","v":0},null,{"$f":"IF(SUM(CJ$17:CJ$19)>0,$E24*$G24,0)","v":0},null,{"$f":"IF(SUM(CL$17:CL$19)>0,$E24*$G24,0)","v":0},null,{"$f":"IF(SUM(CN$17:CN$19)>0,$E24*$G24,0)","v":0},null,{"$f":"IF(SUM(CP$17:CP$19)>0,$E24*$G24,0)","v":0},null,{"$f":"IF(SUM(CR$17:CR$19)>0,$E24*$G24,0)","v":0},null,{"$f":"IF(SUM(CT$17:CT$19)>0,$E24*$G24,0)","v":0},null,{"$f":"IF(SUM(CV$17:CV$19)>0,$E24*$G24,0)","v":0},null,{"$f":"IF(SUM(CX$17:CX$19)>0,$E24*$G24,0)","v":0},null,{"$f":"IF(SUM(CZ$17:CZ$19)>0,$E24*$G24,0)","v":0},null,{"$f":"IF(SUM(DB$17:DB$19)>0,$E24*$G24,0)","v":0},null,{"$f":"IF(SUM(DD$17:DD$19)>0,$E24*$G24,0)","v":0},null,{"$f":"IF(SUM(DF$17:DF$19)>0,$E24*$G24,0)","v":0},null,{"$f":"IF(SUM(DH$17:DH$19)>0,$E24*$G24,0)","v":0},null,{"$f":"IF(SUM(DJ$17:DJ$19)>0,$E24*$G24,0)","v":0},null,{"$f":"IF(SUM(DL$17:DL$19)>0,$E24*$G24,0)","v":0},null,{"$f":"IF(SUM(DN$17:DN$19)>0,$E24*$G24,0)","v":0},null,{"$f":"IF(SUM(DP$17:DP$19)>0,$E24*$G24,0)","v":0},null,{"$f":"IF(SUM(DR$17:DR$19)>0,$E24*$G24,0)","v":0},null,{"$f":"IF(SUM(DT$17:DT$19)>0,$E24*$G24,0)","v":0},null,{"$f":"IF(SUM(DV$17:DV$19)>0,$E24*$G24,0)","v":0},null,{"$f":"IF(SUM(DX$17:DX$19)>0,$E24*$G24,0)","v":0}]
[null,null,null,null,null,null,null,null,null,null,{"$f":"IF(SUM(J$17:J$19)>0,$E25*$G25,0)","v":0},null,{"$f":"IF(SUM(L$17:L$19)>0,$E25*$G25,0)","v":0},null,{"$f":"IF(SUM(N$17:N$19)>0,$E25*$G25,0)","v":0},null,{"$f":"IF(SUM(P$17:P$19)>0,$E25*$G25,0)","v":0},null,{"$f":"IF(SUM(R$17:R$19)>0,$E25*$G25,0)","v":0},null,{"$f":"IF(SUM(T$17:T$19)>0,$E25*$G25,0)","v":0},null,{"$f":"IF(SUM(V$17:V$19)>0,$E25*$G25,0)","v":0},null,{"$f":"IF(SUM(X$17:X$19)>0,$E25*$G25,0)","v":0},null,{"$f":"IF(SUM(Z$17:Z$19)>0,$E25*$G25,0)","v":0},null,{"$f":"IF(SUM(AB$17:AB$19)>0,$E25*$G25,0)","v":0},null,{"$f":"IF(SUM(AD$17:AD$19)>0,$E25*$G25,0)","v":0},null,{"$f":"IF(SUM(AF$17:AF$19)>0,$E25*$G25,0)","v":0},null,{"$f":"IF(SUM(AH$17:AH$19)>0,$E25*$G25,0)","v":0},null,{"$f":"IF(SUM(AJ$17:AJ$19)>0,$E25*$G25,0)","v":0},null,{"$f":"IF(SUM(AL$17:AL$19)>0,$E25*$G25,0)","v":0},null,{"$f":"IF(SUM(AN$17:AN$19)>0,$E25*$G25,0)","v":0},null,{"$f":"IF(SUM(AP$17:AP$19)>0,$E25*$G25,0)","v":0},null,{"$f":"IF(SUM(AR$17:AR$19)>0,$E25*$G25,0)","v":0},null,{"$f":"IF(SUM(AT$17:AT$19)>0,$E25*$G25,0)","v":0},null,{"$f":"IF(SUM(AV$17:AV$19)>0,$E25*$G25,0)","v":0},null,{"$f":"IF(SUM(AX$17:AX$19)>0,$E25*$G25,0)","v":0},null,{"$f":"IF(SUM(AZ$17:AZ$19)>0,$E25*$G25,0)","v":0},null,{"$f":"IF(SUM(BB$17:BB$19)>0,$E25*$G25,0)","v":0},null,{"$f":"IF(SUM(BD$17:BD$19)>0,$E25*$G25,0)","v":0},null,{"$f":"IF(SUM(BF$17:BF$19)>0,$E25*$G25,0)","v":0},null,{"$f":"IF(SUM(BH$17:BH$19)>0,$E25*$G25,0)","v":0},null,{"$f":"IF(SUM(BJ$17:BJ$19)>0,$E25*$G25,0)","v":0},null,{"$f":"IF(SUM(BL$17:BL$19)>0,$E25*$G25,0)","v":0},null,{"$f":"IF(SUM(BN$17:BN$19)>0,$E25*$G25,0)","v":0},null,{"$f":"IF(SUM(BP$17:BP$19)>0,$E25*$G25,0)","v":0},null,{"$f":"IF(SUM(BR$17:BR$19)>0,$E25*$G25,0)","v":0},null,{"$f":"IF(SUM(BT$17:BT$19)>0,$E25*$G25,0)","v":0},null,{"$f":"IF(SUM(BV$17:BV$19)>0,$E25*$G25,0)","v":0},null,{"$f":"IF(SUM(BX$17:BX$19)>0,$E25*$G25,0)","v":0},null,{"$f":"IF(SUM(BZ$17:BZ$19)>0,$E25*$G25,0)","v":0},null,{"$f":"IF(SUM(CB$17:CB$19)>0,$E25*$G25,0)","v":0},null,{"$f":"IF(SUM(CD$17:CD$19)>0,$E25*$G25,0)","v":0},null,{"$f":"IF(SUM(CF$17:CF$19)>0,$E25*$G25,0)","v":0},null,{"$f":"IF(SUM(CH$17:CH$19)>0,$E25*$G25,0)","v":0},null,{"$f":"IF(SUM(CJ$17:CJ$19)>0,$E25*$G25,0)","v":0},null,{"$f":"IF(SUM(CL$17:CL$19)>0,$E25*$G25,0)","v":0},null,{"$f":"IF(SUM(CN$17:CN$19)>0,$E25*$G25,0)","v":0},null,{"$f":"IF(SUM(CP$17:CP$19)>0,$E25*$G25,0)","v":0},null,{"$f":"IF(SUM(CR$17:CR$19)>0,$E25*$G25,0)","v":0},null,{"$f":"IF(SUM(CT$17:CT$19)>0,$E25*$G25,0)","v":0},null,{"$f":"IF(SUM(CV$17:CV$19)>0,$E25*$G25,0)","v":0},null,{"$f":"IF(SUM(CX$17:CX$19)>0,$E25*$G25,0)","v":0},null,{"$f":"IF(SUM(CZ$17:CZ$19)>0,$E25*$G25,0)","v":0},null,{"$f":"IF(SUM(DB$17:DB$19)>0,$E25*$G25,0)","v":0},null,{"$f":"IF(SUM(DD$17:DD$19)>0,$E25*$G25,0)","v":0},null,{"$f":"IF(SUM(DF$17:DF$19)>0,$E25*$G25,0)","v":0},null,{"$f":"IF(SUM(DH$17:DH$19)>0,$E25*$G25,0)","v":0},null,{"$f":"IF(SUM(DJ$17:DJ$19)>0,$E25*$G25,0)","v":0},null,{"$f":"IF(SUM(DL$17:DL$19)>0,$E25*$G25,0)","v":0},null,{"$f":"IF(SUM(DN$17:DN$19)>0,$E25*$G25,0)","v":0},null,{"$f":"IF(SUM(DP$17:DP$19)>0,$E25*$G25,0)","v":0},null,{"$f":"IF(SUM(DR$17:DR$19)>0,$E25*$G25,0)","v":0},null,{"$f":"IF(SUM(DT$17:DT$19)>0,$E25*$G25,0)","v":0},null,{"$f":"IF(SUM(DV$17:DV$19)>0,$E25*$G25,0)","v":0},null,0]
[null,null,"CATEGORIAS",null,null,null,"QUANTIDADE"]
[null,null,null,null,null,null,null,null,null,{"$f":"IF($C27=J$4,1,0)","v":0},null,{"$f":"IF($C27=L$4,1,0)","v":0},null,{"$f":"IF($C27=N$4,1,0)","v":0},null,{"$f":"IF($C27=P$4,1,0)","v":0},null,{"$f":"IF($C27=R$4,1,0)","v":0},null,{"$f":"IF($C27=T$4,1,0)","v":0},null,{"$f":"IF($C27=V$4,1,0)","v":0},null,{"$f":"IF($C27=X$4,1,0)","v":0},null,{"$f":"IF($C27=Z$4,1,0)","v":0},null,{"$f":"IF($C27=AB$4,1,0)","v":0},null,{"$f":"IF($C27=AD$4,1,0)","v":0},null,{"$f":"IF($C27=AF$4,1,0)","v":0},null,{"$f":"IF($C27=AH$4,1,0)","v":0},null,{"$f":"IF($C27=AJ$4,1,0)","v":0},null,{"$f":"IF($C27=AL$4,1,0)","v":0},null,{"$f":"IF($C27=AN$4,1,0)","v":0},null,{"$f":"IF($C27=AP$4,1,0)","v":0},null,{"$f":"IF($C27=AR$4,1,0)","v":0},null,{"$f":"IF($C27=AT$4,1,0)","v":0},null,{"$f":"IF($C27=AV$4,1,0)","v":0},null,{"$f":"IF($C27=AX$4,1,0)","v":0},null,{"$f":"IF($C27=AZ$4,1,0)","v":0},null,{"$f":"IF($C27=BB$4,1,0)","v":0},null,{"$f":"IF($C27=BD$4,1,0)","v":0},null,{"$f":"IF($C27=BF$4,1,0)","v":0},null,{"$f":"IF($C27=BH$4,1,0)","v":0},null,{"$f":"IF($C27=BJ$4,1,0)","v":0},null,{"$f":"IF($C27=BL$4,1,0)","v":0},null,{"$f":"IF($C27=BN$4,1,0)","v":0},null,{"$f":"IF($C27=BP$4,1,0)","v":0},null,{"$f":"IF($C27=BR$4,1,0)","v":0},null,{"$f":"IF($C27=BT$4,1,0)","v":0},null,{"$f":"IF($C27=BV$4,1,0)","v":0},null,{"$f":"IF($C27=BX$4,1,0)","v":0},null,{"$f":"IF($C27=BZ$4,1,0)","v":0},null,{"$f":"IF($C27=CB$4,1,0)","v":0},null,{"$f":"IF($C27=CD$4,1,0)","v":0},null,{"$f":"IF($C27=CF$4,1,0)","v":0},null,{"$f":"IF($C27=CH$4,1,0)","v":0},null,{"$f":"IF($C27=CJ$4,1,0)","v":0},null,{"$f":"IF($C27=CL$4,1,0)","v":0},null,{"$f":"IF($C27=CN$4,1,0)","v":0},null,{"$f":"IF($C27=CP$4,1,0)","v":0},null,{"$f":"IF($C27=CR$4,1,0)","v":0},null,{"$f":"IF($C27=CT$4,1,0)","v":0},null,{"$f":"IF($C27=CV$4,1,0)","v":0},null,{"$f":"IF($C27=CX$4,1,0)","v":0},null,{"$f":"IF($C27=CZ$4,1,0)","v":0},null,{"$f":"IF($C27=DB$4,1,0)","v":0},null,{"$f":"IF($C27=DD$4,1,0)","v":0},null,{"$f":"IF($C27=DF$4,1,0)","v":0},null,{"$f":"IF($C27=DH$4,1,0)","v":0},null,{"$f":"IF($C27=DJ$4,1,0)","v":0},null,{"$f":"IF($C27=DL$4,1,0)","v":0},null,{"$f":"IF($C27=DN$4,1,0)","v":0},null,{"$f":"IF($C27=DP$4,1,0)","v":0},null,{"$f":"IF($C27=DR$4,1,0)","v":0},null,{"$f":"IF($C27=DT$4,1,0)","v":0},null,{"$f":"IF($C27=DV$4,1,0)","v":0},null,{"$f":"IF($C27=DX$4,1,0)","v":0}]
[null,null,3,{"$f":"HLOOKUP($C28,'Dados Gerais'!$D$5:$BK$10,6)","v":"ENCARREGADO DE SERVIÇO"},null,null,{"$f":"HLOOKUP($C28,'Dados Gerais'!$D$5:$BK$14,10)","v":12},null,null,{"$f":"IF($C28=J$4,1,0)","v":0},null,0,null,1,null,0,null,0,null,0,null,0,null,0,null,0,null,0,null,0,null,0,null,0,null,0,null,0,null,0,null,0,null,0,null,0,null,0,null,0,null,0,null,0,null,0,null,0,null,0,null,0,null,0,null,0,null,0,null,0,null,0,null,0,null,0,null,0,null,0,null,0,null,0,null,0,null,0,null,0,null,0,null,0,null,0,null,0,null,0,null,0,null,0,null,0,null,0,null,0,null,0,null,0,null,0,null,0,null,0,null,0,null,0,null,0,null,0]
[null,null,4,{"$f":"HLOOKUP($C29,'Dados Gerais'!$D$5:$BK$10,6)","v":"AUXILIAR DE ENCARREGADO"},null,null,{"$f":"HLOOKUP($C29,'Dados Gerais'!$D$5:$BK$14,10)","v":1},null,null,{"$f":"IF($C29=J$4,1,0)","v":0},null,0,null,0,null,1,null,0,null,0,null,0,null,0,null,0,null,0,null,0,null,0,null,0,null,0,null,0,null,0,null,0,null,0,null,0,null,0,null,0,null,0,null,0,null,0,null,0,null,0,null,0,null,0,null,0,null,0,null,0,null,0,null,0,null,0,null,0,null,0,null,0,null,0,null,0,null,0,null,0,null,0,null,0,null,0,null,0,null,0,null,0,null,0,null,0,null,0,null,0,null,0,null,0,null,0,null,0,null,0,null,0,null,0,null,0,null,0]
[null,null,null,null,null,null,null,null,null,{"$f":"IF($C30=J$4,1,0)","v":0},null,0,null,0,null,0,null,0,null,0,null,0,null,0,null,0,null,0,null,0,null,0,null,0,null,0,null,0,null,0,null,0,null,0,null,0,null,0,null,0,null,0,null,0,null,0,null,0,null,0,null,0,null,0,null,0,null,0,null,0,null,0,null,0,null,0,null,0,null,0,null,0,null,0,null,0,null,0,null,0,null,0,null,0,null,0,null,0,null,0,null,0,null,0,null,0,null,0,null,0,null,0,null,0,null,0,null,0,null,0,null,0,null,0,null,0,null,0]
[]
[null,null,"ITEM","DESCRIÇÃO","QUANT ANUAL POR POSTO","UNIDADE","VALOR"]
[null,null,null,null,null,null,null,null,null,null,{"$f":"IF(SUM(J$8:J$10)>0,$E33*$G33,0)","v":0},null,{"$f":"IF(SUM(L$8:L$10)>0,$E33*$G33,0)","v":0},null,{"$f":"IF(SUM(N$8:N$10)>0,$E33*$G33,0)","v":0},null,{"$f":"IF(SUM(P$8:P$10)>0,$E33*$G33,0)","v":0},null,{"$f":"IF(SUM(R$8:R$10)>0,$E33*$G33,0)","v":0},null,{"$f":"IF(SUM(T$8:T$10)>0,$E33*$G33,0)","v":0},null,{"$f":"IF(SUM(V$8:V$10)>0,$E33*$G33,0)","v":0},null,{"$f":"IF(SUM(X$8:X$10)>0,$E33*$G33,0)","v":0},null,{"$f":"IF(SUM(Z$8:Z$10)>0,$E33*$G33,0)","v":0},null,{"$f":"IF(SUM(AB$8:AB$10)>0,$E33*$G33,0)","v":0},null,{"$f":"IF(SUM(AD$8:AD$10)>0,$E33*$G33,0)","v":0},null,{"$f":"IF(SUM(AF$8:AF$10)>0,$E33*$G33,0)","v":0},null,{"$f":"IF(SUM(AH$8:AH$10)>0,$E33*$G33,0)","v":0},null,{"$f":"IF(SUM(AJ$8:AJ$10)>0,$E33*$G33,0)","v":0},null,{"$f":"IF(SUM(AL$8:AL$10)>0,$E33*$G33,0)","v":0},null,{"$f":"IF(SUM(AN$8:AN$10)>0,$E33*$G33,0)","v":0},null,{"$f":"IF(SUM(AP$8:AP$10)>0,$E33*$G33,0)","v":0},null,{"$f":"IF(SUM(AR$8:AR$10)>0,$E33*$G33,0)","v":0},null,{"$f":"IF(SUM(AT$8:AT$10)>0,$E33*$G33,0)","v":0},null,{"$f":"IF(SUM(AV$8:AV$10)>0,$E33*$G33,0)","v":0},null,{"$f":"IF(SUM(AX$8:AX$10)>0,$E33*$G33,0)","v":0},null,{"$f":"IF(SUM(AZ$8:AZ$10)>0,$E33*$G33,0)","v":0},null,{"$f":"IF(SUM(BB$8:BB$10)>0,$E33*$G33,0)","v":0},null,{"$f":"IF(SUM(BD$8:BD$10)>0,$E33*$G33,0)","v":0},null,{"$f":"IF(SUM(BF$8:BF$10)>0,$E33*$G33,0)","v":0},null,{"$f":"IF(SUM(BH$8:BH$10)>0,$E33*$G33,0)","v":0},null,{"$f":"IF(SUM(BJ$8:BJ$10)>0,$E33*$G33,0)","v":0},null,{"$f":"IF(SUM(BL$8:BL$10)>0,$E33*$G33,0)","v":0},null,{"$f":"IF(SUM(BN$8:BN$10)>0,$E33*$G33,0)","v":0},null,{"$f":"IF(SUM(BP$8:BP$10)>0,$E33*$G33,0)","v":0},null,{"$f":"IF(SUM(BR$8:BR$10)>0,$E33*$G33,0)","v":0},null,{"$f":"IF(SUM(BT$8:BT$10)>0,$E33*$G33,0)","v":0},null,{"$f":"IF(SUM(BV$8:BV$10)>0,$E33*$G33,0)","v":0},null,{"$f":"IF(SUM(BX$8:BX$10)>0,$E33*$G33,0)","v":0},null,{"$f":"IF(SUM(BZ$8:BZ$10)>0,$E33*$G33,0)","v":0},null,{"$f":"IF(SUM(CB$8:CB$10)>0,$E33*$G33,0)","v":0},null,{"$f":"IF(SUM(CD$8:CD$10)>0,$E33*$G33,0)","v":0},null,{"$f":"IF(SUM(CF$8:CF$10)>0,$E33*$G33,0)","v":0},null,{"$f":"IF(SUM(CH$8:CH$10)>0,$E33*$G33,0)","v":0},null,{"$f":"IF(SUM(CJ$8:CJ$10)>0,$E33*$G33,0)","v":0},null,{"$f":"IF(SUM(CL$8:CL$10)>0,$E33*$G33,0)","v":0},null,{"$f":"IF(SUM(CN$8:CN$10)>0,$E33*$G33,0)","v":0},null,{"$f":"IF(SUM(CP$8:CP$10)>0,$E33*$G33,0)","v":0},null,{"$f":"IF(SUM(CR$8:CR$10)>0,$E33*$G33,0)","v":0},null,{"$f":"IF(SUM(CT$8:CT$10)>0,$E33*$G33,0)","v":0},null,{"$f":"IF(SUM(CV$8:CV$10)>0,$E33*$G33,0)","v":0},null,{"$f":"IF(SUM(CX$8:CX$10)>0,$E33*$G33,0)","v":0},null,{"$f":"IF(SUM(CZ$8:CZ$10)>0,$E33*$G33,0)","v":0},null,{"$f":"IF(SUM(DB$8:DB$10)>0,$E33*$G33,0)","v":0},null,{"$f":"IF(SUM(DD$8:DD$10)>0,$E33*$G33,0)","v":0},null,{"$f":"IF(SUM(DF$8:DF$10)>0,$E33*$G33,0)","v":0},null,{"$f":"IF(SUM(DH$8:DH$10)>0,$E33*$G33,0)","v":0},null,{"$f":"IF(SUM(DJ$8:DJ$10)>0,$E33*$G33,0)","v":0},null,{"$f":"IF(SUM(DL$8:DL$10)>0,$E33*$G33,0)","v":0},null,{"$f":"IF(SUM(DN$8:DN$10)>0,$E33*$G33,0)","v":0},null,{"$f":"IF(SUM(DP$8:DP$10)>0,$E33*$G33,0)","v":0},null,{"$f":"IF(SUM(DR$8:DR$10)>0,$E33*$G33,0)","v":0},null,{"$f":"IF(SUM(DT$8:DT$10)>0,$E33*$G33,0)","v":0},null,{"$f":"IF(SUM(DV$8:DV$10)>0,$E33*$G33,0)","v":0},null,{"$f":"IF(SUM(DX$8:DX$10)>0,$E33*$G33,0)","v":0}]
[null,null,1,"Respirador purificador de ar tipo, peça semifacial filtrante para partículas (PFF2), com formato dobrável, solda ultra-sônica em todo o seu perímetro. Fita elástica branca fixada nas laterais externas do respirador, perfazendo uma alça na para fixação na parte superior da cabeça e a outra na parte inferior, para fixação na altura da nuca do usuário. A parte superior externa da peça possui tira de material metálico moldável, utilizada para ajuste no septo nasal. Com válvula de exalação. DEVERÁ APRESENTAR O SELO DE APROVAÇÃO DO INMETRO. Ref. 3M ",1,"UND",{"$f":"G23","v":1.62},null,null,null,{"$f":"IF(SUM(J$27:J$30)>0,$E34*$G34,0)","v":0},null,{"$f":"IF(SUM(L$27:L$30)>0,$E34*$G34,0)","v":0},null,{"$f":"IF(SUM(N$27:N$30)>0,$E34*$G34,0)","v":1.62},null,{"$f":"IF(SUM(P$27:P$30)>0,$E34*$G34,0)","v":1.62},null,{"$f":"IF(SUM(R$27:R$30)>0,$E34*$G34,0)","v":0},null,{"$f":"IF(SUM(T$27:T$30)>0,$E34*$G34,0)","v":0},null,{"$f":"IF(SUM(V$27:V$30)>0,$E34*$G34,0)","v":0},null,{"$f":"IF(SUM(X$27:X$30)>0,$E34*$G34,0)","v":0},null,{"$f":"IF(SUM(Z$27:Z$30)>0,$E34*$G34,0)","v":0},null,{"$f":"IF(SUM(AB$27:AB$30)>0,$E34*$G34,0)","v":0},null,{"$f":"IF(SUM(AD$27:AD$30)>0,$E34*$G34,0)","v":0},null,{"$f":"IF(SUM(AF$27:AF$30)>0,$E34*$G34,0)","v":0},null,{"$f":"IF(SUM(AH$27:AH$30)>0,$E34*$G34,0)","v":0},null,{"$f":"IF(SUM(AJ$27:AJ$30)>0,$E34*$G34,0)","v":0},null,{"$f":"IF(SUM(AL$27:AL$30)>0,$E34*$G34,0)","v":0},null,{"$f":"IF(SUM(AN$27:AN$30)>0,$E34*$G34,0)","v":0},null,{"$f":"IF(SUM(AP$27:AP$30)>0,$E34*$G34,0)","v":0},null,{"$f":"IF(SUM(AR$27:AR$30)>0,$E34*$G34,0)","v":0},null,{"$f":"IF(SUM(AT$27:AT$30)>0,$E34*$G34,0)","v":0},null,{"$f":"IF(SUM(AV$27:AV$30)>0,$E34*$G34,0)","v":0},null,{"$f":"IF(SUM(AX$27:AX$30)>0,$E34*$G34,0)","v":0},null,{"$f":"IF(SUM(AZ$27:AZ$30)>0,$E34*$G34,0)","v":0},null,{"$f":"IF(SUM(BB$27:BB$30)>0,$E34*$G34,0)","v":0},null,{"$f":"IF(SUM(BD$27:BD$30)>0,$E34*$G34,0)","v":0},null,{"$f":"IF(SUM(BF$27:BF$30)>0,$E34*$G34,0)","v":0},null,{"$f":"IF(SUM(BH$27:BH$30)>0,$E34*$G34,0)","v":0},null,{"$f":"IF(SUM(BJ$27:BJ$30)>0,$E34*$G34,0)","v":0},null,{"$f":"IF(SUM(BL$27:BL$30)>0,$E34*$G34,0)","v":0},null,{"$f":"IF(SUM(BN$27:BN$30)>0,$E34*$G34,0)","v":0},null,{"$f":"IF(SUM(BP$27:BP$30)>0,$E34*$G34,0)","v":0},null,{"$f":"IF(SUM(BR$27:BR$30)>0,$E34*$G34,0)","v":0},null,{"$f":"IF(SUM(BT$27:BT$30)>0,$E34*$G34,0)","v":0},null,{"$f":"IF(SUM(BV$27:BV$30)>0,$E34*$G34,0)","v":0},null,{"$f":"IF(SUM(BX$27:BX$30)>0,$E34*$G34,0)","v":0},null,{"$f":"IF(SUM(BZ$27:BZ$30)>0,$E34*$G34,0)","v":0},null,{"$f":"IF(SUM(CB$27:CB$30)>0,$E34*$G34,0)","v":0},null,{"$f":"IF(SUM(CD$27:CD$30)>0,$E34*$G34,0)","v":0},null,{"$f":"IF(SUM(CF$27:CF$30)>0,$E34*$G34,0)","v":0},null,{"$f":"IF(SUM(CH$27:CH$30)>0,$E34*$G34,0)","v":0},null,{"$f":"IF(SUM(CJ$27:CJ$30)>0,$E34*$G34,0)","v":0},null,{"$f":"IF(SUM(CL$27:CL$30)>0,$E34*$G34,0)","v":0},null,{"$f":"IF(SUM(CN$27:CN$30)>0,$E34*$G34,0)","v":0},null,{"$f":"IF(SUM(CP$27:CP$30)>0,$E34*$G34,0)","v":0},null,{"$f":"IF(SUM(CR$27:CR$30)>0,$E34*$G34,0)","v":0},null,{"$f":"IF(SUM(CT$27:CT$30)>0,$E34*$G34,0)","v":0},null,{"$f":"IF(SUM(CV$27:CV$30)>0,$E34*$G34,0)","v":0},null,{"$f":"IF(SUM(CX$27:CX$30)>0,$E34*$G34,0)","v":0},null,{"$f":"IF(SUM(CZ$27:CZ$30)>0,$E34*$G34,0)","v":0},null,{"$f":"IF(SUM(DB$27:DB$30)>0,$E34*$G34,0)","v":0},null,{"$f":"IF(SUM(DD$27:DD$30)>0,$E34*$G34,0)","v":0},null,{"$f":"IF(SUM(DF$27:DF$30)>0,$E34*$G34,0)","v":0},null,{"$f":"IF(SUM(DH$27:DH$30)>0,$E34*$G34,0)","v":0},null,{"$f":"IF(SUM(DJ$27:DJ$30)>0,$E34*$G34,0)","v":0},null,{"$f":"IF(SUM(DL$27:DL$30)>0,$E34*$G34,0)","v":0},null,{"$f":"IF(SUM(DN$27:DN$30)>0,$E34*$G34,0)","v":0},null,{"$f":"IF(SUM(DP$27:DP$30)>0,$E34*$G34,0)","v":0},null,{"$f":"IF(SUM(DR$27:DR$30)>0,$E34*$G34,0)","v":0},null,{"$f":"IF(SUM(DT$27:DT$30)>0,$E34*$G34,0)","v":0},null,{"$f":"IF(SUM(DV$27:DV$30)>0,$E34*$G34,0)","v":0},null,{"$f":"IF(SUM(DX$27:DX$30)>0,$E34*$G34,0)","v":0}]
[null,null,2,"Protetor auditivo, do tipo inserção pré-moldado, de silicone, lavável, com cordão e tamanho único,  com proteção mínima de 18 Db(A) de atenuação pelo método NRRsf. Ref: 3M",1,"UND",{"$f":"G24","v":2.4900000000000002},null,null,null,{"$f":"IF(SUM(J$27:J$30)>0,$E35*$G35,0)","v":0},null,{"$f":"IF(SUM(L$27:L$30)>0,$E35*$G35,0)","v":0},null,{"$f":"IF(SUM(N$27:N$30)>0,$E35*$G35,0)","v":2.4900000000000002},null,{"$f":"IF(SUM(P$27:P$30)>0,$E35*$G35,0)","v":2.4900000000000002},null,{"$f":"IF(SUM(R$27:R$30)>0,$E35*$G35,0)","v":0},null,{"$f":"IF(SUM(T$27:T$30)>0,$E35*$G35,0)","v":0},null,{"$f":"IF(SUM(V$27:V$30)>0,$E35*$G35,0)","v":0},null,{"$f":"IF(SUM(X$27:X$30)>0,$E35*$G35,0)","v":0},null,{"$f":"IF(SUM(Z$27:Z$30)>0,$E35*$G35,0)","v":0},null,{"$f":"IF(SUM(AB$27:AB$30)>0,$E35*$G35,0)","v":0},null,{"$f":"IF(SUM(AD$27:AD$30)>0,$E35*$G35,0)","v":0},null,{"$f":"IF(SUM(AF$27:AF$30)>0,$E35*$G35,0)","v":0},null,{"$f":"IF(SUM(AH$27:AH$30)>0,$E35*$G35,0)","v":0},null,{"$f":"IF(SUM(AJ$27:AJ$30)>0,$E35*$G35,0)","v":0},null,{"$f":"IF(SUM(AL$27:AL$30)>0,$E35*$G35,0)","v":0},null,{"$f":"IF(SUM(AN$27:AN$30)>0,$E35*$G35,0)","v":0},null,{"$f":"IF(SUM(AP$27:AP$30)>0,$E35*$G35,0)","v":0},null,{"$f":"IF(SUM(AR$27:AR$30)>0,$E35*$G35,0)","v":0},null,{"$f":"IF(SUM(AT$27:AT$30)>0,$E35*$G35,0)","v":0},null,{"$f":"IF(SUM(AV$27:AV$30)>0,$E35*$G35,0)","v":0},null,{"$f":"IF(SUM(AX$27:AX$30)>0,$E35*$G35,0)","v":0},null,{"$f":"IF(SUM(AZ$27:AZ$30)>0,$E35*$G35,0)","v":0},null,{"$f":"IF(SUM(BB$27:BB$30)>0,$E35*$G35,0)","v":0},null,{"$f":"IF(SUM(BD$27:BD$30)>0,$E35*$G35,0)","v":0},null,{"$f":"IF(SUM(BF$27:BF$30)>0,$E35*$G35,0)","v":0},null,{"$f":"IF(SUM(BH$27:BH$30)>0,$E35*$G35,0)","v":0},null,{"$f":"IF(SUM(BJ$27:BJ$30)>0,$E35*$G35,0)","v":0},null,{"$f":"IF(SUM(BL$27:BL$30)>0,$E35*$G35,0)","v":0},null,{"$f":"IF(SUM(BN$27:BN$30)>0,$E35*$G35,0)","v":0},null,{"$f":"IF(SUM(BP$27:BP$30)>0,$E35*$G35,0)","v":0},null,{"$f":"IF(SUM(BR$27:BR$30)>0,$E35*$G35,0)","v":0},null,{"$f":"IF(SUM(BT$27:BT$30)>0,$E35*$G35,0)","v":0},null,{"$f":"IF(SUM(BV$27:BV$30)>0,$E35*$G35,0)","v":0},null,{"$f":"IF(SUM(BX$27:BX$30)>0,$E35*$G35,0)","v":0},null,{"$f":"IF(SUM(BZ$27:BZ$30)>0,$E35*$G35,0)","v":0},null,{"$f":"IF(SUM(CB$27:CB$30)>0,$E35*$G35,0)","v":0},null,{"$f":"IF(SUM(CD$27:CD$30)>0,$E35*$G35,0)","v":0},null,{"$f":"IF(SUM(CF$27:CF$30)>0,$E35*$G35,0)","v":0},null,{"$f":"IF(SUM(CH$27:CH$30)>0,$E35*$G35,0)","v":0},null,{"$f":"IF(SUM(CJ$27:CJ$30)>0,$E35*$G35,0)","v":0},null,{"$f":"IF(SUM(CL$27:CL$30)>0,$E35*$G35,0)","v":0},null,{"$f":"IF(SUM(CN$27:CN$30)>0,$E35*$G35,0)","v":0},null,{"$f":"IF(SUM(CP$27:CP$30)>0,$E35*$G35,0)","v":0},null,{"$f":"IF(SUM(CR$27:CR$30)>0,$E35*$G35,0)","v":0},null,{"$f":"IF(SUM(CT$27:CT$30)>0,$E35*$G35,0)","v":0},null,{"$f":"IF(SUM(CV$27:CV$30)>0,$E35*$G35,0)","v":0},null,{"$f":"IF(SUM(CX$27:CX$30)>0,$E35*$G35,0)","v":0},null,{"$f":"IF(SUM(CZ$27:CZ$30)>0,$E35*$G35,0)","v":0},null,{"$f":"IF(SUM(DB$27:DB$30)>0,$E35*$G35,0)","v":0},null,{"$f":"IF(SUM(DD$27:DD$30)>0,$E35*$G35,0)","v":0},null,{"$f":"IF(SUM(DF$27:DF$30)>0,$E35*$G35,0)","v":0},null,{"$f":"IF(SUM(DH$27:DH$30)>0,$E35*$G35,0)","v":0},null,{"$f":"IF(SUM(DJ$27:DJ$30)>0,$E35*$G35,0)","v":0},null,{"$f":"IF(SUM(DL$27:DL$30)>0,$E35*$G35,0)","v":0},null,{"$f":"IF(SUM(DN$27:DN$30)>0,$E35*$G35,0)","v":0},null,{"$f":"IF(SUM(DP$27:DP$30)>0,$E35*$G35,0)","v":0},null,{"$f":"IF(SUM(DR$27:DR$30)>0,$E35*$G35,0)","v":0},null,{"$f":"IF(SUM(DT$27:DT$30)>0,$E35*$G35,0)","v":0},null,{"$f":"IF(SUM(DV$27:DV$30)>0,$E35*$G35,0)","v":0},null,0]
[]
[null,null,"CATEGORIAS",null,null,null,"QUANTIDADE"]
[null,null,null,null,null,null,null,null,null,{"$f":"IF($C38=J$4,1,0)","v":0},null,{"$f":"IF($C38=L$4,1,0)","v":0},null,{"$f":"IF($C38=N$4,1,0)","v":0},null,{"$f":"IF($C38=P$4,1,0)","v":0},null,{"$f":"IF($C38=R$4,1,0)","v":0},null,{"$f":"IF($C38=T$4,1,0)","v":0},null,{"$f":"IF($C38=V$4,1,0)","v":0},null,{"$f":"IF($C38=X$4,1,0)","v":0},null,{"$f":"IF($C38=Z$4,1,0)","v":0},null,{"$f":"IF($C38=AB$4,1,0)","v":0},null,{"$f":"IF($C38=AD$4,1,0)","v":0},null,{"$f":"IF($C38=AF$4,1,0)","v":0},null,{"$f":"IF($C38=AH$4,1,0)","v":0},null,{"$f":"IF($C38=AJ$4,1,0)","v":0},null,{"$f":"IF($C38=AL$4,1,0)","v":0},null,{"$f":"IF($C38=AN$4,1,0)","v":0},null,{"$f":"IF($C38=AP$4,1,0)","v":0},null,{"$f":"IF($C38=AR$4,1,0)","v":0},null,{"$f":"IF($C38=AT$4,1,0)","v":0},null,{"$f":"IF($C38=AV$4,1,0)","v":0},null,{"$f":"IF($C38=AX$4,1,0)","v":0},null,{"$f":"IF($C38=AZ$4,1,0)","v":0},null,{"$f":"IF($C38=BB$4,1,0)","v":0},null,{"$f":"IF($C38=BD$4,1,0)","v":0},null,{"$f":"IF($C38=BF$4,1,0)","v":0},null,{"$f":"IF($C38=BH$4,1,0)","v":0},null,{"$f":"IF($C38=BJ$4,1,0)","v":0},null,{"$f":"IF($C38=BL$4,1,0)","v":0},null,{"$f":"IF($C38=BN$4,1,0)","v":0},null,{"$f":"IF($C38=BP$4,1,0)","v":0},null,{"$f":"IF($C38=BR$4,1,0)","v":0},null,{"$f":"IF($C38=BT$4,1,0)","v":0},null,{"$f":"IF($C38=BV$4,1,0)","v":0},null,{"$f":"IF($C38=BX$4,1,0)","v":0},null,{"$f":"IF($C38=BZ$4,1,0)","v":0},null,{"$f":"IF($C38=CB$4,1,0)","v":0},null,{"$f":"IF($C38=CD$4,1,0)","v":0},null,{"$f":"IF($C38=CF$4,1,0)","v":0},null,{"$f":"IF($C38=CH$4,1,0)","v":0},null,{"$f":"IF($C38=CJ$4,1,0)","v":0},null,{"$f":"IF($C38=CL$4,1,0)","v":0},null,{"$f":"IF($C38=CN$4,1,0)","v":0},null,{"$f":"IF($C38=CP$4,1,0)","v":0},null,{"$f":"IF($C38=CR$4,1,0)","v":0},null,{"$f":"IF($C38=CT$4,1,0)","v":0},null,{"$f":"IF($C38=CV$4,1,0)","v":0},null,{"$f":"IF($C38=CX$4,1,0)","v":0},null,{"$f":"IF($C38=CZ$4,1,0)","v":0},null,{"$f":"IF($C38=DB$4,1,0)","v":0},null,{"$f":"IF($C38=DD$4,1,0)","v":0},null,{"$f":"IF($C38=DF$4,1,0)","v":0},null,{"$f":"IF($C38=DH$4,1,0)","v":0},null,{"$f":"IF($C38=DJ$4,1,0)","v":0},null,{"$f":"IF($C38=DL$4,1,0)","v":0},null,{"$f":"IF($C38=DN$4,1,0)","v":0},null,{"$f":"IF($C38=DP$4,1,0)","v":0},null,{"$f":"IF($C38=DR$4,1,0)","v":0},null,{"$f":"IF($C38=DT$4,1,0)","v":0},null,{"$f":"IF($C38=DV$4,1,0)","v":0},null,{"$f":"IF($C38=DX$4,1,0)","v":0}]
[null,null,5,{"$f":"HLOOKUP($C39,'Dados Gerais'!$D$5:$BK$10,6)","v":"ALMOXARIFE"},null,null,{"$f":"HLOOKUP($C39,'Dados Gerais'!$D$5:$BK$14,10)","v":2},null,null,{"$f":"IF($C39=J$4,1,0)","v":0},null,0,null,0,null,0,null,1,null,0,null,0,null,0,null,0,null,0,null,0,null,0,null,0,null,0,null,0,null,0,null,0,null,0,null,0,null,0,null,0,null,0,null,0,null,0,null,0,null,0,null,0,null,0,null,0,null,0,null,0,null,0,null,0,null,0,null,0,null,0,null,0,null,0,null,0,null,0,null,0,null,0,null,0,null,0,null,0,null,0,null,0,null,0,null,0,null,0,null,0,null,0,null,0,null,0,null,0,null,0,null,0,null,0,null,0,null,0]
[null,null,null,null,null,null,null,null,null,{"$f":"IF($C40=J$4,1,0)","v":0},null,0,null,0,null,0,null,0,null,0,null,0,null,0,null,0,null,0,null,0,null,0,null,0,null,0,null,0,null,0,null,0,null,0,null,0,null,0,null,0,null,0,null,0,null,0,null,0,null,0,null,0,null,0,null,0,null,0,null,0,null,0,null,0,null,0,null,0,null,0,null,0,null,0,null,0,null,0,null,0,null,0,null,0,null,0,null,0,null,0,null,0,null,0,null,0,null,0,null,0,null,0,null,0,null,0,null,0,null,0,null,0,null,0,null,0,null,0]
[]
[null,null,"ITEM","DESCRIÇÃO","QUANT ANUAL POR POSTO","UNIDADE","VALOR"]
[null,null,null,null,null,null,null,null,null,null,{"$f":"IF(SUM(J$8:J$10)>0,$E43*$G43,0)","v":0},null,{"$f":"IF(SUM(L$8:L$10)>0,$E43*$G43,0)","v":0},null,{"$f":"IF(SUM(N$8:N$10)>0,$E43*$G43,0)","v":0},null,{"$f":"IF(SUM(P$8:P$10)>0,$E43*$G43,0)","v":0},null,{"$f":"IF(SUM(R$8:R$10)>0,$E43*$G43,0)","v":0},null,{"$f":"IF(SUM(T$8:T$10)>0,$E43*$G43,0)","v":0},null,{"$f":"IF(SUM(V$8:V$10)>0,$E43*$G43,0)","v":0},null,{"$f":"IF(SUM(X$8:X$10)>0,$E43*$G43,0)","v":0},null,{"$f":"IF(SUM(Z$8:Z$10)>0,$E43*$G43,0)","v":0},null,{"$f":"IF(SUM(AB$8:AB$10)>0,$E43*$G43,0)","v":0},null,{"$f":"IF(SUM(AD$8:AD$10)>0,$E43*$G43,0)","v":0},null,{"$f":"IF(SUM(AF$8:AF$10)>0,$E43*$G43,0)","v":0},null,{"$f":"IF(SUM(AH$8:AH$10)>0,$E43*$G43,0)","v":0},null,{"$f":"IF(SUM(AJ$8:AJ$10)>0,$E43*$G43,0)","v":0},null,{"$f":"IF(SUM(AL$8:AL$10)>0,$E43*$G43,0)","v":0},null,{"$f":"IF(SUM(AN$8:AN$10)>0,$E43*$G43,0)","v":0},null,{"$f":"IF(SUM(AP$8:AP$10)>0,$E43*$G43,0)","v":0},null,{"$f":"IF(SUM(AR$8:AR$10)>0,$E43*$G43,0)","v":0},null,{"$f":"IF(SUM(AT$8:AT$10)>0,$E43*$G43,0)","v":0},null,{"$f":"IF(SUM(AV$8:AV$10)>0,$E43*$G43,0)","v":0},null,{"$f":"IF(SUM(AX$8:AX$10)>0,$E43*$G43,0)","v":0},null,{"$f":"IF(SUM(AZ$8:AZ$10)>0,$E43*$G43,0)","v":0},null,{"$f":"IF(SUM(BB$8:BB$10)>0,$E43*$G43,0)","v":0},null,{"$f":"IF(SUM(BD$8:BD$10)>0,$E43*$G43,0)","v":0},null,{"$f":"IF(SUM(BF$8:BF$10)>0,$E43*$G43,0)","v":0},null,{"$f":"IF(SUM(BH$8:BH$10)>0,$E43*$G43,0)","v":0},null,{"$f":"IF(SUM(BJ$8:BJ$10)>0,$E43*$G43,0)","v":0},null,{"$f":"IF(SUM(BL$8:BL$10)>0,$E43*$G43,0)","v":0},null,{"$f":"IF(SUM(BN$8:BN$10)>0,$E43*$G43,0)","v":0},null,{"$f":"IF(SUM(BP$8:BP$10)>0,$E43*$G43,0)","v":0},null,{"$f":"IF(SUM(BR$8:BR$10)>0,$E43*$G43,0)","v":0},null,{"$f":"IF(SUM(BT$8:BT$10)>0,$E43*$G43,0)","v":0},null,{"$f":"IF(SUM(BV$8:BV$10)>0,$E43*$G43,0)","v":0},null,{"$f":"IF(SUM(BX$8:BX$10)>0,$E43*$G43,0)","v":0},null,{"$f":"IF(SUM(BZ$8:BZ$10)>0,$E43*$G43,0)","v":0},null,{"$f":"IF(SUM(CB$8:CB$10)>0,$E43*$G43,0)","v":0},null,{"$f":"IF(SUM(CD$8:CD$10)>0,$E43*$G43,0)","v":0},null,{"$f":"IF(SUM(CF$8:CF$10)>0,$E43*$G43,0)","v":0},null,{"$f":"IF(SUM(CH$8:CH$10)>0,$E43*$G43,0)","v":0},null,{"$f":"IF(SUM(CJ$8:CJ$10)>0,$E43*$G43,0)","v":0},null,{"$f":"IF(SUM(CL$8:CL$10)>0,$E43*$G43,0)","v":0},null,{"$f":"IF(SUM(CN$8:CN$10)>0,$E43*$G43,0)","v":0},null,{"$f":"IF(SUM(CP$8:CP$10)>0,$E43*$G43,0)","v":0},null,{"$f":"IF(SUM(CR$8:CR$10)>0,$E43*$G43,0)","v":0},null,{"$f":"IF(SUM(CT$8:CT$10)>0,$E43*$G43,0)","v":0},null,{"$f":"IF(SUM(CV$8:CV$10)>0,$E43*$G43,0)","v":0},null,{"$f":"IF(SUM(CX$8:CX$10)>0,$E43*$G43,0)","v":0},null,{"$f":"IF(SUM(CZ$8:CZ$10)>0,$E43*$G43,0)","v":0},null,{"$f":"IF(SUM(DB$8:DB$10)>0,$E43*$G43,0)","v":0},null,{"$f":"IF(SUM(DD$8:DD$10)>0,$E43*$G43,0)","v":0},null,{"$f":"IF(SUM(DF$8:DF$10)>0,$E43*$G43,0)","v":0},null,{"$f":"IF(SUM(DH$8:DH$10)>0,$E43*$G43,0)","v":0},null,{"$f":"IF(SUM(DJ$8:DJ$10)>0,$E43*$G43,0)","v":0},null,{"$f":"IF(SUM(DL$8:DL$10)>0,$E43*$G43,0)","v":0},null,{"$f":"IF(SUM(DN$8:DN$10)>0,$E43*$G43,0)","v":0},null,{"$f":"IF(SUM(DP$8:DP$10)>0,$E43*$G43,0)","v":0},null,{"$f":"IF(SUM(DR$8:DR$10)>0,$E43*$G43,0)","v":0},null,{"$f":"IF(SUM(DT$8:DT$10)>0,$E43*$G43,0)","v":0},null,{"$f":"IF(SUM(DV$8:DV$10)>0,$E43*$G43,0)","v":0},null,{"$f":"IF(SUM(DX$8:DX$10)>0,$E43*$G43,0)","v":0}]
[null,null,1,"Respirador purificador de ar tipo, peça semifacial filtrante para partículas (PFF2), com formato dobrável, solda ultra-sônica em todo o seu perímetro. Fita elástica branca fixada nas laterais externas do respirador, perfazendo uma alça na para fixação na parte superior da cabeça e a outra na parte inferior, para fixação na altura da nuca do usuário. A parte superior externa da peça possui tira de material metálico moldável, utilizada para ajuste no septo nasal. Com válvula de exalação. DEVERÁ APRESENTAR O SELO DE APROVAÇÃO DO INMETRO. Ref. 3M ",4,"UND",{"$f":"G34","v":1.62},null,null,null,{"$f":"IF(SUM(J$38:J$40)>0,$E44*$G44,0)","v":0},null,{"$f":"IF(SUM(L$38:L$40)>0,$E44*$G44,0)","v":0},null,{"$f":"IF(SUM(N$38:N$40)>0,$E44*$G44,0)","v":0},null,{"$f":"IF(SUM(P$38:P$40)>0,$E44*$G44,0)","v":0},null,{"$f":"IF(SUM(R$38:R$40)>0,$E44*$G44,0)","v":6.48},null,{"$f":"IF(SUM(T$38:T$40)>0,$E44*$G44,0)","v":0},null,{"$f":"IF(SUM(V$38:V$40)>0,$E44*$G44,0)","v":0},null,{"$f":"IF(SUM(X$38:X$40)>0,$E44*$G44,0)","v":0},null,{"$f":"IF(SUM(Z$38:Z$40)>0,$E44*$G44,0)","v":0},null,{"$f":"IF(SUM(AB$38:AB$40)>0,$E44*$G44,0)","v":0},null,{"$f":"IF(SUM(AD$38:AD$40)>0,$E44*$G44,0)","v":0},null,{"$f":"IF(SUM(AF$38:AF$40)>0,$E44*$G44,0)","v":0},null,{"$f":"IF(SUM(AH$38:AH$40)>0,$E44*$G44,0)","v":0},null,{"$f":"IF(SUM(AJ$38:AJ$40)>0,$E44*$G44,0)","v":0},null,{"$f":"IF(SUM(AL$38:AL$40)>0,$E44*$G44,0)","v":0},null,{"$f":"IF(SUM(AN$38:AN$40)>0,$E44*$G44,0)","v":0},null,{"$f":"IF(SUM(AP$38:AP$40)>0,$E44*$G44,0)","v":0},null,{"$f":"IF(SUM(AR$38:AR$40)>0,$E44*$G44,0)","v":0},null,{"$f":"IF(SUM(AT$38:AT$40)>0,$E44*$G44,0)","v":0},null,{"$f":"IF(SUM(AV$38:AV$40)>0,$E44*$G44,0)","v":0},null,{"$f":"IF(SUM(AX$38:AX$40)>0,$E44*$G44,0)","v":0},null,{"$f":"IF(SUM(AZ$38:AZ$40)>0,$E44*$G44,0)","v":0},null,{"$f":"IF(SUM(BB$38:BB$40)>0,$E44*$G44,0)","v":0},null,{"$f":"IF(SUM(BD$38:BD$40)>0,$E44*$G44,0)","v":0},null,{"$f":"IF(SUM(BF$38:BF$40)>0,$E44*$G44,0)","v":0},null,{"$f":"IF(SUM(BH$38:BH$40)>0,$E44*$G44,0)","v":0},null,{"$f":"IF(SUM(BJ$38:BJ$40)>0,$E44*$G44,0)","v":0},null,{"$f":"IF(SUM(BL$38:BL$40)>0,$E44*$G44,0)","v":0},null,{"$f":"IF(SUM(BN$38:BN$40)>0,$E44*$G44,0)","v":0},null,{"$f":"IF(SUM(BP$38:BP$40)>0,$E44*$G44,0)","v":0},null,{"$f":"IF(SUM(BR$38:BR$40)>0,$E44*$G44,0)","v":0},null,{"$f":"IF(SUM(BT$38:BT$40)>0,$E44*$G44,0)","v":0},null,{"$f":"IF(SUM(BV$38:BV$40)>0,$E44*$G44,0)","v":0},null,{"$f":"IF(SUM(BX$38:BX$40)>0,$E44*$G44,0)","v":0},null,{"$f":"IF(SUM(BZ$38:BZ$40)>0,$E44*$G44,0)","v":0},null,{"$f":"IF(SUM(CB$38:CB$40)>0,$E44*$G44,0)","v":0},null,{"$f":"IF(SUM(CD$38:CD$40)>0,$E44*$G44,0)","v":0},null,{"$f":"IF(SUM(CF$38:CF$40)>0,$E44*$G44,0)","v":0},null,{"$f":"IF(SUM(CH$38:CH$40)>0,$E44*$G44,0)","v":0},null,{"$f":"IF(SUM(CJ$38:CJ$40)>0,$E44*$G44,0)","v":0},null,{"$f":"IF(SUM(CL$38:CL$40)>0,$E44*$G44,0)","v":0},null,{"$f":"IF(SUM(CN$38:CN$40)>0,$E44*$G44,0)","v":0},null,{"$f":"IF(SUM(CP$38:CP$40)>0,$E44*$G44,0)","v":0},null,{"$f":"IF(SUM(CR$38:CR$40)>0,$E44*$G44,0)","v":0},null,{"$f":"IF(SUM(CT$38:CT$40)>0,$E44*$G44,0)","v":0},null,{"$f":"IF(SUM(CV$38:CV$40)>0,$E44*$G44,0)","v":0},null,{"$f":"IF(SUM(CX$38:CX$40)>0,$E44*$G44,0)","v":0},null,{"$f":"IF(SUM(CZ$38:CZ$40)>0,$E44*$G44,0)","v":0},null,{"$f":"IF(SUM(DB$38:DB$40)>0,$E44*$G44,0)","v":0},null,{"$f":"IF(SUM(DD$38:DD$40)>0,$E44*$G44,0)","v":0},null,{"$f":"IF(SUM(DF$38:DF$40)>0,$E44*$G44,0)","v":0},null,{"$f":"IF(SUM(DH$38:DH$40)>0,$E44*$G44,0)","v":0},null,{"$f":"IF(SUM(DJ$38:DJ$40)>0,$E44*$G44,0)","v":0},null,{"$f":"IF(SUM(DL$38:DL$40)>0,$E44*$G44,0)","v":0},null,{"$f":"IF(SUM(DN$38:DN$40)>0,$E44*$G44,0)","v":0},null,{"$f":"IF(SUM(DP$38:DP$40)>0,$E44*$G44,0)","v":0},null,{"$f":"IF(SUM(DR$38:DR$40)>0,$E44*$G44,0)","v":0},null,{"$f":"IF(SUM(DT$38:DT$40)>0,$E44*$G44,0)","v":0},null,{"$f":"IF(SUM(DV$38:DV$40)>0,$E44*$G44,0)","v":0},null,{"$f":"IF(SUM(DX$38:DX$40)>0,$E44*$G44,0)","v":0}]
[null,null,2,"Protetor auditivo, do tipo inserção pré-moldado, de silicone, lavável, com cordão e tamanho único,  com proteção mínima de 18 Db(A) de atenuação pelo método NRRsf. Ref: 3M",1,"UND",{"$f":"G35","v":2.4900000000000002},null,null,null,{"$f":"IF(SUM(J$38:J$40)>0,$E45*$G45,0)","v":0},null,0,null,0,null,0,null,2.4900000000000002,null,0,null,0,null,0,null,0,null,0,null,0,null,0,null,0,null,0,null,0,null,0,null,0,null,0,null,0,null,0,null,0,null,0,null,0,null,0,null,0,null,0,null,0,null,0,null,0,null,0,null,0,null,0,null,0,null,0,null,0,null,0,null,0,null,0,null,0,null,0,null,0,null,0,null,0,null,0,null,0,null,0,null,0,null,0,null,0,null,0,null,0,null,0,null,0,null,0,null,0,null,0,null,0,null,0,null,0,null,{"$f":"IF(SUM(DX$38:DX$40)>0,$E45*$G45,0)","v":0}]
[null,null,3,"Calçado de segurança tipo sapato com resistência a objetos pontiagudos, fechamento em elástico, couro preto, forração em tecido, bico de composite, palmilha de montagem têxtil resistente à perfuração, solado de PU (poliuretano), bidensidade sem cadarço. Ref. MARLUVAS.",3,"PAR",76.900000000000006,null,null,null,{"$f":"IF(SUM(J$38:J$40)>0,$E46*$G46,0)","v":0},null,0,null,0,null,0,null,230.70000000000002,null,0,null,{"$f":"IF(SUM(V$38:V$40)>0,$E46*$G46,0)","v":0},null,{"$f":"IF(SUM(X$38:X$40)>0,$E46*$G46,0)","v":0},null,{"$f":"IF(SUM(Z$38:Z$40)>0,$E46*$G46,0)","v":0},null,{"$f":"IF(SUM(AB$38:AB$40)>0,$E46*$G46,0)","v":0},null,{"$f":"IF(SUM(AD$38:AD$40)>0,$E46*$G46,0)","v":0},null,{"$f":"IF(SUM(AF$38:AF$40)>0,$E46*$G46,0)","v":0},null,{"$f":"IF(SUM(AH$38:AH$40)>0,$E46*$G46,0)","v":0},null,{"$f":"IF(SUM(AJ$38:AJ$40)>0,$E46*$G46,0)","v":0},null,{"$f":"IF(SUM(AL$38:AL$40)>0,$E46*$G46,0)","v":0},null,{"$f":"IF(SUM(AN$38:AN$40)>0,$E46*$G46,0)","v":0},null,{"$f":"IF(SUM(AP$38:AP$40)>0,$E46*$G46,0)","v":0},null,{"$f":"IF(SUM(AR$38:AR$40)>0,$E46*$G46,0)","v":0},null,{"$f":"IF(SUM(AT$38:AT$40)>0,$E46*$G46,0)","v":0},null,{"$f":"IF(SUM(AV$38:AV$40)>0,$E46*$G46,0)","v":0},null,{"$f":"IF(SUM(AX$38:AX$40)>0,$E46*$G46,0)","v":0},null,{"$f":"IF(SUM(AZ$38:AZ$40)>0,$E46*$G46,0)","v":0},null,{"$f":"IF(SUM(BB$38:BB$40)>0,$E46*$G46,0)","v":0},null,{"$f":"IF(SUM(BD$38:BD$40)>0,$E46*$G46,0)","v":0},null,{"$f":"IF(SUM(BF$38:BF$40)>0,$E46*$G46,0)","v":0},null,{"$f":"IF(SUM(BH$38:BH$40)>0,$E46*$G46,0)","v":0},null,{"$f":"IF(SUM(BJ$38:BJ$40)>0,$E46*$G46,0)","v":0},null,{"$f":"IF(SUM(BL$38:BL$40)>0,$E46*$G46,0)","v":0},null,{"$f":"IF(SUM(BN$38:BN$40)>0,$E46*$G46,0)","v":0},null,{"$f":"IF(SUM(BP$38:BP$40)>0,$E46*$G46,0)","v":0},null,{"$f":"IF(SUM(BR$38:BR$40)>0,$E46*$G46,0)","v":0},null,{"$f":"IF(SUM(BT$38:BT$40)>0,$E46*$G46,0)","v":0},null,{"$f":"IF(SUM(BV$38:BV$40)>0,$E46*$G46,0)","v":0},null,{"$f":"IF(SUM(BX$38:BX$40)>0,$E46*$G46,0)","v":0},null,{"$f":"IF(SUM(BZ$38:BZ$40)>0,$E46*$G46,0)","v":0},null,{"$f":"IF(SUM(CB$38:CB$40)>0,$E46*$G46,0)","v":0},null,{"$f":"IF(SUM(CD$38:CD$40)>0,$E46*$G46,0)","v":0},null,{"$f":"IF(SUM(CF$38:CF$40)>0,$E46*$G46,0)","v":0},null,{"$f":"IF(SUM(CH$38:CH$40)>0,$E46*$G46,0)","v":0},null,{"$f":"IF(SUM(CJ$38:CJ$40)>0,$E46*$G46,0)","v":0},null,{"$f":"IF(SUM(CL$38:CL$40)>0,$E46*$G46,0)","v":0},null,{"$f":"IF(SUM(CN$38:CN$40)>0,$E46*$G46,0)","v":0},null,{"$f":"IF(SUM(CP$38:CP$40)>0,$E46*$G46,0)","v":0},null,{"$f":"IF(SUM(CR$38:CR$40)>0,$E46*$G46,0)","v":0},null,{"$f":"IF(SUM(CT$38:CT$40)>0,$E46*$G46,0)","v":0},null,{"$f":"IF(SUM(CV$38:CV$40)>0,$E46*$G46,0)","v":0},null,{"$f":"IF(SUM(CX$38:CX$40)>0,$E46*$G46,0)","v":0},null,{"$f":"IF(SUM(CZ$38:CZ$40)>0,$E46*$G46,0)","v":0},null,{"$f":"IF(SUM(DB$38:DB$40)>0,$E46*$G46,0)","v":0},null,{"$f":"IF(SUM(DD$38:DD$40)>0,$E46*$G46,0)","v":0},null,{"$f":"IF(SUM(DF$38:DF$40)>0,$E46*$G46,0)","v":0},null,{"$f":"IF(SUM(DH$38:DH$40)>0,$E46*$G46,0)","v":0},null,{"$f":"IF(SUM(DJ$38:DJ$40)>0,$E46*$G46,0)","v":0},null,{"$f":"IF(SUM(DL$38:DL$40)>0,$E46*$G46,0)","v":0},null,{"$f":"IF(SUM(DN$38:DN$40)>0,$E46*$G46,0)","v":0},null,{"$f":"IF(SUM(DP$38:DP$40)>0,$E46*$G46,0)","v":0},null,{"$f":"IF(SUM(DR$38:DR$40)>0,$E46*$G46,0)","v":0},null,{"$f":"IF(SUM(DT$38:DT$40)>0,$E46*$G46,0)","v":0},null,{"$f":"IF(SUM(DV$38:DV$40)>0,$E46*$G46,0)","v":0},null,{"$f":"IF(SUM(DX$38:DX$40)>0,$E46*$G46,0)","v":0}]
[null,null,4,"Óculos de segurança constituídos de armação e visor confeccionados em uma única peça de policarbonato INCOLOR, anti-risco, apoio nasal de plástico maleável. Hastes emborrachadas. Ref.: 3M Virtua V4",1,"UND",36.67,null,null,null,{"$f":"IF(SUM(J$38:J$40)>0,$E47*$G47,0)","v":0},null,{"$f":"IF(SUM(L$38:L$40)>0,$E47*$G47,0)","v":0},null,{"$f":"IF(SUM(N$38:N$40)>0,$E47*$G47,0)","v":0},null,{"$f":"IF(SUM(P$38:P$40)>0,$E47*$G47,0)","v":0},null,{"$f":"IF(SUM(R$38:R$40)>0,$E47*$G47,0)","v":36.67},null,{"$f":"IF(SUM(T$38:T$40)>0,$E47*$G47,0)","v":0},null,{"$f":"IF(SUM(V$38:V$40)>0,$E47*$G47,0)","v":0},null,{"$f":"IF(SUM(X$38:X$40)>0,$E47*$G47,0)","v":0},null,{"$f":"IF(SUM(Z$38:Z$40)>0,$E47*$G47,0)","v":0},null,{"$f":"IF(SUM(AB$38:AB$40)>0,$E47*$G47,0)","v":0},null,{"$f":"IF(SUM(AD$38:AD$40)>0,$E47*$G47,0)","v":0},null,{"$f":"IF(SUM(AF$38:AF$40)>0,$E47*$G47,0)","v":0},null,{"$f":"IF(SUM(AH$38:AH$40)>0,$E47*$G47,0)","v":0},null,{"$f":"IF(SUM(AJ$38:AJ$40)>0,$E47*$G47,0)","v":0},null,{"$f":"IF(SUM(AL$38:AL$40)>0,$E47*$G47,0)","v":0},null,{"$f":"IF(SUM(AN$38:AN$40)>0,$E47*$G47,0)","v":0},null,{"$f":"IF(SUM(AP$38:AP$40)>0,$E47*$G47,0)","v":0},null,{"$f":"IF(SUM(AR$38:AR$40)>0,$E47*$G47,0)","v":0},null,{"$f":"IF(SUM(AT$38:AT$40)>0,$E47*$G47,0)","v":0},null,{"$f":"IF(SUM(AV$38:AV$40)>0,$E47*$G47,0)","v":0},null,{"$f":"IF(SUM(AX$38:AX$40)>0,$E47*$G47,0)","v":0},null,{"$f":"IF(SUM(AZ$38:AZ$40)>0,$E47*$G47,0)","v":0},null,{"$f":"IF(SUM(BB$38:BB$40)>0,$E47*$G47,0)","v":0},null,{"$f":"IF(SUM(BD$38:BD$40)>0,$E47*$G47,0)","v":0},null,{"$f":"IF(SUM(BF$38:BF$40)>0,$E47*$G47,0)","v":0},null,{"$f":"IF(SUM(BH$38:BH$40)>0,$E47*$G47,0)","v":0},null,{"$f":"IF(SUM(BJ$38:BJ$40)>0,$E47*$G47,0)","v":0},null,{"$f":"IF(SUM(BL$38:BL$40)>0,$E47*$G47,0)","v":0},null,{"$f":"IF(SUM(BN$38:BN$40)>0,$E47*$G47,0)","v":0},null,{"$f":"IF(SUM(BP$38:BP$40)>0,$E47*$G47,0)","v":0},null,{"$f":"IF(SUM(BR$38:BR$40)>0,$E47*$G47,0)","v":0},null,{"$f":"IF(SUM(BT$38:BT$40)>0,$E47*$G47,0)","v":0},null,{"$f":"IF(SUM(BV$38:BV$40)>0,$E47*$G47,0)","v":0},null,{"$f":"IF(SUM(BX$38:BX$40)>0,$E47*$G47,0)","v":0},null,{"$f":"IF(SUM(BZ$38:BZ$40)>0,$E47*$G47,0)","v":0},null,{"$f":"IF(SUM(CB$38:CB$40)>0,$E47*$G47,0)","v":0},null,{"$f":"IF(SUM(CD$38:CD$40)>0,$E47*$G47,0)","v":0},null,{"$f":"IF(SUM(CF$38:CF$40)>0,$E47*$G47,0)","v":0},null,{"$f":"IF(SUM(CH$38:CH$40)>0,$E47*$G47,0)","v":0},null,{"$f":"IF(SUM(CJ$38:CJ$40)>0,$E47*$G47,0)","v":0},null,{"$f":"IF(SUM(CL$38:CL$40)>0,$E47*$G47,0)","v":0},null,{"$f":"IF(SUM(CN$38:CN$40)>0,$E47*$G47,0)","v":0},null,{"$f":"IF(SUM(CP$38:CP$40)>0,$E47*$G47,0)","v":0},null,{"$f":"IF(SUM(CR$38:CR$40)>0,$E47*$G47,0)","v":0},null,{"$f":"IF(SUM(CT$38:CT$40)>0,$E47*$G47,0)","v":0},null,{"$f":"IF(SUM(CV$38:CV$40)>0,$E47*$G47,0)","v":0},null,{"$f":"IF(SUM(CX$38:CX$40)>0,$E47*$G47,0)","v":0},null,{"$f":"IF(SUM(CZ$38:CZ$40)>0,$E47*$G47,0)","v":0},null,{"$f":"IF(SUM(DB$38:DB$40)>0,$E47*$G47,0)","v":0},null,{"$f":"IF(SUM(DD$38:DD$40)>0,$E47*$G47,0)","v":0},null,{"$f":"IF(SUM(DF$38:DF$40)>0,$E47*$G47,0)","v":0},null,{"$f":"IF(SUM(DH$38:DH$40)>0,$E47*$G47,0)","v":0},null,{"$f":"IF(SUM(DJ$38:DJ$40)>0,$E47*$G47,0)","v":0},null,{"$f":"IF(SUM(DL$38:DL$40)>0,$E47*$G47,0)","v":0},null,{"$f":"IF(SUM(DN$38:DN$40)>0,$E47*$G47,0)","v":0},null,{"$f":"IF(SUM(DP$38:DP$40)>0,$E47*$G47,0)","v":0},null,{"$f":"IF(SUM(DR$38:DR$40)>0,$E47*$G47,0)","v":0},null,{"$f":"IF(SUM(DT$38:DT$40)>0,$E47*$G47,0)","v":0},null,{"$f":"IF(SUM(DV$38:DV$40)>0,$E47*$G47,0)","v":0},null,0]
[]
[null,null,"CATEGORIAS",null,null,null,"QUANTIDADE"]
[null,null,null,null,null,null,null,null,null,{"$f":"IF($C50=J$4,1,0)","v":0},null,{"$f":"IF($C50=L$4,1,0)","v":0},null,{"$f":"IF($C50=N$4,1,0)","v":0},null,{"$f":"IF($C50=P$4,1,0)","v":0},null,{"$f":"IF($C50=R$4,1,0)","v":0},null,{"$f":"IF($C50=T$4,1,0)","v":0},null,{"$f":"IF($C50=V$4,1,0)","v":0},null,{"$f":"IF($C50=X$4,1,0)","v":0},null,{"$f":"IF($C50=Z$4,1,0)","v":0},null,{"$f":"IF($C50=AB$4,1,0)","v":0},null,{"$f":"IF($C50=AD$4,1,0)","v":0},null,{"$f":"IF($C50=AF$4,1,0)","v":0},null,{"$f":"IF($C50=AH$4,1,0)","v":0},null,{"$f":"IF($C50=AJ$4,1,0)","v":0},null,{"$f":"IF($C50=AL$4,1,0)","v":0},null,{"$f":"IF($C50=AN$4,1,0)","v":0},null,{"$f":"IF($C50=AP$4,1,0)","v":0},null,{"$f":"IF($C50=AR$4,1,0)","v":0},null,{"$f":"IF($C50=AT$4,1,0)","v":0},null,{"$f":"IF($C50=AV$4,1,0)","v":0},null,{"$f":"IF($C50=AX$4,1,0)","v":0},null,{"$f":"IF($C50=AZ$4,1,0)","v":0},null,{"$f":"IF($C50=BB$4,1,0)","v":0},null,{"$f":"IF($C50=BD$4,1,0)","v":0},null,{"$f":"IF($C50=BF$4,1,0)","v":0},null,{"$f":"IF($C50=BH$4,1,0)","v":0},null,{"$f":"IF($C50=BJ$4,1,0)","v":0},null,{"$f":"IF($C50=BL$4,1,0)","v":0},null,{"$f":"IF($C50=BN$4,1,0)","v":0},null,{"$f":"IF($C50=BP$4,1,0)","v":0},null,{"$f":"IF($C50=BR$4,1,0)","v":0},null,{"$f":"IF($C50=BT$4,1,0)","v":0},null,{"$f":"IF($C50=BV$4,1,0)","v":0},null,{"$f":"IF($C50=BX$4,1,0)","v":0},null,{"$f":"IF($C50=BZ$4,1,0)","v":0},null,{"$f":"IF($C50=CB$4,1,0)","v":0},null,{"$f":"IF($C50=CD$4,1,0)","v":0},null,{"$f":"IF($C50=CF$4,1,0)","v":0},null,{"$f":"IF($C50=CH$4,1,0)","v":0},null,{"$f":"IF($C50=CJ$4,1,0)","v":0},null,{"$f":"IF($C50=CL$4,1,0)","v":0},null,{"$f":"IF($C50=CN$4,1,0)","v":0},null,{"$f":"IF($C50=CP$4,1,0)","v":0},null,{"$f":"IF($C50=CR$4,1,0)","v":0},null,{"$f":"IF($C50=CT$4,1,0)","v":0},null,{"$f":"IF($C50=CV$4,1,0)","v":0},null,{"$f":"IF($C50=CX$4,1,0)","v":0},null,{"$f":"IF($C50=CZ$4,1,0)","v":0},null,{"$f":"IF($C50=DB$4,1,0)","v":0},null,{"$f":"IF($C50=DD$4,1,0)","v":0},null,{"$f":"IF($C50=DF$4,1,0)","v":0},null,{"$f":"IF($C50=DH$4,1,0)","v":0},null,{"$f":"IF($C50=DJ$4,1,0)","v":0},null,{"$f":"IF($C50=DL$4,1,0)","v":0},null,{"$f":"IF($C50=DN$4,1,0)","v":0},null,{"$f":"IF($C50=DP$4,1,0)","v":0},null,{"$f":"IF($C50=DR$4,1,0)","v":0},null,{"$f":"IF($C50=DT$4,1,0)","v":0},null,{"$f":"IF($C50=DV$4,1,0)","v":0},null,{"$f":"IF($C50=DX$4,1,0)","v":0}]
[null,null,6,{"$f":"HLOOKUP($C51,'Dados Gerais'!$D$5:$BK$10,6)","v":"SERVENTE"},null,null,{"$f":"HLOOKUP($C51,'Dados Gerais'!$D$5:$BK$14,10)","v":189},null,null,{"$f":"IF($C51=J$4,1,0)","v":0},null,0,null,0,null,0,null,0,null,1,null,0,null,0,null,0,null,0,null,0,null,0,null,0,null,0,null,0,null,0,null,0,null,0,null,0,null,0,null,0,null,0,null,0,null,0,null,0,null,0,null,0,null,0,null,0,null,0,null,0,null,0,null,0,null,0,null,0,null,0,null,0,null,0,null,0,null,0,null,0,null,0,null,0,null,0,null,0,null,0,null,0,null,0,null,0,null,0,null,0,null,0,null,0,null,0,null,0,null,0,null,0,null,0,null,0,null,0]
[null,null,null,null,null,null,null,null,null,{"$f":"IF($C52=J$4,1,0)","v":0},null,0,null,0,null,0,null,0,null,0,null,0,null,0,null,0,null,0,null,0,null,0,null,0,null,0,null,0,null,0,null,0,null,0,null,0,null,0,null,0,null,0,null,0,null,0,null,0,null,0,null,0,null,0,null,0,null,0,null,0,null,0,null,0,null,0,null,0,null,0,null,0,null,0,null,0,null,0,null,0,null,0,null,0,null,0,null,0,null,0,null,0,null,0,null,0,null,0,null,0,null,0,null,0,null,0,null,0,null,0,null,0,null,0,null,0,null,0]
[null,null,null,null,null,null,null,null,null,null,null,{"$f":"SUM(L8:L51)","v":1}]
[null,null,"ITEM","DESCRIÇÃO","QUANT ANUAL POR POSTO","UNIDADE","VALOR"]
[null,null,null,null,null,null,null,null,null,null,{"$f":"IF(SUM(J$8:J$10)>0,$E55*$G55,0)","v":0},null,{"$f":"IF(SUM(L$8:L$10)>0,$E55*$G55,0)","v":0},null,{"$f":"IF(SUM(N$8:N$10)>0,$E55*$G55,0)","v":0},null,{"$f":"IF(SUM(P$8:P$10)>0,$E55*$G55,0)","v":0},null,{"$f":"IF(SUM(R$8:R$10)>0,$E55*$G55,0)","v":0},null,{"$f":"IF(SUM(T$8:T$10)>0,$E55*$G55,0)","v":0},null,{"$f":"IF(SUM(V$8:V$10)>0,$E55*$G55,0)","v":0},null,{"$f":"IF(SUM(X$8:X$10)>0,$E55*$G55,0)","v":0},null,{"$f":"IF(SUM(Z$8:Z$10)>0,$E55*$G55,0)","v":0},null,{"$f":"IF(SUM(AB$8:AB$10)>0,$E55*$G55,0)","v":0},null,{"$f":"IF(SUM(AD$8:AD$10)>0,$E55*$G55,0)","v":0},null,{"$f":"IF(SUM(AF$8:AF$10)>0,$E55*$G55,0)","v":0},null,{"$f":"IF(SUM(AH$8:AH$10)>0,$E55*$G55,0)","v":0},null,{"$f":"IF(SUM(AJ$8:AJ$10)>0,$E55*$G55,0)","v":0},null,{"$f":"IF(SUM(AL$8:AL$10)>0,$E55*$G55,0)","v":0},null,{"$f":"IF(SUM(AN$8:AN$10)>0,$E55*$G55,0)","v":0},null,{"$f":"IF(SUM(AP$8:AP$10)>0,$E55*$G55,0)","v":0},null,{"$f":"IF(SUM(AR$8:AR$10)>0,$E55*$G55,0)","v":0},null,{"$f":"IF(SUM(AT$8:AT$10)>0,$E55*$G55,0)","v":0},null,{"$f":"IF(SUM(AV$8:AV$10)>0,$E55*$G55,0)","v":0},null,{"$f":"IF(SUM(AX$8:AX$10)>0,$E55*$G55,0)","v":0},null,{"$f":"IF(SUM(AZ$8:AZ$10)>0,$E55*$G55,0)","v":0},null,{"$f":"IF(SUM(BB$8:BB$10)>0,$E55*$G55,0)","v":0},null,{"$f":"IF(SUM(BD$8:BD$10)>0,$E55*$G55,0)","v":0},null,{"$f":"IF(SUM(BF$8:BF$10)>0,$E55*$G55,0)","v":0},null,{"$f":"IF(SUM(BH$8:BH$10)>0,$E55*$G55,0)","v":0},null,{"$f":"IF(SUM(BJ$8:BJ$10)>0,$E55*$G55,0)","v":0},null,{"$f":"IF(SUM(BL$8:BL$10)>0,$E55*$G55,0)","v":0},null,{"$f":"IF(SUM(BN$8:BN$10)>0,$E55*$G55,0)","v":0},null,{"$f":"IF(SUM(BP$8:BP$10)>0,$E55*$G55,0)","v":0},null,{"$f":"IF(SUM(BR$8:BR$10)>0,$E55*$G55,0)","v":0},null,{"$f":"IF(SUM(BT$8:BT$10)>0,$E55*$G55,0)","v":0},null,{"$f":"IF(SUM(BV$8:BV$10)>0,$E55*$G55,0)","v":0},null,{"$f":"IF(SUM(BX$8:BX$10)>0,$E55*$G55,0)","v":0},null,{"$f":"IF(SUM(BZ$8:BZ$10)>0,$E55*$G55,0)","v":0},null,{"$f":"IF(SUM(CB$8:CB$10)>0,$E55*$G55,0)","v":0},null,{"$f":"IF(SUM(CD$8:CD$10)>0,$E55*$G55,0)","v":0},null,{"$f":"IF(SUM(CF$8:CF$10)>0,$E55*$G55,0)","v":0},null,{"$f":"IF(SUM(CH$8:CH$10)>0,$E55*$G55,0)","v":0},null,{"$f":"IF(SUM(CJ$8:CJ$10)>0,$E55*$G55,0)","v":0},null,{"$f":"IF(SUM(CL$8:CL$10)>0,$E55*$G55,0)","v":0},null,{"$f":"IF(SUM(CN$8:CN$10)>0,$E55*$G55,0)","v":0},null,{"$f":"IF(SUM(CP$8:CP$10)>0,$E55*$G55,0)","v":0},null,{"$f":"IF(SUM(CR$8:CR$10)>0,$E55*$G55,0)","v":0},null,{"$f":"IF(SUM(CT$8:CT$10)>0,$E55*$G55,0)","v":0},null,{"$f":"IF(SUM(CV$8:CV$10)>0,$E55*$G55,0)","v":0},null,{"$f":"IF(SUM(CX$8:CX$10)>0,$E55*$G55,0)","v":0},null,{"$f":"IF(SUM(CZ$8:CZ$10)>0,$E55*$G55,0)","v":0},null,{"$f":"IF(SUM(DB$8:DB$10)>0,$E55*$G55,0)","v":0},null,{"$f":"IF(SUM(DD$8:DD$10)>0,$E55*$G55,0)","v":0},null,{"$f":"IF(SUM(DF$8:DF$10)>0,$E55*$G55,0)","v":0},null,{"$f":"IF(SUM(DH$8:DH$10)>0,$E55*$G55,0)","v":0},null,{"$f":"IF(SUM(DJ$8:DJ$10)>0,$E55*$G55,0)","v":0},null,{"$f":"IF(SUM(DL$8:DL$10)>0,$E55*$G55,0)","v":0},null,{"$f":"IF(SUM(DN$8:DN$10)>0,$E55*$G55,0)","v":0},null,{"$f":"IF(SUM(DP$8:DP$10)>0,$E55*$G55,0)","v":0},null,{"$f":"IF(SUM(DR$8:DR$10)>0,$E55*$G55,0)","v":0},null,{"$f":"IF(SUM(DT$8:DT$10)>0,$E55*$G55,0)","v":0},null,{"$f":"IF(SUM(DV$8:DV$10)>0,$E55*$G55,0)","v":0},null,{"$f":"IF(SUM(DX$8:DX$10)>0,$E55*$G55,0)","v":0}]
[null,null,1,"Respirador purificador de ar tipo, peça semifacial filtrante para partículas (PFF2), com formato dobrável, solda ultra-sônica em todo o seu perímetro. Fita elástica branca fixada nas laterais externas do respirador, perfazendo uma alça na para fixação na parte superior da cabeça e a outra na parte inferior, para fixação na altura da nuca do usuário. A parte superior externa da peça possui tira de material metálico moldável, utilizada para ajuste no septo nasal. Com válvula de exalação. DEVERÁ APRESENTAR O SELO DE APROVAÇÃO DO INMETRO. Ref. 3M ",4,"UND",{"$f":"G44","v":1.62},null,null,null,{"$f":"IF(SUM(J$50:J$52)>0,$E56*$G56,0)","v":0},null,{"$f":"IF(SUM(L$50:L$52)>0,$E56*$G56,0)","v":0},null,{"$f":"IF(SUM(N$50:N$52)>0,$E56*$G56,0)","v":0},null,{"$f":"IF(SUM(P$50:P$52)>0,$E56*$G56,0)","v":0},null,{"$f":"IF(SUM(R$50:R$52)>0,$E56*$G56,0)","v":0},null,{"$f":"IF(SUM(T$50:T$52)>0,$E56*$G56,0)","v":6.48},null,{"$f":"IF(SUM(V$50:V$52)>0,$E56*$G56,0)","v":0},null,{"$f":"IF(SUM(X$50:X$52)>0,$E56*$G56,0)","v":0},null,{"$f":"IF(SUM(Z$50:Z$52)>0,$E56*$G56,0)","v":0},null,{"$f":"IF(SUM(AB$50:AB$52)>0,$E56*$G56,0)","v":0},null,{"$f":"IF(SUM(AD$50:AD$52)>0,$E56*$G56,0)","v":0},null,{"$f":"IF(SUM(AF$50:AF$52)>0,$E56*$G56,0)","v":0},null,{"$f":"IF(SUM(AH$50:AH$52)>0,$E56*$G56,0)","v":0},null,{"$f":"IF(SUM(AJ$50:AJ$52)>0,$E56*$G56,0)","v":0},null,{"$f":"IF(SUM(AL$50:AL$52)>0,$E56*$G56,0)","v":0},null,{"$f":"IF(SUM(AN$50:AN$52)>0,$E56*$G56,0)","v":0},null,{"$f":"IF(SUM(AP$50:AP$52)>0,$E56*$G56,0)","v":0},null,{"$f":"IF(SUM(AR$50:AR$52)>0,$E56*$G56,0)","v":0},null,{"$f":"IF(SUM(AT$50:AT$52)>0,$E56*$G56,0)","v":0},null,{"$f":"IF(SUM(AV$50:AV$52)>0,$E56*$G56,0)","v":0},null,{"$f":"IF(SUM(AX$50:AX$52)>0,$E56*$G56,0)","v":0},null,{"$f":"IF(SUM(AZ$50:AZ$52)>0,$E56*$G56,0)","v":0},null,{"$f":"IF(SUM(BB$50:BB$52)>0,$E56*$G56,0)","v":0},null,{"$f":"IF(SUM(BD$50:BD$52)>0,$E56*$G56,0)","v":0},null,{"$f":"IF(SUM(BF$50:BF$52)>0,$E56*$G56,0)","v":0},null,{"$f":"IF(SUM(BH$50:BH$52)>0,$E56*$G56,0)","v":0},null,{"$f":"IF(SUM(BJ$50:BJ$52)>0,$E56*$G56,0)","v":0},null,{"$f":"IF(SUM(BL$50:BL$52)>0,$E56*$G56,0)","v":0},null,{"$f":"IF(SUM(BN$50:BN$52)>0,$E56*$G56,0)","v":0},null,{"$f":"IF(SUM(BP$50:BP$52)>0,$E56*$G56,0)","v":0},null,{"$f":"IF(SUM(BR$50:BR$52)>0,$E56*$G56,0)","v":0},null,{"$f":"IF(SUM(BT$50:BT$52)>0,$E56*$G56,0)","v":0},null,{"$f":"IF(SUM(BV$50:BV$52)>0,$E56*$G56,0)","v":0},null,{"$f":"IF(SUM(BX$50:BX$52)>0,$E56*$G56,0)","v":0},null,{"$f":"IF(SUM(BZ$50:BZ$52)>0,$E56*$G56,0)","v":0},null,{"$f":"IF(SUM(CB$50:CB$52)>0,$E56*$G56,0)","v":0},null,{"$f":"IF(SUM(CD$50:CD$52)>0,$E56*$G56,0)","v":0},null,{"$f":"IF(SUM(CF$50:CF$52)>0,$E56*$G56,0)","v":0},null,{"$f":"IF(SUM(CH$50:CH$52)>0,$E56*$G56,0)","v":0},null,{"$f":"IF(SUM(CJ$50:CJ$52)>0,$E56*$G56,0)","v":0},null,{"$f":"IF(SUM(CL$50:CL$52)>0,$E56*$G56,0)","v":0},null,{"$f":"IF(SUM(CN$50:CN$52)>0,$E56*$G56,0)","v":0},null,{"$f":"IF(SUM(CP$50:CP$52)>0,$E56*$G56,0)","v":0},null,{"$f":"IF(SUM(CR$50:CR$52)>0,$E56*$G56,0)","v":0},null,{"$f":"IF(SUM(CT$50:CT$52)>0,$E56*$G56,0)","v":0},null,{"$f":"IF(SUM(CV$50:CV$52)>0,$E56*$G56,0)","v":0},null,{"$f":"IF(SUM(CX$50:CX$52)>0,$E56*$G56,0)","v":0},null,{"$f":"IF(SUM(CZ$50:CZ$52)>0,$E56*$G56,0)","v":0},null,{"$f":"IF(SUM(DB$50:DB$52)>0,$E56*$G56,0)","v":0},null,{"$f":"IF(SUM(DD$50:DD$52)>0,$E56*$G56,0)","v":0},null,{"$f":"IF(SUM(DF$50:DF$52)>0,$E56*$G56,0)","v":0},null,{"$f":"IF(SUM(DH$50:DH$52)>0,$E56*$G56,0)","v":0},null,{"$f":"IF(SUM(DJ$50:DJ$52)>0,$E56*$G56,0)","v":0},null,{"$f":"IF(SUM(DL$50:DL$52)>0,$E56*$G56,0)","v":0},null,{"$f":"IF(SUM(DN$50:DN$52)>0,$E56*$G56,0)","v":0},null,{"$f":"IF(SUM(DP$50:DP$52)>0,$E56*$G56,0)","v":0},null,{"$f":"IF(SUM(DR$50:DR$52)>0,$E56*$G56,0)","v":0},null,{"$f":"IF(SUM(DT$50:DT$52)>0,$E56*$G56,0)","v":0},null,{"$f":"IF(SUM(DV$50:DV$52)>0,$E56*$G56,0)","v":0},null,{"$f":"IF(SUM(DX$50:DX$52)>0,$E56*$G56,0)","v":0}]
[null,null,2,"Protetor auditivo, do tipo inserção pré-moldado, de silicone, lavável, com cordão e tamanho único,  com proteção mínima de 18 Db(A) de atenuação pelo método NRRsf. Ref: 3M",1,"UND",{"$f":"G45","v":2.4900000000000002},null,null,null,{"$f":"IF(SUM(J$50:J$52)>0,$E57*$G57,0)","v":0},null,0,null,0,null,0,null,0,null,2.4900000000000002,null,0,null,0,null,0,null,0,null,0,null,0,null,0,null,0,null,0,null,0,null,0,null,0,null,0,null,0,null,0,null,0,null,0,null,0,null,0,null,0,null,0,null,0,null,0,null,0,null,0,null,0,null,0,null,0,null,0,null,0,null,0,null,0,null,0,null,0,null,0,null,0,null,0,null,0,null,0,null,0,null,0,null,0,null,0,null,0,null,0,null,0,null,0,null,0,null,0,null,0,null,0,null,0,null,0,null,0]
[null,null,3,"Calçado de segurança tipo sapato com resistência a objetos pontiagudos, fechamento em elástico, couro preto, forração em tecido, bico de composite, palmilha de montagem têxtil resistente à perfuração, solado de PU (poliuretano), bidensidade sem cadarço. Ref. MARLUVAS.",3,"PAR",{"$f":"G46","v":76.900000000000006},null,null,null,0,null,{"$f":"IF(SUM(L$50:L$52)>0,$E58*$G58,0)","v":0},null,0,null,0,null,0,null,230.70000000000002,null,0,null,0,null,0,null,0,null,0,null,0,null,0,null,0,null,0,null,0,null,0,null,0,null,0,null,0,null,0,null,0,null,0,null,0,null,0,null,0,null,0,null,0,null,0,null,0,null,0,null,0,null,0,null,0,null,0,null,0,null,0,null,0,null,0,null,0,null,0,null,0,null,0,null,0,null,0,null,0,null,0,null,0,null,0,null,0,null,0,null,0,null,0,null,0,null,0,null,0,null,0,null,0,null,0,null,0]
[null,null,4,"Luva de Segurança confeccionada em LÁTEX natural anatômica (esp. mínima 0,60mm), acabamento forrado em algodão flocado, antiderrapante na palma e dedos. Ref.: Mucambo",10,"PAR",5.21,null,null,null,0,null,0,null,0,null,0,null,0,null,52.1,null,0,null,0,null,0,null,0,null,0,null,0,null,0,null,0,null,0,null,0,null,0,null,0,null,0,null,0,null,0,null,0,null,0,null,0,null,0,null,0,null,0,null,0,null,0,null,0,null,0,null,0,null,0,null,0,null,0,null,0,null,0,null,0,null,0,null,0,null,0,null,0,null,0,null,0,null,0,null,0,null,0,null,0,null,0,null,0,null,0,null,0,null,0,null,0,null,0,null,0,null,0,null,0,null,0,null,0]
[]
[]
[null,null,"CATEGORIAS",null,null,null,"QUANTIDADE"]
[null,null,null,null,null,null,null,null,null,{"$f":"IF($C63=J$4,1,0)","v":0},null,{"$f":"IF($C63=L$4,1,0)","v":0},null,{"$f":"IF($C63=N$4,1,0)","v":0},null,{"$f":"IF($C63=P$4,1,0)","v":0},null,{"$f":"IF($C63=R$4,1,0)","v":0},null,{"$f":"IF($C63=T$4,1,0)","v":0},null,{"$f":"IF($C63=V$4,1,0)","v":0},null,{"$f":"IF($C63=X$4,1,0)","v":0},null,{"$f":"IF($C63=Z$4,1,0)","v":0},null,{"$f":"IF($C63=AB$4,1,0)","v":0},null,{"$f":"IF($C63=AD$4,1,0)","v":0},null,{"$f":"IF($C63=AF$4,1,0)","v":0},null,{"$f":"IF($C63=AH$4,1,0)","v":0},null,{"$f":"IF($C63=AJ$4,1,0)","v":0},null,{"$f":"IF($C63=AL$4,1,0)","v":0},null,{"$f":"IF($C63=AN$4,1,0)","v":0},null,{"$f":"IF($C63=AP$4,1,0)","v":0},null,{"$f":"IF($C63=AR$4,1,0)","v":0},null,{"$f":"IF($C63=AT$4,1,0)","v":0},null,{"$f":"IF($C63=AV$4,1,0)","v":0},null,{"$f":"IF($C63=AX$4,1,0)","v":0},null,{"$f":"IF($C63=AZ$4,1,0)","v":0},null,{"$f":"IF($C63=BB$4,1,0)","v":0},null,{"$f":"IF($C63=BD$4,1,0)","v":0},null,{"$f":"IF($C63=BF$4,1,0)","v":0},null,{"$f":"IF($C63=BH$4,1,0)","v":0},null,{"$f":"IF($C63=BJ$4,1,0)","v":0},null,{"$f":"IF($C63=BL$4,1,0)","v":0},null,{"$f":"IF($C63=BN$4,1,0)","v":0},null,{"$f":"IF($C63=BP$4,1,0)","v":0},null,{"$f":"IF($C63=BR$4,1,0)","v":0},null,{"$f":"IF($C63=BT$4,1,0)","v":0},null,{"$f":"IF($C63=BV$4,1,0)","v":0},null,{"$f":"IF($C63=BX$4,1,0)","v":0},null,{"$f":"IF($C63=BZ$4,1,0)","v":0},null,{"$f":"IF($C63=CB$4,1,0)","v":0},null,{"$f":"IF($C63=CD$4,1,0)","v":0},null,{"$f":"IF($C63=CF$4,1,0)","v":0},null,{"$f":"IF($C63=CH$4,1,0)","v":0},null,{"$f":"IF($C63=CJ$4,1,0)","v":0},null,{"$f":"IF($C63=CL$4,1,0)","v":0},null,{"$f":"IF($C63=CN$4,1,0)","v":0},null,{"$f":"IF($C63=CP$4,1,0)","v":0},null,{"$f":"IF($C63=CR$4,1,0)","v":0},null,{"$f":"IF($C63=CT$4,1,0)","v":0},null,{"$f":"IF($C63=CV$4,1,0)","v":0},null,{"$f":"IF($C63=CX$4,1,0)","v":0},null,{"$f":"IF($C63=CZ$4,1,0)","v":0},null,{"$f":"IF($C63=DB$4,1,0)","v":0},null,{"$f":"IF($C63=DD$4,1,0)","v":0},null,{"$f":"IF($C63=DF$4,1,0)","v":0},null,{"$f":"IF($C63=DH$4,1,0)","v":0},null,{"$f":"IF($C63=DJ$4,1,0)","v":0},null,{"$f":"IF($C63=DL$4,1,0)","v":0},null,{"$f":"IF($C63=DN$4,1,0)","v":0},null,{"$f":"IF($C63=DP$4,1,0)","v":0},null,{"$f":"IF($C63=DR$4,1,0)","v":0},null,{"$f":"IF($C63=DT$4,1,0)","v":0},null,{"$f":"IF($C63=DV$4,1,0)","v":0},null,{"$f":"IF($C63=DX$4,1,0)","v":0}]
[null,null,7,{"$f":"HLOOKUP($C64,'Dados Gerais'!$D$5:$BK$10,6)","v":0},null,null,{"$f":"HLOOKUP($C64,'Dados Gerais'!$D$5:$BK$14,10)","v":0},null,null,{"$f":"IF($C64=J$4,1,0)","v":0},null,0,null,0,null,0,null,0,null,0,null,1,null,0,null,0,null,0,null,0,null,0,null,0,null,0,null,0,null,0,null,0,null,0,null,0,null,0,null,0,null,0,null,0,null,0,null,0,null,0,null,0,null,0,null,0,null,0,null,0,null,0,null,0,null,0,null,0,null,0,null,0,null,0,null,0,null,0,null,0,null,0,null,0,null,0,null,0,null,0,null,0,null,0,null,0,null,0,null,0,null,0,null,0,null,0,null,0,null,0,null,0,null,0,null,0,null,0]
[null,null,8,{"$f":"HLOOKUP($C65,'Dados Gerais'!$D$5:$BK$10,6)","v":0},null,null,{"$f":"HLOOKUP($C65,'Dados Gerais'!$D$5:$BK$14,10)","v":0},null,null,{"$f":"IF($C65=J$4,1,0)","v":0},null,0,null,0,null,0,null,0,null,0,null,0,null,1,null,0,null,0,null,0,null,0,null,0,null,0,null,0,null,0,null,0,null,0,null,0,null,0,null,0,null,0,null,0,null,0,null,0,null,0,null,0,null,0,null,0,null,0,null,0,null,0,null,0,null,0,null,0,null,0,null,0,null,0,null,0,null,0,null,0,null,0,null,0,null,0,null,0,null,0,null,0,null,0,null,0,null,0,null,0,null,0,null,0,null,0,null,0,null,0,null,0,null,0,null,0,null,0]
[null,null,9,{"$f":"HLOOKUP($C66,'Dados Gerais'!$D$5:$BK$10,6)","v":0},null,null,{"$f":"HLOOKUP($C66,'Dados Gerais'!$D$5:$BK$14,10)","v":0},null,null,{"$f":"IF($C66=J$4,1,0)","v":0},null,0,null,0,null,0,null,0,null,0,null,0,null,0,null,1,null,0,null,0,null,0,null,0,null,0,null,0,null,0,null,0,null,0,null,0,null,0,null,0,null,0,null,0,null,0,null,0,null,0,null,0,null,0,null,0,null,0,null,0,null,0,null,0,null,0,null,0,null,0,null,0,null,0,null,0,null,0,null,0,null,0,null,0,null,0,null,0,null,0,null,0,null,0,null,0,null,0,null,0,null,0,null,0,null,0,null,0,null,0,null,0,null,0,null,0,null,0]
[null,null,null,null,null,null,null,null,null,{"$f":"IF($C67=J$4,1,0)","v":0},null,0,null,0,null,0,null,0,null,0,null,0,null,0,null,0,null,0,null,0,null,0,null,0,null,0,null,0,null,0,null,0,null,0,null,0,null,0,null,0,null,0,null,0,null,0,null,0,null,0,null,0,null,0,null,0,null,0,null,0,null,0,null,0,null,0,null,0,null,0,null,0,null,0,null,0,null,0,null,0,null,0,null,0,null,0,null,0,null,0,null,0,null,0,null,0,null,0,null,0,null,0,null,0,null,0,null,0,null,0,null,0,null,0,null,0,null,0]
[]
[null,null,"ITEM","DESCRIÇÃO","QUANT ANUAL POR POSTO","UNIDADE","VALOR"]
[null,null,null,null,null,null,null,null,null,null,{"$f":"IF(SUM(J$8:J$10)>0,$E70*$G70,0)","v":0},null,{"$f":"IF(SUM(L$8:L$10)>0,$E70*$G70,0)","v":0},null,{"$f":"IF(SUM(N$8:N$10)>0,$E70*$G70,0)","v":0},null,{"$f":"IF(SUM(P$8:P$10)>0,$E70*$G70,0)","v":0},null,{"$f":"IF(SUM(R$8:R$10)>0,$E70*$G70,0)","v":0},null,{"$f":"IF(SUM(T$8:T$10)>0,$E70*$G70,0)","v":0},null,{"$f":"IF(SUM(V$8:V$10)>0,$E70*$G70,0)","v":0},null,{"$f":"IF(SUM(X$8:X$10)>0,$E70*$G70,0)","v":0},null,{"$f":"IF(SUM(Z$8:Z$10)>0,$E70*$G70,0)","v":0},null,{"$f":"IF(SUM(AB$8:AB$10)>0,$E70*$G70,0)","v":0},null,{"$f":"IF(SUM(AD$8:AD$10)>0,$E70*$G70,0)","v":0},null,{"$f":"IF(SUM(AF$8:AF$10)>0,$E70*$G70,0)","v":0},null,{"$f":"IF(SUM(AH$8:AH$10)>0,$E70*$G70,0)","v":0},null,{"$f":"IF(SUM(AJ$8:AJ$10)>0,$E70*$G70,0)","v":0},null,{"$f":"IF(SUM(AL$8:AL$10)>0,$E70*$G70,0)","v":0},null,{"$f":"IF(SUM(AN$8:AN$10)>0,$E70*$G70,0)","v":0},null,{"$f":"IF(SUM(AP$8:AP$10)>0,$E70*$G70,0)","v":0},null,{"$f":"IF(SUM(AR$8:AR$10)>0,$E70*$G70,0)","v":0},null,{"$f":"IF(SUM(AT$8:AT$10)>0,$E70*$G70,0)","v":0},null,{"$f":"IF(SUM(AV$8:AV$10)>0,$E70*$G70,0)","v":0},null,{"$f":"IF(SUM(AX$8:AX$10)>0,$E70*$G70,0)","v":0},null,{"$f":"IF(SUM(AZ$8:AZ$10)>0,$E70*$G70,0)","v":0},null,{"$f":"IF(SUM(BB$8:BB$10)>0,$E70*$G70,0)","v":0},null,{"$f":"IF(SUM(BD$8:BD$10)>0,$E70*$G70,0)","v":0},null,{"$f":"IF(SUM(BF$8:BF$10)>0,$E70*$G70,0)","v":0},null,{"$f":"IF(SUM(BH$8:BH$10)>0,$E70*$G70,0)","v":0},null,{"$f":"IF(SUM(BJ$8:BJ$10)>0,$E70*$G70,0)","v":0},null,{"$f":"IF(SUM(BL$8:BL$10)>0,$E70*$G70,0)","v":0},null,{"$f":"IF(SUM(BN$8:BN$10)>0,$E70*$G70,0)","v":0},null,{"$f":"IF(SUM(BP$8:BP$10)>0,$E70*$G70,0)","v":0},null,{"$f":"IF(SUM(BR$8:BR$10)>0,$E70*$G70,0)","v":0},null,{"$f":"IF(SUM(BT$8:BT$10)>0,$E70*$G70,0)","v":0},null,{"$f":"IF(SUM(BV$8:BV$10)>0,$E70*$G70,0)","v":0},null,{"$f":"IF(SUM(BX$8:BX$10)>0,$E70*$G70,0)","v":0},null,{"$f":"IF(SUM(BZ$8:BZ$10)>0,$E70*$G70,0)","v":0},null,{"$f":"IF(SUM(CB$8:CB$10)>0,$E70*$G70,0)","v":0},null,{"$f":"IF(SUM(CD$8:CD$10)>0,$E70*$G70,0)","v":0},null,{"$f":"IF(SUM(CF$8:CF$10)>0,$E70*$G70,0)","v":0},null,{"$f":"IF(SUM(CH$8:CH$10)>0,$E70*$G70,0)","v":0},null,{"$f":"IF(SUM(CJ$8:CJ$10)>0,$E70*$G70,0)","v":0},null,{"$f":"IF(SUM(CL$8:CL$10)>0,$E70*$G70,0)","v":0},null,{"$f":"IF(SUM(CN$8:CN$10)>0,$E70*$G70,0)","v":0},null,{"$f":"IF(SUM(CP$8:CP$10)>0,$E70*$G70,0)","v":0},null,{"$f":"IF(SUM(CR$8:CR$10)>0,$E70*$G70,0)","v":0},null,{"$f":"IF(SUM(CT$8:CT$10)>0,$E70*$G70,0)","v":0},null,{"$f":"IF(SUM(CV$8:CV$10)>0,$E70*$G70,0)","v":0},null,{"$f":"IF(SUM(CX$8:CX$10)>0,$E70*$G70,0)","v":0},null,{"$f":"IF(SUM(CZ$8:CZ$10)>0,$E70*$G70,0)","v":0},null,{"$f":"IF(SUM(DB$8:DB$10)>0,$E70*$G70,0)","v":0},null,{"$f":"IF(SUM(DD$8:DD$10)>0,$E70*$G70,0)","v":0},null,{"$f":"IF(SUM(DF$8:DF$10)>0,$E70*$G70,0)","v":0},null,{"$f":"IF(SUM(DH$8:DH$10)>0,$E70*$G70,0)","v":0},null,{"$f":"IF(SUM(DJ$8:DJ$10)>0,$E70*$G70,0)","v":0},null,{"$f":"IF(SUM(DL$8:DL$10)>0,$E70*$G70,0)","v":0},null,{"$f":"IF(SUM(DN$8:DN$10)>0,$E70*$G70,0)","v":0},null,{"$f":"IF(SUM(DP$8:DP$10)>0,$E70*$G70,0)","v":0},null,{"$f":"IF(SUM(DR$8:DR$10)>0,$E70*$G70,0)","v":0},null,{"$f":"IF(SUM(DT$8:DT$10)>0,$E70*$G70,0)","v":0},null,{"$f":"IF(SUM(DV$8:DV$10)>0,$E70*$G70,0)","v":0},null,{"$f":"IF(SUM(DX$8:DX$10)>0,$E70*$G70,0)","v":0}]
[null,null,1,"Calçado de segurança tipo sapato com resistência a objetos pontiagudos, fechamento em elástico, couro preto, forração em tecido, bico de composite, palmilha de montagem têxtil resistente à perfuração, solado de PU (poliuretano), bidensidade sem cadarço. Ref. MARLUVAS.",3,"PAR",null,null,null,null,{"$f":"IF(SUM(J$64:J$66)>0,$E71*$G71,0)","v":0},null,{"$f":"IF(SUM(L$64:L$66)>0,$E71*$G71,0)","v":0},null,{"$f":"IF(SUM($J$64:$J$66)>0,$E71*$G71,0)","v":0},null,{"$f":"IF(SUM($J$64:$J$66)>0,$E71*$G71,0)","v":0},null,{"$f":"IF(SUM($J$64:$J$66)>0,$E71*$G71,0)","v":0},null,{"$f":"IF(SUM($J$64:$J$66)>0,$E71*$G71,0)","v":0},null,{"$f":"IF(SUM(V$64:V$66)>0,$E71*$G71,0)","v":0},null,{"$f":"IF(SUM(X$64:X$66)>0,$E71*$G71,0)","v":0},null,{"$f":"IF(SUM(Z$64:Z$66)>0,$E71*$G71,0)","v":0},null,{"$f":"IF(SUM($J$64:$J$66)>0,$E71*$G71,0)","v":0},null,{"$f":"IF(SUM($J$64:$J$66)>0,$E71*$G71,0)","v":0},null,{"$f":"IF(SUM($J$64:$J$66)>0,$E71*$G71,0)","v":0},null,{"$f":"IF(SUM($J$64:$J$66)>0,$E71*$G71,0)","v":0},null,{"$f":"IF(SUM($J$64:$J$66)>0,$E71*$G71,0)","v":0},null,{"$f":"IF(SUM($J$64:$J$66)>0,$E71*$G71,0)","v":0},null,{"$f":"IF(SUM($J$64:$J$66)>0,$E71*$G71,0)","v":0},null,{"$f":"IF(SUM($J$64:$J$66)>0,$E71*$G71,0)","v":0},null,{"$f":"IF(SUM($J$64:$J$66)>0,$E71*$G71,0)","v":0},null,{"$f":"IF(SUM($J$64:$J$66)>0,$E71*$G71,0)","v":0},null,{"$f":"IF(SUM($J$64:$J$66)>0,$E71*$G71,0)","v":0},null,{"$f":"IF(SUM($J$64:$J$66)>0,$E71*$G71,0)","v":0},null,{"$f":"IF(SUM($J$64:$J$66)>0,$E71*$G71,0)","v":0},null,{"$f":"IF(SUM($J$64:$J$66)>0,$E71*$G71,0)","v":0},null,{"$f":"IF(SUM($J$64:$J$66)>0,$E71*$G71,0)","v":0},null,{"$f":"IF(SUM($J$64:$J$66)>0,$E71*$G71,0)","v":0},null,{"$f":"IF(SUM($J$64:$J$66)>0,$E71*$G71,0)","v":0},null,{"$f":"IF(SUM($J$64:$J$66)>0,$E71*$G71,0)","v":0},null,{"$f":"IF(SUM($J$64:$J$66)>0,$E71*$G71,0)","v":0},null,{"$f":"IF(SUM($J$64:$J$66)>0,$E71*$G71,0)","v":0},null,{"$f":"IF(SUM($J$64:$J$66)>0,$E71*$G71,0)","v":0},null,{"$f":"IF(SUM($J$64:$J$66)>0,$E71*$G71,0)","v":0},null,{"$f":"IF(SUM($J$64:$J$66)>0,$E71*$G71,0)","v":0},null,{"$f":"IF(SUM($J$64:$J$66)>0,$E71*$G71,0)","v":0},null,{"$f":"IF(SUM($J$64:$J$66)>0,$E71*$G71,0)","v":0},null,{"$f":"IF(SUM($J$64:$J$66)>0,$E71*$G71,0)","v":0},null,{"$f":"IF(SUM($J$64:$J$66)>0,$E71*$G71,0)","v":0},null,{"$f":"IF(SUM($J$64:$J$66)>0,$E71*$G71,0)","v":0},null,{"$f":"IF(SUM($J$64:$J$66)>0,$E71*$G71,0)","v":0},null,{"$f":"IF(SUM($J$64:$J$66)>0,$E71*$G71,0)","v":0},null,{"$f":"IF(SUM($J$64:$J$66)>0,$E71*$G71,0)","v":0},null,{"$f":"IF(SUM($J$64:$J$66)>0,$E71*$G71,0)","v":0},null,{"$f":"IF(SUM($J$64:$J$66)>0,$E71*$G71,0)","v":0},null,{"$f":"IF(SUM($J$64:$J$66)>0,$E71*$G71,0)","v":0},null,{"$f":"IF(SUM($J$64:$J$66)>0,$E71*$G71,0)","v":0},null,{"$f":"IF(SUM($J$64:$J$66)>0,$E71*$G71,0)","v":0},null,{"$f":"IF(SUM($J$64:$J$66)>0,$E71*$G71,0)","v":0},null,{"$f":"IF(SUM($J$64:$J$66)>0,$E71*$G71,0)","v":0},null,{"$f":"IF(SUM($J$64:$J$66)>0,$E71*$G71,0)","v":0},null,{"$f":"IF(SUM($J$64:$J$66)>0,$E71*$G71,0)","v":0},null,{"$f":"IF(SUM($J$64:$J$66)>0,$E71*$G71,0)","v":0},null,{"$f":"IF(SUM($J$64:$J$66)>0,$E71*$G71,0)","v":0},null,{"$f":"IF(SUM($J$64:$J$66)>0,$E71*$G71,0)","v":0},null,{"$f":"IF(SUM($J$64:$J$66)>0,$E71*$G71,0)","v":0},null,{"$f":"IF(SUM($J$64:$J$66)>0,$E71*$G71,0)","v":0},null,{"$f":"IF(SUM($J$64:$J$66)>0,$E71*$G71,0)","v":0},null,{"$f":"IF(SUM($J$64:$J$66)>0,$E71*$G71,0)","v":0},null,{"$f":"IF(SUM($J$64:$J$66)>0,$E71*$G71,0)","v":0},null,{"$f":"IF(SUM($J$64:$J$66)>0,$E71*$G71,0)","v":0},null,{"$f":"IF(SUM($J$64:$J$66)>0,$E71*$G71,0)","v":0},null,{"$f":"IF(SUM($J$64:$J$66)>0,$E71*$G71,0)","v":0}]
[null,null,2,"Luva de Segurança confeccionada em LÁTEX natural anatômica (esp. mínima 0,60mm), acabamento forrado em algodão flocado, antiderrapante na palma e dedos. Ref.: Mucambo",11,"PAR",null,null,null,null,{"$f":"IF(SUM(J$64:J$66)>0,$E72*$G72,0)","v":0},null,0,null,{"$f":"IF(SUM($J$64:$J$66)>0,$E72*$G72,0)","v":0},null,0,null,0,null,0,null,{"$f":"IF(SUM(V$64:V$66)>0,$E72*$G72,0)","v":0},null,0,null,{"$f":"IF(SUM(Z$64:Z$66)>0,$E72*$G72,0)","v":0},null,{"$f":"IF(SUM($J$64:$J$66)>0,$E72*$G72,0)","v":0},null,0,null,0,null,0,null,0,null,0,null,0,null,0,null,0,null,0,null,0,null,0,null,0,null,0,null,0,null,0,null,0,null,0,null,0,null,0,null,0,null,0,null,0,null,0,null,0,null,0,null,0,null,0,null,0,null,0,null,0,null,0,null,0,null,0,null,0,null,0,null,0,null,0,null,0,null,0,null,0,null,0,null,0,null,0,null,0,null,0,null,0,null,0,null,0,null,0,null,0]
[null,null,3,"Respirador purificador de ar tipo, peça semifacial filtrante para partículas (PFF2), com formato dobrável, solda ultra-sônica em todo o seu perímetro. Fita elástica branca fixada nas laterais externas do respirador, perfazendo uma alça na para fixação na parte superior da cabeça e a outra na parte inferior, para fixação na altura da nuca do usuário. A parte superior externa da peça possui tira de material metálico moldável, utilizada para ajuste no septo nasal. Com válvula de exalação. DEVERÁ APRESENTAR O SELO DE APROVAÇÃO DO INMETRO. Ref. 3M ",2,"UND",null,null,null,null,0,null,0,null,{"$f":"IF(SUM($J$64:$J$66)>0,$E73*$G73,0)","v":0},null,0,null,0,null,0,null,0,null,0,null,{"$f":"IF(SUM(Z$64:Z$66)>0,$E73*$G73,0)","v":0},null,0,null,0,null,0,null,0,null,0,null,0,null,0,null,0,null,0,null,0,null,0,null,0,null,0,null,0,null,0,null,0,null,0,null,0,null,0,null,0,null,0,null,0,null,0,null,0,null,0,null,0,null,0,null,0,null,0,null,0,null,0,null,0,null,0,null,0,null,0,null,0,null,0,null,0,null,0,null,0,null,0,null,0,null,0,null,0,null,0,null,0,null,0,null,0,null,0,null,0,null,0]

{"sheet":"SREP","index":18,"n_rows":75,"n_cols":15,"rows_kept":75,"cut":false,"hidden":false,"merged":[[2,1,2,3],[3,1,3,14]]}
[]
[]
[]
[null,"SISTEMA DE REGISTRO ELETRÔNICO DE PRESENÇA - SREP"]
[]
[]
[null,null,"PAGAMENTO DA DEPRECIAÇÃO"]
[null,null,"ITEM","DESCRIÇÃO","QUANT ANUAL","CONTA SIAFI","VALOR DE AQ.","% RESIDUAL","VIDA ÚTIL","DEP. MENSAL","CUSTO TOTAL","BDI (%)","PREÇO TOTAL","FONTE","REFERÊNCIA"]
[]
[null,null,1,"Equipamento de Registro Eletrônico de Ponto, de parede, com teclado externo e leitor biométrico, em conformidade com a Portaria 1.510/2009 do MT",4,"12311.01.24\n(máquinas e equip\neletrônicos)",1705.92,0.1,10,{"$f":"G10*(1-H10)/(I10*12)","v":12.794400000000001},{"$f":"J10*E10","v":51.177600000000005},{"$f":"BDI!E26","v":0.21690000000000001},{"$f":"ROUND(K10*(1+L10),2)","v":62.28},"COTAÇÃO"]
[]
[]
[null,null,"PAGAMENTO DA MANUTENÇÃO"]
[null,null,"ITEM","DESCRIÇÃO",null,null,null,"K (calculado)","MENSAL DEPR.","% MAN X DEP","MENSAL MAN.","BDI (%)","PREÇO TOTAL"]
[]
[null,null,2,"Todos os itens",null,null,null,{"$f":"H23","v":0.42411600000000005},{"$f":"K10","v":51.177600000000005},{"$f":"H16","v":0.42411600000000005},{"$f":"I16*H16","v":21.705239001600006},{"$f":"L10","v":0.21690000000000001},{"$f":"ROUND(K16*(1+L16),2)","v":26.41}]
[]
[null,null,null,null,"K1","K2","K3","K4"]
[null,null,null,null,0.85,1,0.8,1]
[null,null,null,null,"K5","K6","K7","K8"]
[null,null,null,null,1,0.6,0.5,1.1000000000000001]
[null,null,null,null,"K9","K10","K11","RESULTADO"]
[null,null,null,"* a descrição de cada coeficiente segue abaixo",1.5,0.9,1.4,{"$f":"E19*F19*G19*H19*E21*F21*G21*H21*E23*F23*G23","v":0.42411600000000005}]
[]
[]
[null,null,"PAGAMENTO DO SOFTWARE"]
[null,null,"ITEM","DESCRIÇÃO",null,null,null,null,"QUANTIDADE","UNIDADE","UNIT. MENSAL","BDI (%)","PREÇO TOTAL"]
[]
[null,null,3,"Software Ponto Secullum 4 - manutenção e suporte técnico com backup - Web Nuvem - Mensalidade até 200 usuários",null,null,null,null,2,"Licença/mês",823.53,{"$f":"L35","v":0.21690000000000001},{"$f":"ROUND(K29*(1+L29),2)","v":1002.15},"COTAÇÃO"]
[]
[]
[null,null,"MATERIAL DE CONSUMO ASSOCIADO"]
[null,null,"ITEM","DESCRIÇÃO",null,null,null,"QUANTID/ANO","UNIDADE","VALOR DE AQ.","MENSAL MAT","BDI (%)","PREÇO TOTAL"]
[]
[null,null,4,"Bobina térmica específica para o registrador eletrônico de ponto, com papel termossensível, superfície de impressão externa ao rolo, durabilidade de impressão mínima de 5 anos e comprimento mínimo de 300m","* estimado um gasto anual de 37 bobinas por equipamento",null,null,{"$f":"ROUNDUP(SUM(Remunerações!E15)*4*22*12*0.05/300,0)","v":37},"Bobina",34.1,{"$f":"J35*H35/12","v":105.14166666666667},{"$f":"L16","v":0.21690000000000001},{"$f":"ROUND(K35*(1+L35),2)","v":127.95},"COTAÇÃO"]
[]
[]
[null,null,"MATERIAL DE CONSUMO ASSOCIADO"]
[null,null,"ITEM","DESCRIÇÃO",null,null,null,null,null,null,null,null,"PREÇO TOTAL"]
[]
[null,null,1,"Componente DEPRECIAÇÃO",null,null,null,null,null,null,null,null,{"$f":"M10","v":62.28}]
[null,null,2,"Componente MANUTENÇÃO",null,null,null,null,null,null,null,null,{"$f":"M16","v":26.41}]
[null,null,3,"Componente SOFTWARE",null,null,null,null,null,null,null,null,{"$f":"M29","v":1002.15}]
[null,null,4,"Componente MATERIAL DE CONSUMO ASSOCIADO",null,null,null,null,null,null,null,null,{"$f":"M35","v":127.95}]
[]
[null,null,null,null,null,null,null,null,null,null,null,"SOMATÓRIO TOTAL MENSAL",{"$f":"SUM(M40:M45)","v":1218.79}]
[null,null,null,null,null,null,null,null,null,null,null,"SOMATÓRIO TOTAL ANUAL",{"$f":"M46*12","v":14625.48}]
[]
[]
[null,null,"MATERIAL DE CONSUMO ASSOCIADO"]
[null,null,"MEMÓRIA DE CÁLCULO DO COEFICIENTE DE CORRELAÇÃO MANUTENÇÃO X DEPRECIAÇÃO (K)"]
[]
[null,null,"JUSTIFICATIVAS",null,"TIPO","K1",null,"Condições de Trab","K4",null,"Tempo Vida (anos)",{"$f":"SUM(L8:L51)","v":0.86760000000000004},null,"Temperatura","K8"]
[null,null,null,null,"Guindaste",0.5,null,"Em espera",0.4,null,1,0.6,null,"Muito quente (> 40º C)",1.3]
[null,null,"K1","Considerado o valor médio de 0,85","Caminhão-comum",0.8,null,"Leves",0.8,null,2,0.7,null,"Quente (30º a 40º C)",1.1000000000000001]
[null,null,"K2","Considerado o operador médio","Fora-de-estrada",1,null,"Médias",1,null,3,0.8,null,"Médio (10º a 30º C)",1]
[null,null,"K3","Consideradas ferramentas de primeira qualidade","Carregadeira",1,null,"Pesadas",1.4,null,4,0.9,null,"Frio (< 10º C)",1.2]
[null,null,"K4","Há todo o tipo de trabalho, foi considerado condições pesadas","Escavadeira",1.4,null,"Severas",2,null,5,1]
[null,null,"K5","Considerando manutenção normal","Motoescrêiper",1.1000000000000001,null,null,null,null,6,1,null,"Ritmo de Trabalho","K9"]
[null,null,"K6","Equipamentos novos","Trator de esteira",1.2,null,"Manutenção","K5",null,7,1,null,"Folgado",0.9]
[null,null,"K7","4h por dia, 252 dias por ano",null,null,null,"Excelente",0.6,null,8,1.2,null,"Médio ",1]
[null,null,"K8","Clima quente, acima de 30º C","Qualid do Operador","K2",null,"Boa",0.8,null,9,1.3,null,"Com pressa",1.5]
[null,null,"K9","Ritmo de trabalho usualmente com pressa","Excelente",0.8,null,"Média",1,null,10,1.4]
[null,null,"K10","Considerado o operador médio","Boa",0.9,null,"Ruim ",1.5,null,11,2,null,"Conh do Serviço","K10"]
[null,null,"K11","Foi considerada a opção de aluguel a terceiros, ainda que a simulação seja dos custos do contratado, contudo a execução dos serviços é em local de terceiros","Média",1,null,"Inexistente",3,null,15,2,null,"Grande ",0.8]
[null,null,null,null,"Ruim",1.2,null,null,null,null,null,null,null,"Médio     ",0.9]
[null,null,null,null,"Péssima",2,null,"Horas de Uso ","K7",6000,1,null,null,"Pouco ",1]
[null,null,null,null,null,null,null,1000,0.5,8000,1.3]
[null,null,null,null,"Qualidade do Equip","K3",null,2000,0.5,10000,1.6,null,null,"Tipo do Serviço","K11"]
[null,null,null,null,"De primeira",0.8,null,3000,0.6,12000,1.9,null,null,"Mina ou Pedreira",0.8]
[null,null,null,null,"Média",1,null,4000,0.7,15000,2.2999999999999998,null,null,"Construção Geral",1]
[null,null,null,null,"Ruim",1.5,null,5000,0.9,20000,3,null,null,"Aluguel a Terceiros",1.4]
[]
[null,null,null,null,"Fonte: "]
[null,null,null,null,"MATTOS, Aldo Dórea. Como preparar orçamentos de obras. São Paulo: Pini, 2006. 281 p., il"]

{"sheet":"Não Rel - EPI","index":19,"n_rows":53,"n_cols":15,"rows_kept":53,"cut":false,"hidden":false,"merged":[[2,1,2,4],[3,1,3,11]]}
[]
[]
[]
[null,"EPIS NÃO RELACIONADOS DIRETAMENTE A UM POSTO DE TRABALHO - AQUISIÇÃO"]
[]
[]
[null,null,null,"ITEM","DESCRIÇÃO","QUANT ANUAL","UNIDADE","CUSTO UNITÁRIO","CUSTO ANUAL","BDI (%)","PREÇO TOTAL","FONTE"]
[]
[null,null,null,1,"Avental em PVC (forrado), 70 X 120CM de largura e comprimento (aproximadamente), corpo inteiro na frente, contendo tiras fixadas no avental, que deverão ser amarradas no pescoço e na cintura. REF.: MAICOL",20,"UNID",15.399999999999999,{"$f":"H9*F9","v":308},{"$f":"BDI!E26","v":0.21690000000000001},{"$f":"ROUND(I9*(1+J9),2)","v":374.81},"COTAÇÃO"]
[null,null,null,{"$f":"D9+1","v":2},"Bloqueador solar com fator de proteção solar no mínimo de 30 (UV FPS 30) com propriedade repelente a insetos. Inodoro. Bombonas (4 Litros). REF.: LUVEX.",4,"UNID",378.95,{"$f":"H10*F10","v":1515.8},{"$f":"J9","v":0.21690000000000001},{"$f":"ROUND(I10*(1+J10),2)","v":1844.58},"COTAÇÃO"]
[null,null,null,{"$f":"D10+1","v":3},"Boné tipo Árabe confeccionado em helanca com viés na aba, elástico interno traseiro para ajuste de tamanho, fechamento da saia em velcro. REF.: Nexus",60,"UNID",16.155000000000001,969.30000000000007,{"$f":"J10","v":0.21690000000000001},1179.54,"COTAÇÃO"]
[null,null,null,4,"Bota em PVC, impermeável, forrada internamente, cano médio, resistência ao escorregamento do solado SRC. Ref. MARLUVAS",50,"PARES",39.480000000000004,1974.0000000000002,0.21690000000000001,2402.16,"COTAÇÃO"]
[null,null,null,5,"Vestimenta tipo capa (para chuva), confeccionada em PVC forrada em poliéster, fechamento frontal com botões plásticos de pressão, costuras através de solda eletrônica, com mangas e capuz, comprimento mínimo 1,15m. ref. CARBOGRAFITE",30,"UNID",25.984999999999999,779.55,0.21690000000000001,948.63,"COTAÇÃO"]
[null,null,null,6,"Capacete de segurança em polietileno de alta densidade, na cor AMARELA, com aba frontal, casco com nervuras, suspensão em tecido, com Faixa anti-suor, regulagem de tamanho com ajuste simples, com jugular ajustável. Ref.: MSA ",10,"UNID",62.645000000000003,626.45000000000005,0.21690000000000001,762.33,"COTAÇÃO"]
[null,null,null,7,"Cartucho químico para Vapores orgânicos e gases ácidos compatível com os respiradores (meia peça facial e peça facial completa). Ref. 3M Série 6000",11,"PARES",95.075000000000003,1045.825,0.21690000000000001,1272.6600000000001,"COTAÇÃO"]
[null,null,null,8,"Cinto de segurança tipo paraquedista; confeccionado em fita de poliéster (min. 40mm); Pontos de conexão: peitoral, umbilical, dorsal, laterais na cintura; Provido de alças de suspensão nos ombros para trabalho em espaço confinado; Ajuste nas pernas, cintura e suspensório; Alças para ferramentas; Proteção acolchoada lombar e nas pernas; em conformidade com as normas NBR 15835:2010, NBR 15836:2010.  Ref.: MG cintos, modelo Mult 1270",6,"CONJ",422.815,2536.89,0.21690000000000001,3087.14,"COTAÇÃO"]
[null,null,null,9,"Corda de segurança semi-estática 12mm na cor branca, carga de ruptura 20kN. Trançado triplo e alma central. Trançado externo em multi filamento de poliamida, trançado intermediário e alerta visual em multi filamento de polipropileno, trançado interno em multi filamento de poliamida e alma central torcida em multi filamento de poliamida. Possui fita de identificação interna. Ref. 3M ALTISEG",25,"METROS",4.5199999999999996,112.99999999999999,0.21690000000000001,137.51,"COTAÇÃO"]
[null,null,null,10,"Fita de sinalização (zebrada), com listas laranja e preta intercaladas-rolo 180 m x 65 mm. Rolo de 200 Metros. Ref.: 3M",20,"UNID",10.199999999999999,204,0.21690000000000001,248.25,"COTAÇÃO"]
[null,null,null,11,"Luva de segurança confeccionada em vaqueta, com formato de 05 dedos, reforço na palma, reforço na costura entre o polegar e o indicador e entre os dedos anelares, punho curto (7 a 10 cm), elastico de ajuste no dorso. Ref. Plascouro",30,"PARES",18.945,568.35,0.21690000000000001,691.63,"COTAÇÃO"]
[null,null,null,12,"Luva de segurança em borracha nitrílica, na cor verde, sem forro. Superfície externa antiderrapante. Cano longo (46cm) e espessura mínima de 0,55mm. Ref.: Danny Nitriflex",30,"PAR",32.01,960.3,0.21690000000000001,1168.5899999999999,"COTAÇÃO"]
[null,null,null,13,"Óculos de sobreposição INCOLOR, constituído de armação e visor confeccionados em uma única peça de policarbonato com apoio (do nariz) anatômico. Permite a sobreposição em óculos de grau. Hastes do tipo espátula confeccionadas do mesmo material da armação. Possui fendas para ventilação fixadas à armação e orifícios para cordão. REF. CARBOGRAFITE Mod. Provision.",12,"UNID",5.76,69.12,0.21690000000000001,84.11,"COTAÇÃO"]
[null,null,null,14,"Óculos de segurança constituídos de armação e visor confeccionados em uma única peça de policarbonato CINZA, anti-risco, apoio nasal de plástico maleável. Hastes emborrachadas. Ref.: 3M Virtua V4",30,"UNID",22.274999999999999,668.25,0.21690000000000001,813.19,"COTAÇÃO"]
[null,null,null,15,"Óculos de segurança constituídos de armação e visor confeccionados em uma única peça de policarbonato INCOLOR, anti-risco, apoio nasal de plástico maleável. Hastes emborrachadas. Ref.: 3M Virtua V4",78,"UNID",36.67,2860.26,0.21690000000000001,3480.65,"COTAÇÃO"]
[null,null,null,16,"Protetor auditivo, do tipo inserção pré-moldado, de silicone, lavável, com cordão e tamanho único,  com proteção mínima de 18 Db(A) de atenuação pelo método NRRsf. Ref: 3M",35,"UNID",2.4900000000000002,87.15,0.21690000000000001,106.05,"COTAÇÃO"]
[null,null,null,17,"Respirador de meia peça facial, com duplo filtro Ref.: 3M, modelo 6200",5,"UNID",247.40499999999997,1237.0249999999999,0.21690000000000001,1505.34,"COTAÇÃO"]
[null,null,null,18,"Respirador peça facial completa, com duplo filtro Ref.: 3M, modelo 6800",6,"UNID",1749,10494,0.21690000000000001,12770.15,"COTAÇÃO"]
[null,null,null,19,"Talabarte em Y (max. 1,50m de comprimento), Confeccionado em fita tubular de poliéster, 02 ganchos dupla trava em aço com abertura de 50 a 60 mm; com absorvedor de energia, com gancho olhal dupla trava com abertura de 15 a 20 mm. Obs.: o talabarte deve ser compatível com o cinto de segurança tipo paraquedista fornecido. Ref.: MG cintos, modelo Mult 1892 ",6,"UNID",203.57999999999998,1221.48,0.21690000000000001,1486.42,"COTAÇÃO"]
[]
[null,null,null,null,null,null,null,null,null,"SOMATÓRIO TOTAL MENSAL",{"$f":"K30/12","v":2863.645}]
[null,null,null,null,null,null,null,null,null,"SOMATÓRIO TOTAL ANUAL",{"$f":"SUM(K8:K28)","v":34363.74},null,null,{"$f":"SUM($I$9:$I$27)","v":28238.75},"por ano sem bdi"]
[]
[]
[]
[]
[]
[]
[]
[]
[]
[]
[]
[]
[]
[]
[]
[]
[]
[]
[]
[]
[]
[]
[null,null,null,null,null,null,null,null,null,null,null,{"$f":"SUM(L8:L51)","v":0}]

{"sheet":"Equip Rel","index":20,"n_rows":80,"n_cols":136,"rows_kept":80,"cut":false,"hidden":true,"merged":[[9,1,9,3],[10,1,10,14]]}
[null,null,"CÂMARA DOS DEPUTADOS"]
[null,null,"DEPARTAMENTO TÉCNICO"]
[null,null,"Coordenação de Planejamento e Gestão"]
[]
[null,null,"Data:",{"$f":"'Dados Gerais'!#REF!","v":{"$error":"#REF!"}}]
[null,null,"Processo:",{"$f":"'Dados Gerais'!#REF!","v":{"$error":"#REF!"}}]
[null,null,"Objeto:",{"$f":"'Dados Gerais'!#REF!","v":{"$error":"#REF!"}}]
[]
[]
[]
[null,"EQUIPAMENTOS RELACIONADOS AO POSTO - PAGAMENTO DA DEPRECIAÇÃO / MANUTENÇÃO",null,null,null,null,null,null,null,null,null,null,null,null,null,null,1,null,{"$f":"Q11+1","v":2},null,{"$f":"S11+1","v":3},null,{"$f":"U11+1","v":4},null,{"$f":"W11+1","v":5},null,{"$f":"Y11+1","v":6},null,{"$f":"AA11+1","v":7},null,{"$f":"AC11+1","v":8},null,{"$f":"AE11+1","v":9},null,{"$f":"AG11+1","v":10},null,{"$f":"AI11+1","v":11},null,{"$f":"AK11+1","v":12},null,{"$f":"AM11+1","v":13},null,{"$f":"AO11+1","v":14},null,{"$f":"AQ11+1","v":15},null,{"$f":"AS11+1","v":16},null,{"$f":"AU11+1","v":17},null,{"$f":"AW11+1","v":18},null,{"$f":"AY11+1","v":19},null,{"$f":"BA11+1","v":20},null,{"$f":"BC11+1","v":21},null,{"$f":"BE11+1","v":22},null,{"$f":"BG11+1","v":23},null,{"$f":"BI11+1","v":24},null,{"$f":"BK11+1","v":25},null,{"$f":"BM11+1","v":26},null,{"$f":"BO11+1","v":27},null,{"$f":"BQ11+1","v":28},null,{"$f":"BS11+1","v":29},null,{"$f":"BU11+1","v":30},null,{"$f":"BW11+1","v":31},null,{"$f":"BY11+1","v":32},null,{"$f":"CA11+1","v":33},null,{"$f":"CC11+1","v":34},null,{"$f":"CE11+1","v":35},null,{"$f":"CG11+1","v":36},null,{"$f":"CI11+1","v":37},null,{"$f":"CK11+1","v":38},null,{"$f":"CM11+1","v":39},null,{"$f":"CO11+1","v":40},null,{"$f":"CQ11+1","v":41},null,{"$f":"CS11+1","v":42},null,{"$f":"CU11+1","v":43},null,{"$f":"CW11+1","v":44},null,{"$f":"CY11+1","v":45},null,{"$f":"DA11+1","v":46},null,{"$f":"DC11+1","v":47},null,{"$f":"DE11+1","v":48},null,{"$f":"DG11+1","v":49},null,{"$f":"DI11+1","v":50},null,{"$f":"DK11+1","v":51},null,{"$f":"DM11+1","v":52},null,{"$f":"DO11+1","v":53},null,{"$f":"DQ11+1","v":54},null,{"$f":"DS11+1","v":55},null,{"$f":"DU11+1","v":56},null,{"$f":"DW11+1","v":57},null,{"$f":"DY11+1","v":58},null,{"$f":"EA11+1","v":59},null,{"$f":"EC11+1","v":60}]
[]
[null,null,null,null,null,null,null,null,null,null,null,null,null,null,null,null,{"$f":"SUM(R12:R61)","v":0},null,{"$f":"SUM(T12:T61)","v":0},null,{"$f":"SUM(V12:V61)","v":0},null,{"$f":"SUM(X12:X61)","v":0},null,{"$f":"SUM(Z12:Z61)","v":0},null,{"$f":"SUM(AB12:AB61)","v":0},null,{"$f":"SUM(AD12:AD61)","v":0},null,{"$f":"SUM(AF12:AF61)","v":0},null,{"$f":"SUM(AH12:AH61)","v":0},null,{"$f":"SUM(AJ12:AJ61)","v":0},null,{"$f":"SUM(AL12:AL61)","v":0},null,{"$f":"SUM(AN12:AN61)","v":0},null,{"$f":"SUM(AP12:AP61)","v":0},null,{"$f":"SUM(AR12:AR61)","v":0},null,{"$f":"SUM(AT12:AT61)","v":0},null,{"$f":"SUM(AV12:AV61)","v":0},null,{"$f":"SUM(AX12:AX61)","v":0},null,{"$f":"SUM(AZ12:AZ61)","v":0},null,{"$f":"SUM(BB12:BB61)","v":0},null,{"$f":"SUM(BD12:BD61)","v":0},null,{"$f":"SUM(BF12:BF61)","v":0},null,{"$f":"SUM(BH12:BH61)","v":0},null,{"$f":"SUM(BJ12:BJ61)","v":0},null,{"$f":"SUM(BL12:BL61)","v":0},null,{"$f":"SUM(BN12:BN61)","v":0},null,{"$f":"SUM(BP12:BP61)","v":0},null,{"$f":"SUM(BR12:BR61)","v":0},null,{"$f":"SUM(BT12:BT61)","v":0},null,{"$f":"SUM(BV12:BV61)","v":0},null,{"$f":"SUM(BX12:BX61)","v":0},null,{"$f":"SUM(BZ12:BZ61)","v":0},null,{"$f":"SUM(CB12:CB61)","v":0},null,{"$f":"SUM(CD12:CD61)","v":0},null,{"$f":"SUM(CF12:CF61)","v":0},null,{"$f":"SUM(CH12:CH61)","v":0},null,{"$f":"SUM(CJ12:CJ61)","v":0},null,{"$f":"SUM(CL12:CL61)","v":0},null,{"$f":"SUM(CN12:CN61)","v":0},null,{"$f":"SUM(CP12:CP61)","v":0},null,{"$f":"SUM(CR12:CR61)","v":0},null,{"$f":"SUM(CT12:CT61)","v":0},null,{"$f":"SUM(CV12:CV61)","v":0},null,{"$f":"SUM(CX12:CX61)","v":0},null,{"$f":"SUM(CZ12:CZ61)","v":0},null,{"$f":"SUM(DB12:DB61)","v":0},null,{"$f":"SUM(DD12:DD61)","v":0},null,{"$f":"SUM(DF12:DF61)","v":0},null,{"$f":"SUM(DH12:DH61)","v":0},null,{"$f":"SUM(DJ12:DJ61)","v":0},null,{"$f":"SUM(DL12:DL61)","v":0},null,{"$f":"SUM(DN12:DN61)","v":0},null,{"$f":"SUM(DP12:DP61)","v":0},null,{"$f":"SUM(DR12:DR61)","v":0},null,{"$f":"SUM(DT12:DT61)","v":0},null,{"$f":"SUM(DV12:DV61)","v":0},null,{"$f":"SUM(DX12:DX61)","v":0},null,{"$f":"SUM(DZ12:DZ61)","v":0},null,{"$f":"SUM(EB12:EB61)","v":0},null,{"$f":"SUM(ED12:ED61)","v":0},null,{"$f":"SUM(EF12:EF61)","v":0}]
[null,null,"CATEGORIAS",null,"QUANTIDADE"]
[null,null,null,null,null,null,null,null,null,null,null,null,null,null,null,null,{"$f":"IF($C15=Q$11,1,0)","v":0},null,{"$f":"IF($C15=S$11,1,0)","v":0},null,{"$f":"IF($C15=U$11,1,0)","v":0},null,{"$f":"IF($C15=W$11,1,0)","v":0},null,{"$f":"IF($C15=Y$11,1,0)","v":0},null,{"$f":"IF($C15=AA$11,1,0)","v":0},null,{"$f":"IF($C15=AC$11,1,0)","v":0},null,{"$f":"IF($C15=AE$11,1,0)","v":0},null,{"$f":"IF($C15=AG$11,1,0)","v":0},null,{"$f":"IF($C15=AI$11,1,0)","v":0},null,{"$f":"IF($C15=AK$11,1,0)","v":0},null,{"$f":"IF($C15=AM$11,1,0)","v":0},null,{"$f":"IF($C15=AO$11,1,0)","v":0},null,{"$f":"IF($C15=AQ$11,1,0)","v":0},null,{"$f":"IF($C15=AS$11,1,0)","v":0},null,{"$f":"IF($C15=AU$11,1,0)","v":0},null,{"$f":"IF($C15=AW$11,1,0)","v":0},null,{"$f":"IF($C15=AY$11,1,0)","v":0},null,{"$f":"IF($C15=BA$11,1,0)","v":0},null,{"$f":"IF($C15=BC$11,1,0)","v":0},null,{"$f":"IF($C15=BE$11,1,0)","v":0},null,{"$f":"IF($C15=BG$11,1,0)","v":0},null,{"$f":"IF($C15=BI$11,1,0)","v":0},null,{"$f":"IF($C15=BK$11,1,0)","v":0},null,{"$f":"IF($C15=BM$11,1,0)","v":0},null,{"$f":"IF($C15=BO$11,1,0)","v":0},null,{"$f":"IF($C15=BQ$11,1,0)","v":0},null,{"$f":"IF($C15=BS$11,1,0)","v":0},null,{"$f":"IF($C15=BU$11,1,0)","v":0},null,{"$f":"IF($C15=BW$11,1,0)","v":0},null,{"$f":"IF($C15=BY$11,1,0)","v":0},null,{"$f":"IF($C15=CA$11,1,0)","v":0},null,{"$f":"IF($C15=CC$11,1,0)","v":0},null,{"$f":"IF($C15=CE$11,1,0)","v":0},null,{"$f":"IF($C15=CG$11,1,0)","v":0},null,{"$f":"IF($C15=CI$11,1,0)","v":0},null,{"$f":"IF($C15=CK$11,1,0)","v":0},null,{"$f":"IF($C15=CM$11,1,0)","v":0},null,{"$f":"IF($C15=CO$11,1,0)","v":0},null,{"$f":"IF($C15=CQ$11,1,0)","v":0},null,{"$f":"IF($C15=CS$11,1,0)","v":0},null,{"$f":"IF($C15=CU$11,1,0)","v":0},null,{"$f":"IF($C15=CW$11,1,0)","v":0},null,{"$f":"IF($C15=CY$11,1,0)","v":0},null,{"$f":"IF($C15=DA$11,1,0)","v":0},null,{"$f":"IF($C15=DC$11,1,0)","v":0},null,{"$f":"IF($C15=DE$11,1,0)","v":0},null,{"$f":"IF($C15=DG$11,1,0)","v":0},null,{"$f":"IF($C15=DI$11,1,0)","v":0},null,{"$f":"IF($C15=DK$11,1,0)","v":0},null,{"$f":"IF($C15=DM$11,1,0)","v":0},null,{"$f":"IF($C15=DO$11,1,0)","v":0},null,{"$f":"IF($C15=DQ$11,1,0)","v":0},null,{"$f":"IF($C15=DS$11,1,0)","v":0},null,{"$f":"IF($C15=DU$11,1,0)","v":0},null,{"$f":"IF($C15=DW$11,1,0)","v":0},null,{"$f":"IF($C15=DY$11,1,0)","v":0},null,{"$f":"IF($C15=EA$11,1,0)","v":0},null,{"$f":"IF($C15=EC$11,1,0)","v":0},null,{"$f":"IF($C15=EE$11,1,0)","v":0}]
[null,null,null,{"$f":"HLOOKUP($C16,'Dados Gerais'!$D$5:$BK$10,6)","v":{"$error":"#N/A"}},{"$f":"HLOOKUP($C16,'Dados Gerais'!$D$5:$BK$14,10)","v":{"$error":"#N/A"}},null,null,null,null,null,null,null,null,null,null,null,{"$f":"IF($C16=Q$11,1,0)","v":0},null,{"$f":"IF($C16=S$11,1,0)","v":0},null,{"$f":"IF($C16=U$11,1,0)","v":0},null,{"$f":"IF($C16=W$11,1,0)","v":0},null,{"$f":"IF($C16=Y$11,1,0)","v":0},null,{"$f":"IF($C16=AA$11,1,0)","v":0},null,{"$f":"IF($C16=AC$11,1,0)","v":0},null,{"$f":"IF($C16=AE$11,1,0)","v":0},null,{"$f":"IF($C16=AG$11,1,0)","v":0},null,{"$f":"IF($C16=AI$11,1,0)","v":0},null,{"$f":"IF($C16=AK$11,1,0)","v":0},null,{"$f":"IF($C16=AM$11,1,0)","v":0},null,{"$f":"IF($C16=AO$11,1,0)","v":0},null,{"$f":"IF($C16=AQ$11,1,0)","v":0},null,{"$f":"IF($C16=AS$11,1,0)","v":0},null,{"$f":"IF($C16=AU$11,1,0)","v":0},null,{"$f":"IF($C16=AW$11,1,0)","v":0},null,{"$f":"IF($C16=AY$11,1,0)","v":0},null,{"$f":"IF($C16=BA$11,1,0)","v":0},null,{"$f":"IF($C16=BC$11,1,0)","v":0},null,{"$f":"IF($C16=BE$11,1,0)","v":0},null,{"$f":"IF($C16=BG$11,1,0)","v":0},null,{"$f":"IF($C16=BI$11,1,0)","v":0},null,{"$f":"IF($C16=BK$11,1,0)","v":0},null,{"$f":"IF($C16=BM$11,1,0)","v":0},null,{"$f":"IF($C16=BO$11,1,0)","v":0},null,{"$f":"IF($C16=BQ$11,1,0)","v":0},null,{"$f":"IF($C16=BS$11,1,0)","v":0},null,{"$f":"IF($C16=BU$11,1,0)","v":0},null,{"$f":"IF($C16=BW$11,1,0)","v":0},null,{"$f":"IF($C16=BY$11,1,0)","v":0},null,{"$f":"IF($C16=CA$11,1,0)","v":0},null,{"$f":"IF($C16=CC$11,1,0)","v":0},null,{"$f":"IF($C16=CE$11,1,0)","v":0},null,{"$f":"IF($C16=CG$11,1,0)","v":0},null,{"$f":"IF($C16=CI$11,1,0)","v":0},null,{"$f":"IF($C16=CK$11,1,0)","v":0},null,{"$f":"IF($C16=CM$11,1,0)","v":0},null,{"$f":"IF($C16=CO$11,1,0)","v":0},null,{"$f":"IF($C16=CQ$11,1,0)","v":0},null,{"$f":"IF($C16=CS$11,1,0)","v":0},null,{"$f":"IF($C16=CU$11,1,0)","v":0},null,{"$f":"IF($C16=CW$11,1,0)","v":0},null,{"$f":"IF($C16=CY$11,1,0)","v":0},null,{"$f":"IF($C16=DA$11,1,0)","v":0},null,{"$f":"IF($C16=DC$11,1,0)","v":0},null,{"$f":"IF($C16=DE$11,1,0)","v":0},null,{"$f":"IF($C16=DG$11,1,0)","v":0},null,{"$f":"IF($C16=DI$11,1,0)","v":0},null,{"$f":"IF($C16=DK$11,1,0)","v":0},null,{"$f":"IF($C16=DM$11,1,0)","v":0},null,{"$f":"IF($C16=DO$11,1,0)","v":0},null,{"$f":"IF($C16=DQ$11,1,0)","v":0},null,{"$f":"IF($C16=DS$11,1,0)","v":0},null,{"$f":"IF($C16=DU$11,1,0)","v":0},null,{"$f":"IF($C16=DW$11,1,0)","v":0},null,{"$f":"IF($C16=DY$11,1,0)","v":0},null,{"$f":"IF($C16=EA$11,1,0)","v":0},null,{"$f":"IF($C16=EC$11,1,0)","v":0},null,{"$f":"IF($C16=EE$11,1,0)","v":0}]
[null,null,null,null,null,null,null,null,null,null,null,null,null,null,null,null,{"$f":"IF($C17=Q$11,1,0)","v":0},null,{"$f":"IF($C17=S$11,1,0)","v":0},null,{"$f":"IF($C17=U$11,1,0)","v":0},null,{"$f":"IF($C17=W$11,1,0)","v":0},null,{"$f":"IF($C17=Y$11,1,0)","v":0},null,{"$f":"IF($C17=AA$11,1,0)","v":0},null,{"$f":"IF($C17=AC$11,1,0)","v":0},null,{"$f":"IF($C17=AE$11,1,0)","v":0},null,{"$f":"IF($C17=AG$11,1,0)","v":0},null,{"$f":"IF($C17=AI$11,1,0)","v":0},null,{"$f":"IF($C17=AK$11,1,0)","v":0},null,{"$f":"IF($C17=AM$11,1,0)","v":0},null,{"$f":"IF($C17=AO$11,1,0)","v":0},null,{"$f":"IF($C17=AQ$11,1,0)","v":0},null,{"$f":"IF($C17=AS$11,1,0)","v":0},null,{"$f":"IF($C17=AU$11,1,0)","v":0},null,{"$f":"IF($C17=AW$11,1,0)","v":0},null,{"$f":"IF($C17=AY$11,1,0)","v":0},null,{"$f":"IF($C17=BA$11,1,0)","v":0},null,{"$f":"IF($C17=BC$11,1,0)","v":0},null,{"$f":"IF($C17=BE$11,1,0)","v":0},null,{"$f":"IF($C17=BG$11,1,0)","v":0},null,{"$f":"IF($C17=BI$11,1,0)","v":0},null,{"$f":"IF($C17=BK$11,1,0)","v":0},null,{"$f":"IF($C17=BM$11,1,0)","v":0},null,{"$f":"IF($C17=BO$11,1,0)","v":0},null,{"$f":"IF($C17=BQ$11,1,0)","v":0},null,{"$f":"IF($C17=BS$11,1,0)","v":0},null,{"$f":"IF($C17=BU$11,1,0)","v":0},null,{"$f":"IF($C17=BW$11,1,0)","v":0},null,{"$f":"IF($C17=BY$11,1,0)","v":0},null,{"$f":"IF($C17=CA$11,1,0)","v":0},null,{"$f":"IF($C17=CC$11,1,0)","v":0},null,{"$f":"IF($C17=CE$11,1,0)","v":0},null,{"$f":"IF($C17=CG$11,1,0)","v":0},null,{"$f":"IF($C17=CI$11,1,0)","v":0},null,{"$f":"IF($C17=CK$11,1,0)","v":0},null,{"$f":"IF($C17=CM$11,1,0)","v":0},null,{"$f":"IF($C17=CO$11,1,0)","v":0},null,{"$f":"IF($C17=CQ$11,1,0)","v":0},null,{"$f":"IF($C17=CS$11,1,0)","v":0},null,{"$f":"IF($C17=CU$11,1,0)","v":0},null,{"$f":"IF($C17=CW$11,1,0)","v":0},null,{"$f":"IF($C17=CY$11,1,0)","v":0},null,{"$f":"IF($C17=DA$11,1,0)","v":0},null,{"$f":"IF($C17=DC$11,1,0)","v":0},null,{"$f":"IF($C17=DE$11,1,0)","v":0},null,{"$f":"IF($C17=DG$11,1,0)","v":0},null,{"$f":"IF($C17=DI$11,1,0)","v":0},null,{"$f":"IF($C17=DK$11,1,0)","v":0},null,{"$f":"IF($C17=DM$11,1,0)","v":0},null,{"$f":"IF($C17=DO$11,1,0)","v":0},null,{"$f":"IF($C17=DQ$11,1,0)","v":0},null,{"$f":"IF($C17=DS$11,1,0)","v":0},null,{"$f":"IF($C17=DU$11,1,0)","v":0},null,{"$f":"IF($C17=DW$11,1,0)","v":0},null,{"$f":"IF($C17=DY$11,1,0)","v":0},null,{"$f":"IF($C17=EA$11,1,0)","v":0},null,{"$f":"IF($C17=EC$11,1,0)","v":0},null,{"$f":"IF($C17=EE$11,1,0)","v":0}]
[]
[null,null,"PAGAMENTO DA DEPRECIAÇÃO"]
[null,null,"ITEM","DESCRIÇÃO","QUANT ANUAL","CONTA SIAFI","VALOR DE AQ.","% RESIDUAL","VIDA ÚTIL","DEP. MENSAL","CUSTO TOTAL","BDI (%)","PREÇO TOTAL","FONTE","REFERÊNCIA"]
[]
[null,null,null,null,null,null,null,null,null,{"$f":"G22*(1-H22)/(I22*12)","v":{"$error":"#DIV/0!"}},{"$f":"J22*E22","v":{"$error":"#DIV/0!"}},{"$f":"BDI!E26","v":0.21690000000000001},{"$f":"ROUND(K22*(1+L22),2)","v":{"$error":"#DIV/0!"}},"COTAÇÃO"]
[]
[]
[null,null,"PAGAMENTO DA MANUTENÇÃO"]
[null,null,"ITEM","DESCRIÇÃO",null,null,null,"K (calculado)","MENSAL DEPR.","% MAN X DEP","MENSAL MAN.","BDI (%)","PREÇO TOTAL"]
[]
[null,null,null,null,null,null,null,{"$f":"H35","v":0.23950080000000007},{"$f":"M22","v":{"$error":"#DIV/0!"}},{"$f":"H28","v":0.23950080000000007},{"$f":"I28*H28","v":{"$error":"#DIV/0!"}},{"$f":"L22","v":0.21690000000000001},{"$f":"ROUND(K28*(1+L28),2)","v":{"$error":"#DIV/0!"}}]
[]
[null,null,null,null,"K1","K2","K3","K4"]
[null,null,null,null,1,1,0.8,0.8]
[null,null,null,null,"K5","K6","K7","K8"]
[null,null,null,null,1,0.6,0.5,1.1000000000000001]
[null,null,null,null,"K9","K10","K11","RESULTADO"]
[null,null,null,"* a descrição de cada coeficiente segue abaixo",0.9,0.9,1.4,{"$f":"E31*F31*G31*H31*E33*F33*G33*H33*E35*F35*G35","v":0.23950080000000007}]
[]
[]
[null,null,"MATERIAL DE CONSUMO ASSOCIADO"]
[null,null,"ITEM","DESCRIÇÃO",null,null,null,"QUANTID/ANO","UNIDADE","VALOR DE AQ.","MENSAL MAT","BDI (%)","PREÇO TOTAL"]
[]
[null,null,null,null,null,null,null,null,null,null,{"$f":"J41*H41/12","v":0},{"$f":"L28","v":0.21690000000000001},{"$f":"ROUND(K41*(1+L41),2)","v":0}]
[]
[]
[null,null,"MATERIAL DE CONSUMO ASSOCIADO"]
[null,null,"ITEM","DESCRIÇÃO",null,null,null,null,null,null,null,null,"PREÇO TOTAL"]
[]
[null,null,1,"Componente DEPRECIAÇÃO - POR POSTO",null,null,null,null,null,null,null,null,{"$f":"M22","v":{"$error":"#DIV/0!"}}]
[null,null,2,"Componente MANUTENÇÃO - POR POSTO",null,null,null,null,null,null,null,null,{"$f":"M28","v":{"$error":"#DIV/0!"}}]
[null,null,3,"Componente MATERIAL DE CONSUMO ASSOCIADO - POR POSTO",null,null,null,null,null,null,null,null,{"$f":"M41","v":0}]
[]
[null,null,null,null,null,null,null,null,null,null,null,"SOMATÓRIO TOTAL MENSAL - POR POSTO",{"$f":"SUM(M46:M50)","v":{"$error":"#DIV/0!"}},null,null,null,null,{"$f":"IF(SUM(Q$15:Q$17)>0,$M51,0)","v":0},null,{"$f":"IF(SUM(S$15:S$17)>0,$M51,0)","v":0},null,{"$f":"IF(SUM(U$15:U$17)>0,$M51,0)","v":0},null,{"$f":"IF(SUM(W$15:W$17)>0,$M51,0)","v":0},null,{"$f":"IF(SUM(Y$15:Y$17)>0,$M51,0)","v":0},null,{"$f":"IF(SUM(AA$15:AA$17)>0,$M51,0)","v":0},null,{"$f":"IF(SUM(AC$15:AC$17)>0,$M51,0)","v":0},null,{"$f":"IF(SUM(AE$15:AE$17)>0,$M51,0)","v":0},null,{"$f":"IF(SUM(AG$15:AG$17)>0,$M51,0)","v":0},null,{"$f":"IF(SUM(AI$15:AI$17)>0,$M51,0)","v":0},null,{"$f":"IF(SUM(AK$15:AK$17)>0,$M51,0)","v":0},null,{"$f":"IF(SUM(AM$15:AM$17)>0,$M51,0)","v":0},null,{"$f":"IF(SUM(AO$15:AO$17)>0,$M51,0)","v":0},null,{"$f":"IF(SUM(AQ$15:AQ$17)>0,$M51,0)","v":0},null,{"$f":"IF(SUM(AS$15:AS$17)>0,$M51,0)","v":0},null,{"$f":"IF(SUM(AU$15:AU$17)>0,$M51,0)","v":0},null,{"$f":"IF(SUM(AW$15:AW$17)>0,$M51,0)","v":0},null,{"$f":"IF(SUM(AY$15:AY$17)>0,$M51,0)","v":0},null,{"$f":"IF(SUM(BA$15:BA$17)>0,$M51,0)","v":0},null,{"$f":"IF(SUM(BC$15:BC$17)>0,$M51,0)","v":0},null,{"$f":"IF(SUM(BE$15:BE$17)>0,$M51,0)","v":0},null,{"$f":"IF(SUM(BG$15:BG$17)>0,$M51,0)","v":0},null,{"$f":"IF(SUM(BI$15:BI$17)>0,$M51,0)","v":0},null,{"$f":"IF(SUM(BK$15:BK$17)>0,$M51,0)","v":0},null,{"$f":"IF(SUM(BM$15:BM$17)>0,$M51,0)","v":0},null,{"$f":"IF(SUM(BO$15:BO$17)>0,$M51,0)","v":0},null,{"$f":"IF(SUM(BQ$15:BQ$17)>0,$M51,0)","v":0},null,{"$f":"IF(SUM(BS$15:BS$17)>0,$M51,0)","v":0},null,{"$f":"IF(SUM(BU$15:BU$17)>0,$M51,0)","v":0},null,{"$f":"IF(SUM(BW$15:BW$17)>0,$M51,0)","v":0},null,{"$f":"IF(SUM(BY$15:BY$17)>0,$M51,0)","v":0},null,{"$f":"IF(SUM(CA$15:CA$17)>0,$M51,0)","v":0},null,{"$f":"IF(SUM(CC$15:CC$17)>0,$M51,0)","v":0},null,{"$f":"IF(SUM(CE$15:CE$17)>0,$M51,0)","v":0},null,{"$f":"IF(SUM(CG$15:CG$17)>0,$M51,0)","v":0},null,{"$f":"IF(SUM(CI$15:CI$17)>0,$M51,0)","v":0},null,{"$f":"IF(SUM(CK$15:CK$17)>0,$M51,0)","v":0},null,{"$f":"IF(SUM(CM$15:CM$17)>0,$M51,0)","v":0},null,{"$f":"IF(SUM(CO$15:CO$17)>0,$M51,0)","v":0},null,{"$f":"IF(SUM(CQ$15:CQ$17)>0,$M51,0)","v":0},null,{"$f":"IF(SUM(CS$15:CS$17)>0,$M51,0)","v":0},null,{"$f":"IF(SUM(CU$15:CU$17)>0,$M51,0)","v":0},null,{"$f":"IF(SUM(CW$15:CW$17)>0,$M51,0)","v":0},null,{"$f":"IF(SUM(CY$15:CY$17)>0,$M51,0)","v":0},null,{"$f":"IF(SUM(DA$15:DA$17)>0,$M51,0)","v":0},null,{"$f":"IF(SUM(DC$15:DC$17)>0,$M51,0)","v":0},null,{"$f":"IF(SUM(DE$15:DE$17)>0,$M51,0)","v":0},null,{"$f":"IF(SUM(DG$15:DG$17)>0,$M51,0)","v":0},null,{"$f":"IF(SUM(DI$15:DI$17)>0,$M51,0)","v":0},null,{"$f":"IF(SUM(DK$15:DK$17)>0,$M51,0)","v":0},null,{"$f":"IF(SUM(DM$15:DM$17)>0,$M51,0)","v":0},null,{"$f":"IF(SUM(DO$15:DO$17)>0,$M51,0)","v":0},null,{"$f":"IF(SUM(DQ$15:DQ$17)>0,$M51,0)","v":0},null,{"$f":"IF(SUM(DS$15:DS$17)>0,$M51,0)","v":0},null,{"$f":"IF(SUM(DU$15:DU$17)>0,$M51,0)","v":0},null,{"$f":"IF(SUM(DW$15:DW$17)>0,$M51,0)","v":0},null,{"$f":"IF(SUM(DY$15:DY$17)>0,$M51,0)","v":0},null,{"$f":"IF(SUM(EA$15:EA$17)>0,$M51,0)","v":0},null,{"$f":"IF(SUM(EC$15:EC$17)>0,$M51,0)","v":0},null,{"$f":"IF(SUM(EE$15:EE$17)>0,$M51,0)","v":0}]
[null,null,null,null,null,null,null,null,null,null,null,"SOMATÓRIO TOTAL ANUAL - POR POSTO",{"$f":"M51*12","v":{"$error":"#DIV/0!"}}]
[]
[]
[null,null,"MATERIAL DE CONSUMO ASSOCIADO"]
[null,null,"MEMÓRIA DE CÁLCULO DO COEFICIENTE DE CORRELAÇÃO MANUTENÇÃO X DEPRECIAÇÃO (K)"]
[]
[null,null,"JUSTIFICATIVAS",null,"TIPO","K1",null,"Condições de Trab","K4",null,"Tempo Vida (anos)","K6",null,"Temperatura","K8"]
[null,null,null,null,"Guindaste",0.5,null,"Em espera",0.4,null,1,0.6,null,"Muito quente (> 40º C)",1.3]
[null,null,"K1","Arbitrado 1","Caminhão-comum",0.8,null,"Leves",0.8,null,2,0.7,null,"Quente (30º a 40º C)",1.1000000000000001]
[null,null,"K2","Considerado o operador médio","Fora-de-estrada",1,null,"Médias",1,null,3,0.8,null,"Médio (10º a 30º C)",1]
[null,null,"K3","Consideradas ferramentas de primeira qualidade","Carregadeira",1,null,"Pesadas",1.4,null,4,0.9,null,"Frio (< 10º C)",1.2]
[null,null,"K4","Consições leves","Escavadeira",1.4,null,"Severas",2,null,5,1]
[null,null,"K5","Considerando manutenção normal","Motoescrêiper",1.1000000000000001,null,null,null,null,6,1,null,"Ritmo de Trabalho","K9"]
[null,null,"K6","Equipamentos novos","Trator de esteira",1.2,null,"Manutenção","K5",null,7,1,null,"Folgado",0.9]
[null,null,"K7","220h por mês, 252 dias por ano",null,null,null,"Excelente",0.6,null,8,1.2,null,"Médio ",1]
[null,null,"K8","Clima quente, acima de 30º C","Qualid do Operador","K2",null,"Boa",0.8,null,9,1.3,null,"Com pressa",1.5]
[null,null,"K9","Ritmo de trabalho usualmente folgado","Excelente",0.8,null,"Média",1,null,10,1.4]
[null,null,"K10","Considerado o operador médio","Boa",0.9,null,"Ruim ",1.5,null,11,2,null,"Conh do Serviço","K10"]
[null,null,"K11","Foi considerada a opção de aluguel a terceiros, ainda que a simulação seja dos custos do contratado, contudo a execução dos serviços é em local de terceiros","Média",1,null,"Inexistente",3,null,15,2,null,"Grande ",0.8]
[null,null,null,null,"Ruim",1.2,null,null,null,null,null,null,null,"Médio     ",0.9]
[null,null,null,null,"Péssima",2,null,"Horas de Uso ","K7",6000,1,null,null,"Pouco ",1]
[null,null,null,null,null,null,null,1000,0.5,8000,1.3]
[null,null,null,null,"Qualidade do Equip","K3",null,2000,0.5,10000,1.6,null,null,"Tipo do Serviço","K11"]
[null,null,null,null,"De primeira",0.8,null,3000,0.6,12000,1.9,null,null,"Mina ou Pedreira",0.8]
[null,null,null,null,"Média",1,null,4000,0.7,15000,2.2999999999999998,null,null,"Construção Geral",1]
[null,null,null,null,"Ruim",1.5,null,5000,0.9,20000,3,null,null,"Aluguel a Terceiros",1.4]
[]
[null,null,null,null,"Fonte: "]
[null,null,null,null,"MATTOS, Aldo Dórea. Como preparar orçamentos de obras. São Paulo: Pini, 2006. 281 p., il"]

{"sheet":"Não Rel - Depr","index":21,"n_rows":90,"n_cols":15,"rows_kept":90,"cut":false,"hidden":false,"merged":[[2,1,2,3],[3,1,3,14]]}
[]
[]
[]
[null,"EQUIPAMENTOS NÃO RELACIONADOS DIRETAMENTE A UM POSTO DE TRABALHO - PAGAMENTO DA DEPRECIAÇÃO / MANUTENÇÃO"]
[]
[]
[null,null,"PAGAMENTO DA DEPRECIAÇÃO"]
[null,null,"ITEM","DESCRIÇÃO","QUANT ANUAL","CONTA SIAFI","VALOR DE AQ.","% RESIDUAL","VIDA ÚTIL","DEP. MENSAL","CUSTO TOTAL","BDI (%)","PREÇO TOTAL","FONTE","REFERÊNCIA"]
[]
[null,null,1,"Aspirador Industrial Água e Pó (ref. Eletrolux GT 3000 PRO, Compact 320 da Soteco ou similar)",16,"12311.01.25",577.94666666666672,0.1,10,{"$f":"G10*(1-H10)/(I10*12)","v":4.3346},{"$f":"J10*E10","v":69.3536},{"$f":"BDI!$E$26","v":0.21690000000000001},{"$f":"ROUND(K10*(1+L10),2)","v":84.4},"COTAÇÃO"]
[null,null,{"$f":"C10+1","v":2},"Aspirador com elemento filtrante a base de combinação do separador com água (ref. Pró-Áqua ou similar).",2,"12311.01.25",7490,0.1,10,{"$f":"G11*(1-H11)/(I11*12)","v":56.174999999999997},{"$f":"J11*E11","v":112.35},{"$f":"BDI!$E$26","v":0.21690000000000001},{"$f":"ROUND(K11*(1+L11),2)","v":136.72},"COTAÇÃO"]
[null,null,{"$f":"C11+1","v":3},"Carrinho Funcional para Limpeza (ref. TTS 380 S completo, Tomki 1021 ou similar)",14,"12311.01.25",2611.5500000000002,0.1,10,19.586625000000005,274.21275000000009,{"$f":"BDI!$E$26","v":0.21690000000000001},333.69,"COTAÇÃO"]
[null,null,4,"Carro Container p/ Coleta de Lixo cap.120 litros, com 02 rodízios pneumáticos (ref. Soluvam, Contenur C-120, Rubbermaid, Fiberglass ou similar)",6,"12311.01.25",371.09000000000003,0.1,10,2.7831750000000004,16.699050000000003,{"$f":"BDI!$E$26","v":0.21690000000000001},20.32,"COTAÇÃO"]
[null,null,5,"Carro Container p/ Coleta de Lixo cap. 600 litros com 02 rodízios pneumáticos (ref. Soluvam, Contenur, Rubbermaid, Fiberglass ou similar)",8,"12311.01.25",1782.45,0.1,10,13.368375000000002,106.94700000000002,{"$f":"BDI!$E$26","v":0.21690000000000001},130.13999999999999,"COTAÇÃO"]
[null,null,6,"Carro plataforma para transporte de materiais (ref. Marcon TM 52, Rubbermaid, Fiberglass ou similar)",4,"12311.01.25",1221.0505000000001,0.1,10,9.1578787500000018,36.631515000000007,{"$f":"BDI!$E$26","v":0.21690000000000001},44.58,"COTAÇÃO"]
[null,null,7,"Enceradeira Industrial Grande 510MM (ref. Bandeirante, Karcher, Cleaner ou similar)",5,"12311.01.25",2713.8249999999998,0.1,10,20.353687499999999,101.7684375,{"$f":"BDI!$E$26","v":0.21690000000000001},123.84,"COTAÇÃO"]
[null,null,8,"Enceradeira Industrial Média 410MM (ref. Bandeirante, Karcher, Cleaner ou similar)",12,"12311.01.25",2630.6,0.1,10,19.729499999999998,236.75399999999996,{"$f":"BDI!$E$26","v":0.21690000000000001},288.11,"COTAÇÃO"]
[null,null,9,"Enceradeira Industrial Pequena 350MM (ref. Bandeirante, Karcher, Cleaner ou similar)",3,"12311.01.25",1716.5,0.1,10,12.873750000000001,38.621250000000003,{"$f":"BDI!$E$26","v":0.21690000000000001},47,"COTAÇÃO"]
[null,null,10,"Escada em Alumínio com 4 degraus (ref. Aluleve, Artfactory ou similar)",7,"12311.01.25",118.32499999999999,0.1,10,0.88743749999999999,6.2120625,{"$f":"BDI!$E$26","v":0.21690000000000001},7.56,"COTAÇÃO"]
[null,null,11,"Escada em Alumínio com 6 degraus (ref. Alulev, Art Factory ou similar)",4,"12311.01.25",179.94499999999999,0.1,10,1.3495874999999999,5.3983499999999998,{"$f":"BDI!$E$26","v":0.21690000000000001},6.57,"COTAÇÃO"]
[null,null,12,"Escada em Alumínio com 16 degraus (ref. Alulev, Art Factory ou similar)",1,"12311.01.25",830.04,0.1,10,6.2252999999999998,6.2252999999999998,{"$f":"BDI!$E$26","v":0.21690000000000001},7.58,"COTAÇÃO"]
[null,null,13,"Lavadora e Secadora Automática de Piso (ref. Plataforma LST 51B, Johnson Diversey Aquamat, Comac Simpla 45 E/45 B ou similar)",2,"12311.01.25",15733.275,0.1,10,117.9995625,235.99912499999999,{"$f":"BDI!$E$26","v":0.21690000000000001},287.19,"COTAÇÃO"]
[null,null,14,"Lavadora de alta pressão (ref. Wap L-2600, L-2800, Eletrolux ou similar)",1,"12311.01.25",13552.11,0.1,10,101.64082500000001,101.64082500000001,{"$f":"BDI!$E$26","v":0.21690000000000001},123.69,"COTAÇÃO"]
[null,null,15,"Lavadora extratora para carpete tanque expansível 38 litros (ref. Tennant Lavadora 1240",1,"12311.01.25",2718.7650000000003,0.1,10,20.390737500000004,20.390737500000004,{"$f":"BDI!$E$26","v":0.21690000000000001},24.81,"COTAÇÃO"]
[null,null,16,"Limpadora a Vapor de Aquecimento Rápido (ref. Sky Wap max, Karcher ou similar)",4,"12311.01.25",1348.56,0.1,10,10.1142,40.456800000000001,{"$f":"BDI!$E$26","v":0.21690000000000001},49.23,"COTAÇÃO"]
[null,null,17,"Lustradora Ultra Speed (ref. Platinum UHS 1600 da Plataforma, Eletrolux ou similar)",2,"12311.01.25",7236.85,0.1,10,54.276375000000009,108.55275000000002,{"$f":"BDI!$E$26","v":0.21690000000000001},132.1,"COTAÇÃO"]
[null,null,18,"Odorizador automático para sanitários, com refis e pilhas (ref. Columbus Brasil ou similar)",60,"12311.01.25",82.504999999999995,0.1,10,0.61878749999999993,37.127249999999997,{"$f":"BDI!$E$26","v":0.21690000000000001},45.18,"COTAÇÃO"]
[null,null,19,"Pulverizador costal, com aplicador regulável, capacidade 20 litros (ref. Vonder ou similar)",4,"12311.01.25",147.22,0.1,10,1.10415,4.4165999999999999,{"$f":"BDI!$E$26","v":0.21690000000000001},5.37,"COTAÇÃO"]
[null,null,20,"Rodo aspirador p/ pisos (ref. Floor VAC 1500 da Wap ou similar)",2,"12311.01.25",4160.92,0.1,10,31.206900000000001,62.413800000000002,{"$f":"BDI!$E$26","v":0.21690000000000001},75.95,"COTAÇÃO"]
[null,null,21,"Varredora coletora para estacionamento (ref. Eureka Picobello 151 ou Karcher T500 ou similar)",2,"12311.01.25",4967.5,0.1,10,37.256250000000001,74.512500000000003,{"$f":"BDI!$E$26","v":0.21690000000000001},90.67,"COTAÇÃO"]
[null,null,22,"Cabo extensor em alumínio, 4 metros",4,"12311.01.25",135.745,0.1,10,1.0180875,4.0723500000000001,{"$f":"BDI!$E$26","v":0.21690000000000001},4.96,"COTAÇÃO"]
[null,null,23,"Soprador de folhas à bateria (ref. Makita – DUB-185z ou similar",2,"12311.01.25",552.02,0.1,10,4.1401500000000002,8.2803000000000004,{"$f":"BDI!$E$26","v":0.21690000000000001},10.08,"COTAÇÃO"]
[]
[]
[null,null,"PAGAMENTO DA MANUTENÇÃO"]
[null,null,"ITEM","DESCRIÇÃO",null,null,null,"K (calculado)","MENSAL DEPR.","% MAN X DEP","MENSAL MAN.","BDI (%)","PREÇO TOTAL"]
[]
[null,null,null,null,null,null,null,{"$f":"H45","v":0.42411600000000005},{"$f":"SUM(K10:K32)","v":1709.0363525},{"$f":"H38","v":0.42411600000000005},{"$f":"I38*H38","v":724.82966167689005},{"$f":"BDI!E26","v":0.21690000000000001},{"$f":"ROUND(K38*(1+L38),2)","v":882.05}]
[]
[null,null,null,null,"K1","K2","K3","K4"]
[null,null,null,null,0.85,1,0.8,1]
[null,null,null,null,"K5","K6","K7","K8"]
[null,null,null,null,1,0.6,0.5,1.1000000000000001]
[null,null,null,null,"K9","K10","K11","RESULTADO"]
[null,null,null,"* a descrição de cada coeficiente segue abaixo",1.5,0.9,1.4,{"$f":"E41*F41*G41*H41*E43*F43*G43*H43*E45*F45*G45","v":0.42411600000000005}]
[]
[]
[null,null,"MATERIAL DE CONSUMO ASSOCIADO"]
[null,null,"ITEM","DESCRIÇÃO",null,null,null,"QUANTID/ANO","UNIDADE","VALOR DE AQ.","MENSAL MAT","BDI (%)","PREÇO TOTAL"]
[]
[null,null,null,null,null,null,null,null,null,null,{"$f":"J51*H51/12","v":0},{"$f":"BDI!E26","v":0.21690000000000001},{"$f":"ROUND(K51*(1+L51),2)","v":0}]
[]
[null,null,null,null,null,null,null,null,null,null,null,{"$f":"SUM(L8:L51)","v":5.4224999999999985}]
[null,null,"MATERIAL DE CONSUMO ASSOCIADO"]
[null,null,"ITEM","DESCRIÇÃO",null,null,null,null,null,null,null,null,"PREÇO TOTAL"]
[]
[null,null,1,"Componente DEPRECIAÇÃO",null,null,null,null,null,null,null,null,{"$f":"SUM(M10:M32)","v":2079.7399999999998}]
[null,null,2,"Componente MANUTENÇÃO",null,null,null,null,null,null,null,null,{"$f":"M38","v":882.05}]
[null,null,3,"Componente MATERIAL DE CONSUMO ASSOCIADO",null,null,null,null,null,null,null,null,{"$f":"M51","v":0}]
[]
[null,null,null,null,null,null,null,null,null,null,null,"SOMATÓRIO TOTAL MENSAL",{"$f":"SUM(M56:M60)","v":2961.79}]
[null,null,null,null,null,null,null,null,null,null,null,"SOMATÓRIO TOTAL ANUAL",{"$f":"M61*12","v":35541.479999999996}]
[]
[]
[null,null,"MATERIAL DE CONSUMO ASSOCIADO"]
[null,null,"MEMÓRIA DE CÁLCULO DO COEFICIENTE DE CORRELAÇÃO MANUTENÇÃO X DEPRECIAÇÃO (K)"]
[]
[null,null,"JUSTIFICATIVAS",null,"TIPO","K1",null,"Condições de Trab","K4",null,"Tempo Vida (anos)","K6",null,"Temperatura","K8"]
[null,null,null,null,"Guindaste",0.5,null,"Em espera",0.4,null,1,0.6,null,"Muito quente (> 40º C)",1.3]
[null,null,"K1","Considerado o valor médio de 0,85","Caminhão-comum",0.8,null,"Leves",0.8,null,2,0.7,null,"Quente (30º a 40º C)",1.1000000000000001]
[null,null,"K2","Considerado o operador médio","Fora-de-estrada",1,null,"Médias",1,null,3,0.8,null,"Médio (10º a 30º C)",1]
[null,null,"K3","Consideradas ferramentas de primeira qualidade","Carregadeira",1,null,"Pesadas",1.4,null,4,0.9,null,"Frio (< 10º C)",1.2]
[null,null,"K4","Há todo o tipo de trabalho, foi considerado o valor médio","Escavadeira",1.4,null,"Severas",2,null,5,1]
[null,null,"K5","Considerando manutenção normal","Motoescrêiper",1.1000000000000001,null,null,null,null,6,1,null,"Ritmo de Trabalho","K9"]
[null,null,"K6","Equipamentos novos","Trator de esteira",1.2,null,"Manutenção","K5",null,7,1,null,"Folgado",0.9]
[null,null,"K7","220h por mês, 252 dias por ano",null,null,null,"Excelente",0.6,null,8,1.2,null,"Médio ",1]
[null,null,"K8","Clima quente, acima de 30º C","Qualid do Operador","K2",null,"Boa",0.8,null,9,1.3,null,"Com pressa",1.5]
[null,null,"K9","Ritmo de trabalho usualmente com pressa","Excelente",0.8,null,"Média",1,null,10,1.4]
[null,null,"K10","Considerado o operador médio","Boa",0.9,null,"Ruim ",1.5,null,11,2,null,"Conh do Serviço","K10"]
[null,null,"K11","Foi considerada a opção de aluguel a terceiros, ainda que a simulação seja dos custos do contratado, contudo a execução dos serviços é em local de terceiros","Média",1,null,"Inexistente",3,null,15,2,null,"Grande ",0.8]
[null,null,null,null,"Ruim",1.2,null,null,null,null,null,null,null,"Médio     ",0.9]
[null,null,null,null,"Péssima",2,null,"Horas de Uso ","K7",6000,1,null,null,"Pouco ",1]
[null,null,null,null,null,null,null,1000,0.5,8000,1.3]
[null,null,null,null,"Qualidade do Equip","K3",null,2000,0.5,10000,1.6,null,null,"Tipo do Serviço","K11"]
[null,null,null,null,"De primeira",0.8,null,3000,0.6,12000,1.9,null,null,"Mina ou Pedreira",0.8]
[null,null,null,null,"Média",1,null,4000,0.7,15000,2.2999999999999998,null,null,"Construção Geral",1]
[null,null,null,null,"Ruim",1.5,null,5000,0.9,20000,3,null,null,"Aluguel a Terceiros",1.4]
[]
[null,null,null,null,"Fonte: "]
[null,null,null,null,"MATTOS, Aldo Dórea. Como preparar orçamentos de obras. São Paulo: Pini, 2006. 281 p., il"]

{"sheet":"Não Rel - Mat Consumo","index":22,"n_rows":53,"n_cols":14,"rows_kept":53,"cut":false,"hidden":false,"merged":[[2,1,2,4],[3,1,3,13]]}
[]
[]
[]
[null,"MATERIAIS NÃO RELACIONADOS DIRETAMENTE A UM POSTO DE TRABALHO"]
[]
[]
[null,null,"ITEM","CÓDIGO","DESCRIÇÃO","MÉDIA CONSUMO MENSAL","QUANT ANUAL","UNIDADE","CUSTO UNITÁRIO","CUSTO TOTAL ANUAL","BDI (%)","PREÇO TOTAL ANUAL","FONTE","REFERÊNCIA"]
[]
[null,null,1,null,"Água Sanitária",320,{"$f":"F9*12","v":3840},"Litros",2.6269999999999998,{"$f":"I9*G9","v":10087.679999999998},{"$f":"BDI!E26","v":0.21690000000000001},{"$f":"ROUND(J9*(1+K9),2)","v":12275.7},"Cotação"]
[null,null,{"$f":"C9+1","v":2},null,"Álcool líquido com teor ativo 70 %",280,{"$f":"F10*12","v":3360},"Litros",10.425000000000001,{"$f":"I10*G10","v":35028},{"$f":"K9","v":0.21690000000000001},{"$f":"ROUND(J10*(1+K10),2)","v":42625.57},"Cotação"]
[null,null,{"$f":"C10+1","v":3},null,"Base seladora para piso (ref. Selador HS, Twister ou similar)",4,{"$f":"F11*12","v":48},"Galão de 5 litros",55.39,2658.7200000000003,{"$f":"K9","v":0.21690000000000001},3235.4,"Cotação"]
[null,null,4,null,"Brilho Inox em Spray à base de óleo mineral e emulsão de silicone (ref: 3M ou similar)",10,120,"Frasco de 500 ml",70.724999999999994,8487,{"$f":"K10","v":0.21690000000000001},10327.83,"Cotação"]
[null,null,5,null,"Cera líquida (ref. Start Auto Brilho ou similar)",4,{"$f":"F13*12","v":48},"Galão de 5 litros",49.795000000000002,2390.16,{"$f":"K11","v":0.21690000000000001},2908.59,"Cotação"]
[null,null,6,null,"Cera polidora, em pasta p/ metais (ref. Grand Prix ou similar)",2,{"$f":"F14*12","v":24},"Lata 200g",14.65,351.6,{"$f":"K12","v":0.21690000000000001},427.86,"Cotação"]
[null,null,7,null,"Desinfetante concentrado para limpeza em geral (ref. Bryo plus, Girassol ou similar)",50,600,"Galão de 5 litros",15.42,9252,{"$f":"K14","v":0.21690000000000001},11258.76,"Cotação"]
[null,null,8,null,"Desodorizante frasco 400 ml (ref. Bom Ar ou similar)",48,{"$f":"F16*12","v":576},"Frasco de 400 ml",18.049999999999997,10396.799999999999,{"$f":"K15","v":0.21690000000000001},12651.87,"Cotação"]
[null,null,9,null,"Detergente Gel uzu (ref. Girassol Oxi Pró ou similar)",70,{"$f":"F17*12","v":840},"Galão de 5 litros",23.11,19412.399999999998,{"$f":"K16","v":0.21690000000000001},23622.95,"Cotação"]
[null,null,10,null,"Detergente desincrustrante alcalino (ref. Start ou similar)",2,24,"Galão de 5 litros",83.765000000000001,2010.3600000000001,0.21690000000000001,2446.41,"Cotação"]
[null,null,11,null,"Detergente multiuso diluível (ref. Veja, Ajax fresh ou similar)",12,144,"Frasco de 500 ml",6.4049999999999994,922.31999999999994,0.21690000000000001,1122.3699999999999,"Cotação"]
[null,null,12,null,"Disco p/ Polidora High Speed, polidor, restauradora para retirada de marcas, de fibra natural, 510 mm (ref. 3M – pêlo de porco – Restaurador)",2,{"$f":"F20*12","v":24},"Unidade",51.894999999999996,1245.48,0.21690000000000001,1515.62,"Cotação"]
[null,null,13,null,"Disco Removível p/ enceradeira 350 mm (preto, verde, vermelho, amarelo e branco) (ref: 3m ou similar)",3,36,"Unidade",24.462499999999999,880.65,{"$f":"K19","v":0.21690000000000001},1071.6600000000001,"Cotação"]
[null,null,14,null,"Disco removível para enceradeira, 510mm, (preto, verde, vermelho, amarelo e branco) (ref: 3m ou similar)",6,{"$f":"F22*12","v":72},"Unidade",48.476666666666667,3490.32,0.21690000000000001,4247.37,"Cotação"]
[null,null,15,null,"Disco removível para enceradeira, 410mm, (preto, verde, vermelho, amarelo e branco) (ref: 3m ou similar)",14,168,"Unidade",29,4872,0.21690000000000001,5928.74,"Cotação"]
[null,null,16,null,"Disco Sintético – 430 mm – para lavagem de carpete, ref. Bonnet Certec ou similar",2,24,"Unidade",36.885000000000005,885.24000000000012,{"$f":"K21","v":0.21690000000000001},1077.25,"Cotação"]
[null,null,17,null,"Escova de Nylon multiuso Manual, 13x6,5 cm fibra de aprox. 2,5 cm",12,{"$f":"F25*12","v":144},"Unidade",9.9499999999999993,1432.8,0.21690000000000001,1743.57,"Cotação"]
[null,null,18,null,"Esponja Dupla Face (ref: 3M ou similar)",240,2880,"Unidade",1.7350000000000001,4996.8,0.21690000000000001,6080.61,"Cotação"]
[null,null,19,null,"Esponja de Aço 60g (ref. Bombril, Assolan ou similar)",6,72,"Pacote de 8 unidades",4.4950000000000001,323.64,0.21690000000000001,393.84,"Cotação"]
[null,null,20,null,"Fibra para esfregão 102 e 260 cm (ref. LT ou similar",80,960,"Unidade",3.52,3379.2,0.21690000000000001,4112.1499999999996,"Cotação"]
[null,null,21,null,"Fita dupla face de silicone para instalação, largura de 19 mm, rolo com 20m",5,60,"Unidade",31.094999999999999,1865.6999999999998,0.21690000000000001,2270.37,"Cotação"]
[null,null,22,null,"Fita dupla face de silicone para instalação, largura de 19 mm, rolo com 20m",2,24,"Unidade",25.28,606.72,0.21690000000000001,738.32,"Cotação"]
[null,null,23,null,"Flanela em Peça, 40x60 cm (ref. Copalimpa, star ou outro de desempenho e qualidade similar ou superior)",180,2160,"Unidade",2.7733333333333334,5990.4000000000005,0.21690000000000001,7289.72,"Cotação"]
[null,null,24,null,"Impermeabilizante acrílico metalizado (ref. Traffic HS - Johnson ou outro de desempenho e qualidade similar ou superior)",20,600,"Galão de 5 litros",122.94500000000001,73767,0.21690000000000001,89767.06,"Cotação"]
[null,null,25,null,"Limpa Carpete Diluível 1/20 – (ref. Briosol ou ZAZ, ou outro de desempenho e qualidade similar ou superior)",8,60,"Galão de 5 litros",163.19999999999999,9792,0.21690000000000001,11915.88,"Cotação"]
[null,null,26,null,"Limpa Pedra diluível. Galão 5 litros. ",6,60,"Galão de 5 litros",48.84,2930.4,0.21690000000000001,3566,"Cotação"]
[null,null,27,null,"Lustra Móveis (ref. worker ou outro de desempenho e qualidade similar ou superior)",96,{"$f":"F35*12","v":1152},"Frasco de 200 ml",9.9600000000000009,11473.920000000002,0.21690000000000001,13962.61,"Cotação"]
[null,null,28,null,"Papel Higiênico folha dupla, rolo 250 metros (ref. IHR -25, Profissional, Inovatta ou similar)",297,3564,"Pacote de 8 unidades",102.67500000000001,365933.7,0.21690000000000001,445304.72,"Cotação"]
[null,null,29,null,"Papel toalha interfolhado, caixa com 2.400 folhas, folha dupla, tamanho 23 x 20 cm (ref. Inovata, Santher ou outro de desempenho e qualidade similar ou superior)",570,6840,"Fardos com 5.000 folhas",191.39,1309107.5999999999,0.21690000000000001,1593053.04,"Cotação"]
[null,null,30,null,"Polidor para Metais (ref. silvo ou similar)",2,24,"Frasco de 200 ml",41.239999999999995,989.75999999999988,0.21690000000000001,1204.44,"Cotação"]
[null,null,31,null,"Removedor para piso impermeabilizado (ref. Jato da Johnson Diversey, Start ou outro de desempenho e qualidade similar ou superior)",15,180,"Galão de 5 litros",105.80500000000001,19044.900000000001,0.21690000000000001,23175.74,"Cotação"]
[null,null,32,null,"Sabão minuano 100 gr. (ref. Minuano ou similar)",10,120,"Pacote 5 unidades",18.009999999999998,2161.1999999999998,0.21690000000000001,2629.96,"Cotação"]
[null,null,33,null,"Sabonete líquido perolizado (ref. Nobla, Zaz, Johnson, Diversey ou similar)",80,960,"Galão de 5 litros",40.83,39196.799999999996,0.21690000000000001,47698.59,"Cotação"]
[null,null,34,null,"Saco de pano para Limpeza – tam 1,00 x 0,60 m (ref. Star Textil ou outro de desempenho e qualidade similar ou superior)",200,2400,"Unidade",2.9249999999999998,7020,0.21690000000000001,8542.64,"Cotação"]
[null,null,35,null,"Saco descartável para aspirador (ref. Eletrolux ou similar)",12,144,"Unidade",7.875,1134,0.21690000000000001,1379.96,"Cotação"]
[null,null,36,null,"Saco plástico azul p/ lixo 100 litros",6200,74400,"Unidade",1.0209999999999999,75962.399999999994,0.21690000000000001,92438.64,"Cotação"]
[null,null,37,null,"Saco plástico vermelho para lixo 100 litros",8000,96000,"Unidade",0.80665000000000009,77438.400000000009,0.21690000000000001,94234.79,"Cotação"]
[null,null,38,null,"Saco plástico preto p/ lixo 100 litros",12000,144000,"Unidade",0.57569999999999999,82900.800000000003,0.21690000000000001,100881.98,"Cotação"]
[null,null,39,null,"Saco plástico p/ lixo 200 lt preto.",1216,{"$f":"F47*12","v":14592},"Unidade",0.91380000000000006,13334.169600000001,0.21690000000000001,16226.35,"Cotação"]
[null,null,40,null,"Saco plástico p/ lixo 20 lt preto. ",15000,{"$f":"F48*12","v":180000},"Unidade",0.10695,19251,0.21690000000000001,23426.54,"Cotação"]
[null,null,41,null,"Saco plástico p/ lixo 20 lt vermelho",7500,{"$f":"F49*12","v":90000},"Unidade",0.16844999999999999,15160.499999999998,0.21690000000000001,18448.810000000001,"Cotação"]
[null,null,42,null,"Tela para mictório (ref. Premisse ou similar)",90,{"$f":"F50*12","v":1080},"Unidade",4.5199999999999996,4881.5999999999995,0.21690000000000001,5940.42,"Cotação"]
[]
[null,null,null,null,null,null,null,null,null,null,"SOMATÓRIO TOTAL MENSAL",{"$f":"L53/12","v":229430.89166666669}]
[null,null,null,null,null,null,null,null,null,null,"SOMATÓRIO TOTAL ANUAL",{"$f":"SUM(L8:L51)","v":2753170.7}]

{"sheet":"Não Rel - Mat Cons Durável","index":23,"n_rows":53,"n_cols":15,"rows_kept":53,"cut":false,"hidden":false,"merged":[[2,1,2,4],[3,1,3,14]]}
[]
[]
[]
[null,"MATERIAIS DE CONSUMO PERMANENTE NÃO RELACIONADOS DIRETAMENTE A UM POSTO DE TRABALHO"]
[]
[]
[null,null,"ITEM","CÓDIGO","DESCRIÇÃO","ESTOQUE INICIAL","MÉDIA CONSUMO MENSAL","QTDE. ANUAL","UNIDADE","CUSTO UNITÁRIO ANUAL","CUSTO TOTAL ANUAL","BDI (%)","PREÇO TOTAL ANUAL","FONTE","REFERÊNCIA"]
[]
[null,null,1,null,"Balde Plástico 12 Litros",90,6,{"$f":"F9+12*G9","v":162},"Unidade",11.45,{"$f":"J9*H9","v":1854.8999999999999},{"$f":"BDI!E26","v":0.21690000000000001},{"$f":"ROUND(K9*(1+L9),2)","v":2257.23},"Cotação"]
[null,null,{"$f":"C9+1","v":2},null,"Balde Plástico 60 Litros",10,0,{"$f":"F10+12*G10","v":10},"Unidade",65.849999999999994,{"$f":"J10*H10","v":658.5},{"$f":"L9","v":0.21690000000000001},{"$f":"ROUND(K10*(1+L10),2)","v":801.33},"Cotação"]
[null,null,{"$f":"C10+1","v":3},null,"Conjunto completo para limpeza de rodapé (cabo, armação e cabeleira) ref. Supertat J-453, 61 cm ou similar",9,0,9,"Unidade",92.323333333333338,830.91000000000008,{"$f":"L10","v":0.21690000000000001},1011.13,"Cotação"]
[null,null,4,null,"Conjunto completo para Mop pó (cabo, armação e cabeleira ) ref. Mop seco Euro Cj 60 E ou similar",8,0,{"$f":"F12+12*G12","v":8},"Unidade",118.125,945,0.21690000000000001,1149.97,"Cotação"]
[null,null,5,null,"Conjunto completo para Mop água (cabo, armação e cabeleira ) ref. Mop algodão Euro Cj 60 E ou similar",6,0,6,"Unidade",230.89499999999998,1385.37,0.21690000000000001,1685.86,"Cotação"]
[null,null,6,null,"Conjunto completo com cabo telescópio, guia removível, para limpeza de vidros (ref. Braslimp ou similar)",10,0,10,"Unidade",601.67000000000007,6016.7000000000007,0.21690000000000001,7321.72,"Cotação"]
[null,null,7,null,"Escova de nylon para enceradeira 350 mm (ref. Cleaner ou similar)",4,0,4,"Unidade",77.564999999999998,310.26,0.21690000000000001,377.56,"Cotação"]
[null,null,8,null,"Escova de nylon para enceradeira 410 mm (ref. Cleaner ou similar)",10,0,10,"Unidade",119.36333333333334,1193.6333333333334,{"$f":"L11","v":0.21690000000000001},1452.53,"Cotação"]
[null,null,9,null,"Escova de nylon para enceradeira 510 mm (ref. Cleaner ou similar)",4,0,{"$f":"F17+12*G17","v":4},"Unidade",154.44999999999999,617.79999999999995,{"$f":"L12","v":0.21690000000000001},751.8,"Cotação"]
[null,null,10,null,"Espátula de aço com cabo de madeira 4¨ 101x185mm, cabo amarelo (ref: max ferramentas ou similar)",8,0,8,"Unidade",5.99,47.92,{"$f":"L13","v":0.21690000000000001},58.31,"Cotação"]
[null,null,11,null,"Extensão elétrica com carretel 2x2,5mm² x 25 metros.",15,1,{"$f":"F19+12*G19","v":27},"Unidade",351.10500000000002,9479.8350000000009,{"$f":"L14","v":0.21690000000000001},11536.01,"Cotação"]
[null,null,12,null,"Mangueira Top cristal Ø3/4'x 250 m PVC flexível, camada em poliester trançado, para pressões de 6 bar Tramontina Mult ou similar",2,0,2,"Unidade",739.75,1479.5,{"$f":"L15","v":0.21690000000000001},1800.4,"Cotação"]
[null,null,13,null,"Pá p/ Lixo Plástica com cabo longo 90 cm ref. 15300 maca Tomki,São Bernardo, Madetec ou similar",47,2,71,"Unidade",5.15,365.65000000000003,0.21690000000000001,444.96,"Cotação"]
[null,null,14,null,"Placa de sinalização em vinil para piso molhado",25,1,37,"Unidade",79.015000000000001,2923.5549999999998,0.21690000000000001,3557.67,"Cotação"]
[null,null,15,null,"Rastelo para jardim",6,1,18,"Unidade",32.31,581.58000000000004,0.21690000000000001,707.72,"Cotação"]
[null,null,16,null,"Regador de 10 litros",8,0,8,"Unidade",19.14,153.12,0.21690000000000001,186.33,"Cotação"]
[null,null,17,null,"Regador de 5 litros",2,0,{"$f":"F25+12*G25","v":2},"Unidade",14.265000000000001,28.53,0.21690000000000001,34.72,"Cotação"]
[null,null,18,null,"Rodo 40cm de madeira/plástico (borracha dupla) com cabo 1,50 cm Marcas Tomki, Guirado, Bettani, Dalcim ou similar",80,4,{"$f":"F26+12*G26","v":128},"Unidade",21.880000000000003,2800.6400000000003,0.21690000000000001,3408.1,"Cotação"]
[null,null,19,null,"Rodo 60cm de madeira/plástico (borracha dupla) com cabo 1,50m Marcas Tomki, Guirado, Bettani, Dalcim ou similar",40,2,64,"Unidade",28.704999999999998,1837.12,0.21690000000000001,2235.59,"Cotação"]
[null,null,20,null,"Vassoura de Pêlo 40cm nylon com cabo 1,50m marcas Tommki, Guirado, Bettani, Dalcim ou similar",15,3,51,"Unidade",14.95,762.44999999999993,0.21690000000000001,927.83,"Cotação"]
[null,null,21,null,"Vassoura de Pêlo 60cm nylon com cabo 1,50m marcas Tommki, Guirado, Bettani, Dalcim ou similar",5,2,29,"Unidade",19.215,557.23500000000001,0.21690000000000001,678.1,"Cotação"]
[null,null,22,null,"Vassoura p/ Vaso Sanitário com cabo em plástico (ref. Guirado/ Bettani/ Dalcim)",50,6,122,"Unidade",6.1550000000000002,750.91000000000008,0.21690000000000001,913.78,"Cotação"]
[null,null,23,null,"Vassoura Piaçava nº 3 com cabo 1,50m marca Guirado, Bettani, Dalcim ou similar",30,2,{"$f":"F31+12*G31","v":54},"Unidade",16.563333333333333,894.42,0.21690000000000001,1088.42,"Cotação"]
[]
[null,null,null,null,null,null,null,null,null,null,null,"SOMATÓRIO TOTAL MENSAL",{"$f":"M34/12","v":3698.9225000000001}]
[null,null,null,null,null,null,null,null,null,null,null,"SOMATÓRIO TOTAL ANUAL",{"$f":"SUM(M8:M32)","v":44387.07}]
[]
[]
[]
[]
[]
[]
[]
[]
[]
[]
[]
[]
[]
[]
[]
[]
[]
[]
[null,null,null,null,null,null,null,null,null,null,null,{"$f":"SUM(L8:L51)","v":4.9886999999999988}]

{"sheet":"Não Rel - Serviços","index":24,"n_rows":53,"n_cols":13,"rows_kept":53,"cut":false,"hidden":false,"merged":[[1,1,1,4],[2,1,2,12]]}
[]
[]
[null,"SERVIÇOS NÃO RELACIONADOS DIRETAMENTE A UM POSTO DE TRABALHO - SOB DEMANDA"]
[]
[]
[null,null,"ITEM","CÓDIGO","DESCRIÇÃO","QUANT ANUAL","UNIDADE","CUSTO UNITÁRIO","CUSTO TOTAL","BDI (%)","PREÇO TOTAL","FONTE","REFERÊNCIA"]
[]
[null,null,1,null,"Serviços de desinsetização e desratização em uma área de 122.965 m²",4,"aplicações",8025,{"$f":"H8*F8","v":32100},{"$f":"BDI!E26","v":0.21690000000000001},{"$f":"ROUND(I8*(1+J8),2)","v":39062.49},"Cotação"]
[]
[null,null,null,null,null,null,null,null,null,"SOMATÓRIO TOTAL MENSAL",{"$f":"K11/12","v":3255.2075}]
[null,null,null,null,null,null,null,null,null,"SOMATÓRIO TOTAL ANUAL",{"$f":"SUM(K7:K9)","v":39062.49}]
[]
[]
[]
[]
[]
[]
[]
[]
[]
[]
[]
[]
[]
[]
[]
[]
[]
[]
[]
[]
[]
[]
[]
[]
[]
[]
[]
[]
[]
[]
[]
[]
[]
[]
[]
[]
[]
[]
[]
[]
[]
[null,null,null,null,null,null,null,null,null,null,null,{"$f":"SUM(L8:L51)","v":0}]

{"sheet":"Not. Demanda","index":25,"n_rows":51,"n_cols":8,"rows_kept":51,"cut":false,"hidden":true,"merged":[[1,1,1,3],[2,1,2,7]]}
[]
[]
[null,"ADICIONAL NOTURNO SOB DEMANDA"]
[]
[]
[null,null,"CATEGORIAS",null,null,null,"HORAS / MÊS","% NOTURNA"]
[]
[null,null,8,{"$f":"HLOOKUP($C8,'Dados Gerais'!$D$5:$BK$10,6)","v":0},null,null,null,0.22500000000000001]
[null,null,9,{"$f":"HLOOKUP($C9,'Dados Gerais'!$D$5:$BK$10,6)","v":0},null,null,null,0.22500000000000001]
[]
[]
[null,null,"AJUSTE DE HORAS FICTAS",null,"AJUSTE H.NOT","HORA NORMAL","H.FICTAS/MÊS","H.ÚTEIS/MÊS"]
[]
[null,null,8,{"$f":"HLOOKUP($C14,'Dados Gerais'!$D$5:$BK$10,6)","v":0},60,60,{"$f":"G8*(F14/E14)","v":0},{"$f":"HLOOKUP(C14,'Dados Gerais'!$D$5:$L$16,12,0)","v":0}]
[null,null,9,{"$f":"HLOOKUP($C15,'Dados Gerais'!$D$5:$BK$10,6)","v":0},60,60,{"$f":"G9*(F15/E15)","v":0},{"$f":"HLOOKUP(C15,'Dados Gerais'!$D$5:$L$16,12,0)","v":0}]
[]
[]
[null,null,"VALOR DO ADICIONAL NOTURNO",null,null,"SALÁRIO MÊS","VL.H.NORMAL","ADIC.H.FICTAS"]
[]
[null,null,8,{"$f":"HLOOKUP($C20,'Dados Gerais'!$D$5:$BK$10,6)","v":0},null,{"$f":"HLOOKUP(C20,'Dados Gerais'!$D$5:$L$12,8,0)","v":0},{"$f":"F20/H14","v":{"$error":"#DIV/0!"}},{"$f":"G20*(H8)","v":{"$error":"#DIV/0!"}}]
[null,null,9,{"$f":"HLOOKUP($C21,'Dados Gerais'!$D$5:$BK$10,6)","v":0},null,{"$f":"HLOOKUP(C21,'Dados Gerais'!$D$5:$L$12,8,0)","v":0},{"$f":"F21/H15","v":{"$error":"#DIV/0!"}},{"$f":"G21*(H9)","v":{"$error":"#DIV/0!"}}]
[]
[]
[null,null,"RESUMO DO ADICIONAL NOTURNO SOB DEMANDA"]
[null,null,"TOTAIS MENSAIS",null,null,null,"PREÇO MENSAL"]
[]
[null,null,8,{"$f":"HLOOKUP($C27,'Dados Gerais'!$D$5:$BK$10,6)","v":0},null,null,{"$f":"H20*G14","v":{"$error":"#DIV/0!"}}]
[null,null,9,{"$f":"HLOOKUP($C28,'Dados Gerais'!$D$5:$BK$10,6)","v":0},null,null,{"$f":"H21*G15","v":{"$error":"#DIV/0!"}}]
[]
[null,null,null,null,null,"SOMATÓRIO TOTAL MENSAL",{"$f":"SUM(G27:G29)","v":{"$error":"#DIV/0!"}}]
[null,null,null,null,null,"SOMATÓRIO TOTAL ANUAL",{"$f":"G30*12","v":{"$error":"#DIV/0!"}}]
[]
[]
[null,null,"ENCARGOS SOCIAIS E BDI SOBRE ADICIONAL NOTURNO SOB DEMANDA"]
[null,null,"TOTAIS MENSAIS",null,null,"PERCENTUAIS","PREÇO MENSAL"]
[]
[null,null,null,"ENCARGOS SOCIAIS",null,{"$f":"'Encargos Sociais'!$E$46","v":0.73870000000000002},{"$f":"F37*G30","v":{"$error":"#DIV/0!"}}]
[null,null,null,"BDI",null,{"$f":"BDI!$E$26","v":0.21690000000000001},{"$f":"F38*(G30+G37)","v":{"$error":"#DIV/0!"}}]
[]
[null,null,null,null,null,"SOMATÓRIO TOTAL MENSAL",{"$f":"SUM(G37:G39)","v":{"$error":"#DIV/0!"}}]
[null,null,null,null,null,"SOMATÓRIO TOTAL ANUAL",{"$f":"G40*12","v":{"$error":"#DIV/0!"}}]
[]
[]
[null,null,"VALOR TOTAL ADICIONAL NOTURNO SOB DEMANDA (COM ENCARGOS SOCIAIS E BDI INCLUSOS)"]
[null,null,"TOTAIS MENSAIS",null,null,"PERCENTUAIS","PREÇO MENSAL"]
[]
[null,null,null,"ENCARGOS SOCIAIS",null,{"$f":"'Encargos Sociais'!$E$46","v":0.73870000000000002},{"$f":"G27+G37","v":{"$error":"#DIV/0!"}}]
[null,null,null,"BDI",null,{"$f":"BDI!$E$26","v":0.21690000000000001},{"$f":"G28+G38","v":{"$error":"#DIV/0!"}}]
[]
[null,null,null,null,null,"SOMATÓRIO TOTAL MENSAL",{"$f":"SUM(G47:G49)","v":{"$error":"#DIV/0!"}}]
[null,null,null,null,null,"SOMATÓRIO TOTAL ANUAL",{"$f":"G50*12","v":{"$error":"#DIV/0!"}}]

{"sheet":"Mat Cons","index":26,"n_rows":28,"n_cols":128,"rows_kept":28,"cut":false,"hidden":true,"merged":[[9,1,9,3],[10,1,10,5]]}
[null,null,"CÂMARA DOS DEPUTADOS"]
[null,null,"DEPARTAMENTO TÉCNICO"]
[null,null,"Coordenação de Planejamento e Gestão"]
[]
[null,null,"Data:",{"$f":"'Dados Gerais'!#REF!","v":{"$error":"#REF!"}}]
[null,null,"Processo:",{"$f":"'Dados Gerais'!#REF!","v":{"$error":"#REF!"}}]
[null,null,"Objeto:",{"$f":"'Dados Gerais'!#REF!","v":{"$error":"#REF!"}}]
[]
[]
[]
[null,"MATERIAIS DE CONSUMO RELACIONADOS AO POSTO - AQUISIÇÃO",null,null,null,null,null,null,1,null,{"$f":"I11+1","v":2},null,{"$f":"K11+1","v":3},null,{"$f":"M11+1","v":4},null,{"$f":"O11+1","v":5},null,{"$f":"Q11+1","v":6},null,{"$f":"S11+1","v":7},null,{"$f":"U11+1","v":8},null,{"$f":"W11+1","v":9},null,{"$f":"Y11+1","v":10},null,{"$f":"AA11+1","v":11},null,{"$f":"AC11+1","v":12},null,{"$f":"AE11+1","v":13},null,{"$f":"AG11+1","v":14},null,{"$f":"AI11+1","v":15},null,{"$f":"AK11+1","v":16},null,{"$f":"AM11+1","v":17},null,{"$f":"AO11+1","v":18},null,{"$f":"AQ11+1","v":19},null,{"$f":"AS11+1","v":20},null,{"$f":"AU11+1","v":21},null,{"$f":"AW11+1","v":22},null,{"$f":"AY11+1","v":23},null,{"$f":"BA11+1","v":24},null,{"$f":"BC11+1","v":25},null,{"$f":"BE11+1","v":26},null,{"$f":"BG11+1","v":27},null,{"$f":"BI11+1","v":28},null,{"$f":"BK11+1","v":29},null,{"$f":"BM11+1","v":30},null,{"$f":"BO11+1","v":31},null,{"$f":"BQ11+1","v":32},null,{"$f":"BS11+1","v":33},null,{"$f":"BU11+1","v":34},null,{"$f":"BW11+1","v":35},null,{"$f":"BY11+1","v":36},null,{"$f":"CA11+1","v":37},null,{"$f":"CC11+1","v":38},null,{"$f":"CE11+1","v":39},null,{"$f":"CG11+1","v":40},null,{"$f":"CI11+1","v":41},null,{"$f":"CK11+1","v":42},null,{"$f":"CM11+1","v":43},null,{"$f":"CO11+1","v":44},null,{"$f":"CQ11+1","v":45},null,{"$f":"CS11+1","v":46},null,{"$f":"CU11+1","v":47},null,{"$f":"CW11+1","v":48},null,{"$f":"CY11+1","v":49},null,{"$f":"DA11+1","v":50},null,{"$f":"DC11+1","v":51},null,{"$f":"DE11+1","v":52},null,{"$f":"DG11+1","v":53},null,{"$f":"DI11+1","v":54},null,{"$f":"DK11+1","v":55},null,{"$f":"DM11+1","v":56},null,{"$f":"DO11+1","v":57},null,{"$f":"DQ11+1","v":58},null,{"$f":"DS11+1","v":59},null,{"$f":"DU11+1","v":60}]
[]
[null,null,null,null,null,null,null,null,{"$f":"ROUND(SUM(J12:J65),2)","v":0},null,{"$f":"ROUND(SUM(L12:L65),2)","v":0},null,{"$f":"ROUND(SUM(N12:N65),2)","v":0},null,{"$f":"ROUND(SUM(P12:P65),2)","v":0},null,{"$f":"ROUND(SUM(R12:R65),2)","v":0},null,{"$f":"ROUND(SUM(T12:T65),2)","v":0},null,{"$f":"ROUND(SUM(V12:V65),2)","v":0},null,{"$f":"ROUND(SUM(X12:X65),2)","v":0},null,{"$f":"ROUND(SUM(Z12:Z65),2)","v":0},null,{"$f":"ROUND(SUM(AB12:AB65),2)","v":0},null,{"$f":"ROUND(SUM(AD12:AD65),2)","v":0},null,{"$f":"ROUND(SUM(AF12:AF65),2)","v":0},null,{"$f":"ROUND(SUM(AH12:AH65),2)","v":0},null,{"$f":"ROUND(SUM(AJ12:AJ65),2)","v":0},null,{"$f":"ROUND(SUM(AL12:AL65),2)","v":0},null,{"$f":"ROUND(SUM(AN12:AN65),2)","v":0},null,{"$f":"ROUND(SUM(AP12:AP65),2)","v":0},null,{"$f":"ROUND(SUM(AR12:AR65),2)","v":0},null,{"$f":"ROUND(SUM(AT12:AT65),2)","v":0},null,{"$f":"ROUND(SUM(AV12:AV65),2)","v":0},null,{"$f":"ROUND(SUM(AX12:AX65),2)","v":0},null,{"$f":"ROUND(SUM(AZ12:AZ65),2)","v":0},null,{"$f":"ROUND(SUM(BB12:BB65),2)","v":0},null,{"$f":"ROUND(SUM(BD12:BD65),2)","v":0},null,{"$f":"ROUND(SUM(BF12:BF65),2)","v":0},null,{"$f":"ROUND(SUM(BH12:BH65),2)","v":0},null,{"$f":"ROUND(SUM(BJ12:BJ65),2)","v":0},null,{"$f":"ROUND(SUM(BL12:BL65),2)","v":0},null,{"$f":"ROUND(SUM(BN12:BN65),2)","v":0},null,{"$f":"ROUND(SUM(BP12:BP65),2)","v":0},null,{"$f":"ROUND(SUM(BR12:BR65),2)","v":0},null,{"$f":"ROUND(SUM(BT12:BT65),2)","v":0},null,{"$f":"ROUND(SUM(BV12:BV65),2)","v":0},null,{"$f":"ROUND(SUM(BX12:BX65),2)","v":0},null,{"$f":"ROUND(SUM(BZ12:BZ65),2)","v":0},null,{"$f":"ROUND(SUM(CB12:CB65),2)","v":0},null,{"$f":"ROUND(SUM(CD12:CD65),2)","v":0},null,{"$f":"ROUND(SUM(CF12:CF65),2)","v":0},null,{"$f":"ROUND(SUM(CH12:CH65),2)","v":0},null,{"$f":"ROUND(SUM(CJ12:CJ65),2)","v":0},null,{"$f":"ROUND(SUM(CL12:CL65),2)","v":0},null,{"$f":"ROUND(SUM(CN12:CN65),2)","v":0},null,{"$f":"ROUND(SUM(CP12:CP65),2)","v":0},null,{"$f":"ROUND(SUM(CR12:CR65),2)","v":0},null,{"$f":"ROUND(SUM(CT12:CT65),2)","v":0},null,{"$f":"ROUND(SUM(CV12:CV65),2)","v":0},null,{"$f":"ROUND(SUM(CX12:CX65),2)","v":0},null,{"$f":"ROUND(SUM(CZ12:CZ65),2)","v":0},null,{"$f":"ROUND(SUM(DB12:DB65),2)","v":0},null,{"$f":"ROUND(SUM(DD12:DD65),2)","v":0},null,{"$f":"ROUND(SUM(DF12:DF65),2)","v":0},null,{"$f":"ROUND(SUM(DH12:DH65),2)","v":0},null,{"$f":"ROUND(SUM(DJ12:DJ65),2)","v":0},null,{"$f":"ROUND(SUM(DL12:DL65),2)","v":0},null,{"$f":"ROUND(SUM(DN12:DN65),2)","v":0},null,{"$f":"ROUND(SUM(DP12:DP65),2)","v":0},null,{"$f":"ROUND(SUM(DR12:DR65),2)","v":0},null,{"$f":"ROUND(SUM(DT12:DT65),2)","v":0},null,{"$f":"ROUND(SUM(DV12:DV65),2)","v":0},null,{"$f":"ROUND(SUM(DX12:DX65),2)","v":0}]
[null,null,"CATEGORIAS",null,null,"QUANTIDADE"]
[null,null,null,null,null,null,null,null,{"$f":"IF($C15=I$11,1,0)","v":0}]
[null,null,null,null,null,null,null,null,0,null,{"$f":"IF($C16=K$11,1,0)","v":0},null,{"$f":"IF($C16=M$11,1,0)","v":0},null,{"$f":"IF($C16=O$11,1,0)","v":0},null,{"$f":"IF($C16=Q$11,1,0)","v":0},null,{"$f":"IF($C16=S$11,1,0)","v":0},null,{"$f":"IF($C16=U$11,1,0)","v":0},null,{"$f":"IF($C16=W$11,1,0)","v":0},null,{"$f":"IF($C16=Y$11,1,0)","v":0},null,{"$f":"IF($C16=AA$11,1,0)","v":0},null,{"$f":"IF($C16=AC$11,1,0)","v":0},null,{"$f":"IF($C16=AE$11,1,0)","v":0},null,{"$f":"IF($C16=AG$11,1,0)","v":0},null,{"$f":"IF($C16=AI$11,1,0)","v":0},null,{"$f":"IF($C16=AK$11,1,0)","v":0},null,{"$f":"IF($C16=AM$11,1,0)","v":0},null,{"$f":"IF($C16=AO$11,1,0)","v":0},null,{"$f":"IF($C16=AQ$11,1,0)","v":0},null,{"$f":"IF($C16=AS$11,1,0)","v":0},null,{"$f":"IF($C16=AU$11,1,0)","v":0},null,{"$f":"IF($C16=AW$11,1,0)","v":0},null,{"$f":"IF($C16=AY$11,1,0)","v":0},null,{"$f":"IF($C16=BA$11,1,0)","v":0},null,{"$f":"IF($C16=BC$11,1,0)","v":0},null,{"$f":"IF($C16=BE$11,1,0)","v":0},null,{"$f":"IF($C16=BG$11,1,0)","v":0},null,{"$f":"IF($C16=BI$11,1,0)","v":0},null,{"$f":"IF($C16=BK$11,1,0)","v":0},null,{"$f":"IF($C16=BM$11,1,0)","v":0},null,{"$f":"IF($C16=BO$11,1,0)","v":0},null,{"$f":"IF($C16=BQ$11,1,0)","v":0},null,{"$f":"IF($C16=BS$11,1,0)","v":0},null,{"$f":"IF($C16=BU$11,1,0)","v":0},null,{"$f":"IF($C16=BW$11,1,0)","v":0},null,{"$f":"IF($C16=BY$11,1,0)","v":0},null,{"$f":"IF($C16=CA$11,1,0)","v":0},null,{"$f":"IF($C16=CC$11,1,0)","v":0},null,{"$f":"IF($C16=CE$11,1,0)","v":0},null,{"$f":"IF($C16=CG$11,1,0)","v":0},null,{"$f":"IF($C16=CI$11,1,0)","v":0},null,{"$f":"IF($C16=CK$11,1,0)","v":0},null,{"$f":"IF($C16=CM$11,1,0)","v":0},null,{"$f":"IF($C16=CO$11,1,0)","v":0},null,{"$f":"IF($C16=CQ$11,1,0)","v":0},null,{"$f":"IF($C16=CS$11,1,0)","v":0},null,{"$f":"IF($C16=CU$11,1,0)","v":0},null,{"$f":"IF($C16=CW$11,1,0)","v":0},null,{"$f":"IF($C16=CY$11,1,0)","v":0},null,{"$f":"IF($C16=DA$11,1,0)","v":0},null,{"$f":"IF($C16=DC$11,1,0)","v":0},null,{"$f":"IF($C16=DE$11,1,0)","v":0},null,{"$f":"IF($C16=DG$11,1,0)","v":0},null,{"$f":"IF($C16=DI$11,1,0)","v":0},null,{"$f":"IF($C16=DK$11,1,0)","v":0},null,{"$f":"IF($C16=DM$11,1,0)","v":0},null,{"$f":"IF($C16=DO$11,1,0)","v":0},null,{"$f":"IF($C16=DQ$11,1,0)","v":0},null,{"$f":"IF($C16=DS$11,1,0)","v":0},null,{"$f":"IF($C16=DU$11,1,0)","v":0},null,{"$f":"IF($C16=DW$11,1,0)","v":0}]
[null,null,null,null,null,null,null,null,0,null,0,null,0,null,0,null,0,null,0,null,0,null,0,null,0,null,0,null,0,null,0,null,0,null,0,null,0,null,0,null,0,null,0,null,0,null,0,null,0,null,0,null,0,null,0,null,0,null,0,null,0,null,0,null,0,null,0,null,0,null,0,null,0,null,0,null,0,null,0,null,0,null,0,null,0,null,0,null,0,null,0,null,0,null,0,null,0,null,0,null,0,null,0,null,0,null,0,null,0,null,0,null,0,null,0,null,0,null,0,null,0,null,0,null,0,null,0]
[null,null,null,null,null,null,null,null,0,null,0,null,0,null,0,null,0,null,0,null,0,null,0,null,0,null,0,null,0,null,0,null,0,null,0,null,0,null,0,null,0,null,0,null,0,null,0,null,0,null,0,null,0,null,0,null,0,null,0,null,0,null,0,null,0,null,0,null,0,null,0,null,0,null,0,null,0,null,0,null,0,null,0,null,0,null,0,null,0,null,0,null,0,null,0,null,0,null,0,null,0,null,0,null,0,null,0,null,0,null,0,null,0,null,0,null,0,null,0,null,0,null,0,null,0,null,0]
[null,null,null,null,null,null,null,null,0,null,0,null,0,null,0,null,0,null,0,null,0,null,0,null,0,null,0,null,0,null,0,null,0,null,0,null,0,null,0,null,0,null,0,null,0,null,0,null,0,null,0,null,0,null,0,null,0,null,0,null,0,null,0,null,0,null,0,null,0,null,0,null,0,null,0,null,0,null,0,null,0,null,0,null,0,null,0,null,0,null,0,null,0,null,0,null,0,null,0,null,0,null,0,null,0,null,0,null,0,null,0,null,0,null,0,null,0,null,0,null,0,null,0,null,0,null,0]
[null,null,null,null,null,null,null,null,0,null,0,null,0,null,0,null,0,null,0,null,0,null,0,null,0,null,0,null,0,null,0,null,0,null,0,null,0,null,0,null,0,null,0,null,0,null,0,null,0,null,0,null,0,null,0,null,0,null,0,null,0,null,0,null,0,null,0,null,0,null,0,null,0,null,0,null,0,null,0,null,0,null,0,null,0,null,0,null,0,null,0,null,0,null,0,null,0,null,0,null,0,null,0,null,0,null,0,null,0,null,0,null,0,null,0,null,0,null,0,null,0,null,0,null,0,null,0]
[null,null,null,null,null,null,null,null,0,null,0,null,0,null,0,null,0,null,0,null,0,null,0,null,0,null,0,null,0,null,0,null,0,null,0,null,0,null,0,null,0,null,0,null,0,null,0,null,0,null,0,null,0,null,0,null,0,null,0,null,0,null,0,null,0,null,0,null,0,null,0,null,0,null,0,null,0,null,0,null,0,null,0,null,0,null,0,null,0,null,0,null,0,null,0,null,0,null,0,null,0,null,0,null,0,null,0,null,0,null,0,null,0,null,0,null,0,null,0,null,0,null,0,null,0,null,0]
[null,null,null,null,null,null,null,null,0]
[]
[null,null,"ITEM","DESCRIÇÃO","QUANT ANUAL","VALOR"]
[null,null,null,null,null,null,null,null,null,{"$f":"IF(SUM(I$15:I$22)>0,$E25*$F25,0)","v":0},null,{"$f":"IF(SUM(K$15:K$22)>0,$E25*$F25,0)","v":0},null,{"$f":"IF(SUM(M$15:M$22)>0,$E25*$F25,0)","v":0},null,{"$f":"IF(SUM(O$15:O$22)>0,$E25*$F25,0)","v":0},null,{"$f":"IF(SUM(Q$15:Q$22)>0,$E25*$F25,0)","v":0},null,{"$f":"IF(SUM(S$15:S$22)>0,$E25*$F25,0)","v":0},null,{"$f":"IF(SUM(U$15:U$22)>0,$E25*$F25,0)","v":0},null,{"$f":"IF(SUM(W$15:W$22)>0,$E25*$F25,0)","v":0},null,{"$f":"IF(SUM(Y$15:Y$22)>0,$E25*$F25,0)","v":0},null,{"$f":"IF(SUM(AA$15:AA$22)>0,$E25*$F25,0)","v":0},null,{"$f":"IF(SUM(AC$15:AC$22)>0,$E25*$F25,0)","v":0},null,{"$f":"IF(SUM(AE$15:AE$22)>0,$E25*$F25,0)","v":0},null,{"$f":"IF(SUM(AG$15:AG$22)>0,$E25*$F25,0)","v":0},null,{"$f":"IF(SUM(AI$15:AI$22)>0,$E25*$F25,0)","v":0},null,{"$f":"IF(SUM(AK$15:AK$22)>0,$E25*$F25,0)","v":0},null,{"$f":"IF(SUM(AM$15:AM$22)>0,$E25*$F25,0)","v":0},null,{"$f":"IF(SUM(AO$15:AO$22)>0,$E25*$F25,0)","v":0},null,{"$f":"IF(SUM(AQ$15:AQ$22)>0,$E25*$F25,0)","v":0},null,{"$f":"IF(SUM(AS$15:AS$22)>0,$E25*$F25,0)","v":0},null,{"$f":"IF(SUM(AU$15:AU$22)>0,$E25*$F25,0)","v":0},null,{"$f":"IF(SUM(AW$15:AW$22)>0,$E25*$F25,0)","v":0},null,{"$f":"IF(SUM(AY$15:AY$22)>0,$E25*$F25,0)","v":0},null,{"$f":"IF(SUM(BA$15:BA$22)>0,$E25*$F25,0)","v":0},null,{"$f":"IF(SUM(BC$15:BC$22)>0,$E25*$F25,0)","v":0},null,{"$f":"IF(SUM(BE$15:BE$22)>0,$E25*$F25,0)","v":0},null,{"$f":"IF(SUM(BG$15:BG$22)>0,$E25*$F25,0)","v":0},null,{"$f":"IF(SUM(BI$15:BI$22)>0,$E25*$F25,0)","v":0},null,{"$f":"IF(SUM(BK$15:BK$22)>0,$E25*$F25,0)","v":0},null,{"$f":"IF(SUM(BM$15:BM$22)>0,$E25*$F25,0)","v":0},null,{"$f":"IF(SUM(BO$15:BO$22)>0,$E25*$F25,0)","v":0},null,{"$f":"IF(SUM(BQ$15:BQ$22)>0,$E25*$F25,0)","v":0},null,{"$f":"IF(SUM(BS$15:BS$22)>0,$E25*$F25,0)","v":0},null,{"$f":"IF(SUM(BU$15:BU$22)>0,$E25*$F25,0)","v":0},null,{"$f":"IF(SUM(BW$15:BW$22)>0,$E25*$F25,0)","v":0},null,{"$f":"IF(SUM(BY$15:BY$22)>0,$E25*$F25,0)","v":0},null,{"$f":"IF(SUM(CA$15:CA$22)>0,$E25*$F25,0)","v":0},null,{"$f":"IF(SUM(CC$15:CC$22)>0,$E25*$F25,0)","v":0},null,{"$f":"IF(SUM(CE$15:CE$22)>0,$E25*$F25,0)","v":0},null,{"$f":"IF(SUM(CG$15:CG$22)>0,$E25*$F25,0)","v":0},null,{"$f":"IF(SUM(CI$15:CI$22)>0,$E25*$F25,0)","v":0},null,{"$f":"IF(SUM(CK$15:CK$22)>0,$E25*$F25,0)","v":0},null,{"$f":"IF(SUM(CM$15:CM$22)>0,$E25*$F25,0)","v":0},null,{"$f":"IF(SUM(CO$15:CO$22)>0,$E25*$F25,0)","v":0},null,{"$f":"IF(SUM(CQ$15:CQ$22)>0,$E25*$F25,0)","v":0},null,{"$f":"IF(SUM(CS$15:CS$22)>0,$E25*$F25,0)","v":0},null,{"$f":"IF(SUM(CU$15:CU$22)>0,$E25*$F25,0)","v":0},null,{"$f":"IF(SUM(CW$15:CW$22)>0,$E25*$F25,0)","v":0},null,{"$f":"IF(SUM(CY$15:CY$22)>0,$E25*$F25,0)","v":0},null,{"$f":"IF(SUM(DA$15:DA$22)>0,$E25*$F25,0)","v":0},null,{"$f":"IF(SUM(DC$15:DC$22)>0,$E25*$F25,0)","v":0},null,{"$f":"IF(SUM(DE$15:DE$22)>0,$E25*$F25,0)","v":0},null,{"$f":"IF(SUM(DG$15:DG$22)>0,$E25*$F25,0)","v":0},null,{"$f":"IF(SUM(DI$15:DI$22)>0,$E25*$F25,0)","v":0},null,{"$f":"IF(SUM(DK$15:DK$22)>0,$E25*$F25,0)","v":0},null,{"$f":"IF(SUM(DM$15:DM$22)>0,$E25*$F25,0)","v":0},null,{"$f":"IF(SUM(DO$15:DO$22)>0,$E25*$F25,0)","v":0},null,{"$f":"IF(SUM(DQ$15:DQ$22)>0,$E25*$F25,0)","v":0},null,{"$f":"IF(SUM(DS$15:DS$22)>0,$E25*$F25,0)","v":0},null,{"$f":"IF(SUM(DU$15:DU$22)>0,$E25*$F25,0)","v":0},null,{"$f":"IF(SUM(DW$15:DW$22)>0,$E25*$F25,0)","v":0}]
[null,null,null,null,null,null,null,null,null,{"$f":"IF(SUM(I$15:I$22)>0,$E26*$F26,0)","v":0},null,{"$f":"IF(SUM(K$15:K$22)>0,$E26*$F26,0)","v":0},null,{"$f":"IF(SUM(M$15:M$22)>0,$E26*$F26,0)","v":0},null,{"$f":"IF(SUM(O$15:O$22)>0,$E26*$F26,0)","v":0},null,{"$f":"IF(SUM(Q$15:Q$22)>0,$E26*$F26,0)","v":0},null,{"$f":"IF(SUM(S$15:S$22)>0,$E26*$F26,0)","v":0},null,{"$f":"IF(SUM(U$15:U$22)>0,$E26*$F26,0)","v":0},null,{"$f":"IF(SUM(W$15:W$22)>0,$E26*$F26,0)","v":0},null,{"$f":"IF(SUM(Y$15:Y$22)>0,$E26*$F26,0)","v":0},null,{"$f":"IF(SUM(AA$15:AA$22)>0,$E26*$F26,0)","v":0},null,{"$f":"IF(SUM(AC$15:AC$22)>0,$E26*$F26,0)","v":0},null,{"$f":"IF(SUM(AE$15:AE$22)>0,$E26*$F26,0)","v":0},null,{"$f":"IF(SUM(AG$15:AG$22)>0,$E26*$F26,0)","v":0},null,{"$f":"IF(SUM(AI$15:AI$22)>0,$E26*$F26,0)","v":0},null,{"$f":"IF(SUM(AK$15:AK$22)>0,$E26*$F26,0)","v":0},null,{"$f":"IF(SUM(AM$15:AM$22)>0,$E26*$F26,0)","v":0},null,{"$f":"IF(SUM(AO$15:AO$22)>0,$E26*$F26,0)","v":0},null,{"$f":"IF(SUM(AQ$15:AQ$22)>0,$E26*$F26,0)","v":0},null,{"$f":"IF(SUM(AS$15:AS$22)>0,$E26*$F26,0)","v":0},null,{"$f":"IF(SUM(AU$15:AU$22)>0,$E26*$F26,0)","v":0},null,{"$f":"IF(SUM(AW$15:AW$22)>0,$E26*$F26,0)","v":0},null,{"$f":"IF(SUM(AY$15:AY$22)>0,$E26*$F26,0)","v":0},null,{"$f":"IF(SUM(BA$15:BA$22)>0,$E26*$F26,0)","v":0},null,{"$f":"IF(SUM(BC$15:BC$22)>0,$E26*$F26,0)","v":0},null,{"$f":"IF(SUM(BE$15:BE$22)>0,$E26*$F26,0)","v":0},null,{"$f":"IF(SUM(BG$15:BG$22)>0,$E26*$F26,0)","v":0},null,{"$f":"IF(SUM(BI$15:BI$22)>0,$E26*$F26,0)","v":0},null,{"$f":"IF(SUM(BK$15:BK$22)>0,$E26*$F26,0)","v":0},null,{"$f":"IF(SUM(BM$15:BM$22)>0,$E26*$F26,0)","v":0},null,{"$f":"IF(SUM(BO$15:BO$22)>0,$E26*$F26,0)","v":0},null,{"$f":"IF(SUM(BQ$15:BQ$22)>0,$E26*$F26,0)","v":0},null,{"$f":"IF(SUM(BS$15:BS$22)>0,$E26*$F26,0)","v":0},null,{"$f":"IF(SUM(BU$15:BU$22)>0,$E26*$F26,0)","v":0},null,{"$f":"IF(SUM(BW$15:BW$22)>0,$E26*$F26,0)","v":0},null,{"$f":"IF(SUM(BY$15:BY$22)>0,$E26*$F26,0)","v":0},null,{"$f":"IF(SUM(CA$15:CA$22)>0,$E26*$F26,0)","v":0},null,{"$f":"IF(SUM(CC$15:CC$22)>0,$E26*$F26,0)","v":0},null,{"$f":"IF(SUM(CE$15:CE$22)>0,$E26*$F26,0)","v":0},null,{"$f":"IF(SUM(CG$15:CG$22)>0,$E26*$F26,0)","v":0},null,{"$f":"IF(SUM(CI$15:CI$22)>0,$E26*$F26,0)","v":0},null,{"$f":"IF(SUM(CK$15:CK$22)>0,$E26*$F26,0)","v":0},null,{"$f":"IF(SUM(CM$15:CM$22)>0,$E26*$F26,0)","v":0},null,{"$f":"IF(SUM(CO$15:CO$22)>0,$E26*$F26,0)","v":0},null,{"$f":"IF(SUM(CQ$15:CQ$22)>0,$E26*$F26,0)","v":0},null,{"$f":"IF(SUM(CS$15:CS$22)>0,$E26*$F26,0)","v":0},null,{"$f":"IF(SUM(CU$15:CU$22)>0,$E26*$F26,0)","v":0},null,{"$f":"IF(SUM(CW$15:CW$22)>0,$E26*$F26,0)","v":0},null,{"$f":"IF(SUM(CY$15:CY$22)>0,$E26*$F26,0)","v":0},null,{"$f":"IF(SUM(DA$15:DA$22)>0,$E26*$F26,0)","v":0},null,{"$f":"IF(SUM(DC$15:DC$22)>0,$E26*$F26,0)","v":0},null,{"$f":"IF(SUM(DE$15:DE$22)>0,$E26*$F26,0)","v":0},null,{"$f":"IF(SUM(DG$15:DG$22)>0,$E26*$F26,0)","v":0},null,{"$f":"IF(SUM(DI$15:DI$22)>0,$E26*$F26,0)","v":0},null,{"$f":"IF(SUM(DK$15:DK$22)>0,$E26*$F26,0)","v":0},null,{"$f":"IF(SUM(DM$15:DM$22)>0,$E26*$F26,0)","v":0},null,{"$f":"IF(SUM(DO$15:DO$22)>0,$E26*$F26,0)","v":0},null,{"$f":"IF(SUM(DQ$15:DQ$22)>0,$E26*$F26,0)","v":0},null,{"$f":"IF(SUM(DS$15:DS$22)>0,$E26*$F26,0)","v":0},null,{"$f":"IF(SUM(DU$15:DU$22)>0,$E26*$F26,0)","v":0},null,{"$f":"IF(SUM(DW$15:DW$22)>0,$E26*$F26,0)","v":0}]
[null,null,null,null,null,null,null,null,null,{"$f":"IF(SUM(I$15:I$22)>0,$E27*$F27,0)","v":0},null,{"$f":"IF(SUM(K$15:K$22)>0,$E27*$F27,0)","v":0},null,{"$f":"IF(SUM(M$15:M$22)>0,$E27*$F27,0)","v":0},null,{"$f":"IF(SUM(O$15:O$22)>0,$E27*$F27,0)","v":0},null,{"$f":"IF(SUM(Q$15:Q$22)>0,$E27*$F27,0)","v":0},null,{"$f":"IF(SUM(S$15:S$22)>0,$E27*$F27,0)","v":0},null,{"$f":"IF(SUM(U$15:U$22)>0,$E27*$F27,0)","v":0},null,{"$f":"IF(SUM(W$15:W$22)>0,$E27*$F27,0)","v":0},null,{"$f":"IF(SUM(Y$15:Y$22)>0,$E27*$F27,0)","v":0},null,{"$f":"IF(SUM(AA$15:AA$22)>0,$E27*$F27,0)","v":0},null,{"$f":"IF(SUM(AC$15:AC$22)>0,$E27*$F27,0)","v":0},null,{"$f":"IF(SUM(AE$15:AE$22)>0,$E27*$F27,0)","v":0},null,{"$f":"IF(SUM(AG$15:AG$22)>0,$E27*$F27,0)","v":0},null,{"$f":"IF(SUM(AI$15:AI$22)>0,$E27*$F27,0)","v":0},null,{"$f":"IF(SUM(AK$15:AK$22)>0,$E27*$F27,0)","v":0},null,{"$f":"IF(SUM(AM$15:AM$22)>0,$E27*$F27,0)","v":0},null,{"$f":"IF(SUM(AO$15:AO$22)>0,$E27*$F27,0)","v":0},null,{"$f":"IF(SUM(AQ$15:AQ$22)>0,$E27*$F27,0)","v":0},null,{"$f":"IF(SUM(AS$15:AS$22)>0,$E27*$F27,0)","v":0},null,{"$f":"IF(SUM(AU$15:AU$22)>0,$E27*$F27,0)","v":0},null,{"$f":"IF(SUM(AW$15:AW$22)>0,$E27*$F27,0)","v":0},null,{"$f":"IF(SUM(AY$15:AY$22)>0,$E27*$F27,0)","v":0},null,{"$f":"IF(SUM(BA$15:BA$22)>0,$E27*$F27,0)","v":0},null,{"$f":"IF(SUM(BC$15:BC$22)>0,$E27*$F27,0)","v":0},null,{"$f":"IF(SUM(BE$15:BE$22)>0,$E27*$F27,0)","v":0},null,{"$f":"IF(SUM(BG$15:BG$22)>0,$E27*$F27,0)","v":0},null,{"$f":"IF(SUM(BI$15:BI$22)>0,$E27*$F27,0)","v":0},null,{"$f":"IF(SUM(BK$15:BK$22)>0,$E27*$F27,0)","v":0},null,{"$f":"IF(SUM(BM$15:BM$22)>0,$E27*$F27,0)","v":0},null,{"$f":"IF(SUM(BO$15:BO$22)>0,$E27*$F27,0)","v":0},null,{"$f":"IF(SUM(BQ$15:BQ$22)>0,$E27*$F27,0)","v":0},null,{"$f":"IF(SUM(BS$15:BS$22)>0,$E27*$F27,0)","v":0},null,{"$f":"IF(SUM(BU$15:BU$22)>0,$E27*$F27,0)","v":0},null,{"$f":"IF(SUM(BW$15:BW$22)>0,$E27*$F27,0)","v":0},null,{"$f":"IF(SUM(BY$15:BY$22)>0,$E27*$F27,0)","v":0},null,{"$f":"IF(SUM(CA$15:CA$22)>0,$E27*$F27,0)","v":0},null,{"$f":"IF(SUM(CC$15:CC$22)>0,$E27*$F27,0)","v":0},null,{"$f":"IF(SUM(CE$15:CE$22)>0,$E27*$F27,0)","v":0},null,{"$f":"IF(SUM(CG$15:CG$22)>0,$E27*$F27,0)","v":0},null,{"$f":"IF(SUM(CI$15:CI$22)>0,$E27*$F27,0)","v":0},null,{"$f":"IF(SUM(CK$15:CK$22)>0,$E27*$F27,0)","v":0},null,{"$f":"IF(SUM(CM$15:CM$22)>0,$E27*$F27,0)","v":0},null,{"$f":"IF(SUM(CO$15:CO$22)>0,$E27*$F27,0)","v":0},null,{"$f":"IF(SUM(CQ$15:CQ$22)>0,$E27*$F27,0)","v":0},null,{"$f":"IF(SUM(CS$15:CS$22)>0,$E27*$F27,0)","v":0},null,{"$f":"IF(SUM(CU$15:CU$22)>0,$E27*$F27,0)","v":0},null,{"$f":"IF(SUM(CW$15:CW$22)>0,$E27*$F27,0)","v":0},null,{"$f":"IF(SUM(CY$15:CY$22)>0,$E27*$F27,0)","v":0},null,{"$f":"IF(SUM(DA$15:DA$22)>0,$E27*$F27,0)","v":0},null,{"$f":"IF(SUM(DC$15:DC$22)>0,$E27*$F27,0)","v":0},null,{"$f":"IF(SUM(DE$15:DE$22)>0,$E27*$F27,0)","v":0},null,{"$f":"IF(SUM(DG$15:DG$22)>0,$E27*$F27,0)","v":0},null,{"$f":"IF(SUM(DI$15:DI$22)>0,$E27*$F27,0)","v":0},null,{"$f":"IF(SUM(DK$15:DK$22)>0,$E27*$F27,0)","v":0},null,{"$f":"IF(SUM(DM$15:DM$22)>0,$E27*$F27,0)","v":0},null,{"$f":"IF(SUM(DO$15:DO$22)>0,$E27*$F27,0)","v":0},null,{"$f":"IF(SUM(DQ$15:DQ$22)>0,$E27*$F27,0)","v":0},null,{"$f":"IF(SUM(DS$15:DS$22)>0,$E27*$F27,0)","v":0},null,{"$f":"IF(SUM(DU$15:DU$22)>0,$E27*$F27,0)","v":0},null,{"$f":"IF(SUM(DW$15:DW$22)>0,$E27*$F27,0)","v":0}]
[null,null,null,null,null,null,null,null,null,{"$f":"IF(SUM(I$15:I$22)>0,$E28*$F28,0)","v":0},null,{"$f":"IF(SUM(K$15:K$22)>0,$E28*$F28,0)","v":0},null,{"$f":"IF(SUM(M$15:M$22)>0,$E28*$F28,0)","v":0},null,{"$f":"IF(SUM(O$15:O$22)>0,$E28*$F28,0)","v":0},null,{"$f":"IF(SUM(Q$15:Q$22)>0,$E28*$F28,0)","v":0},null,{"$f":"IF(SUM(S$15:S$22)>0,$E28*$F28,0)","v":0},null,{"$f":"IF(SUM(U$15:U$22)>0,$E28*$F28,0)","v":0},null,{"$f":"IF(SUM(W$15:W$22)>0,$E28*$F28,0)","v":0},null,{"$f":"IF(SUM(Y$15:Y$22)>0,$E28*$F28,0)","v":0},null,{"$f":"IF(SUM(AA$15:AA$22)>0,$E28*$F28,0)","v":0},null,{"$f":"IF(SUM(AC$15:AC$22)>0,$E28*$F28,0)","v":0},null,{"$f":"IF(SUM(AE$15:AE$22)>0,$E28*$F28,0)","v":0},null,{"$f":"IF(SUM(AG$15:AG$22)>0,$E28*$F28,0)","v":0},null,{"$f":"IF(SUM(AI$15:AI$22)>0,$E28*$F28,0)","v":0},null,{"$f":"IF(SUM(AK$15:AK$22)>0,$E28*$F28,0)","v":0},null,{"$f":"IF(SUM(AM$15:AM$22)>0,$E28*$F28,0)","v":0},null,{"$f":"IF(SUM(AO$15:AO$22)>0,$E28*$F28,0)","v":0},null,{"$f":"IF(SUM(AQ$15:AQ$22)>0,$E28*$F28,0)","v":0},null,{"$f":"IF(SUM(AS$15:AS$22)>0,$E28*$F28,0)","v":0},null,{"$f":"IF(SUM(AU$15:AU$22)>0,$E28*$F28,0)","v":0},null,{"$f":"IF(SUM(AW$15:AW$22)>0,$E28*$F28,0)","v":0},null,{"$f":"IF(SUM(AY$15:AY$22)>0,$E28*$F28,0)","v":0},null,{"$f":"IF(SUM(BA$15:BA$22)>0,$E28*$F28,0)","v":0},null,{"$f":"IF(SUM(BC$15:BC$22)>0,$E28*$F28,0)","v":0},null,{"$f":"IF(SUM(BE$15:BE$22)>0,$E28*$F28,0)","v":0},null,{"$f":"IF(SUM(BG$15:BG$22)>0,$E28*$F28,0)","v":0},null,{"$f":"IF(SUM(BI$15:BI$22)>0,$E28*$F28,0)","v":0},null,{"$f":"IF(SUM(BK$15:BK$22)>0,$E28*$F28,0)","v":0},null,{"$f":"IF(SUM(BM$15:BM$22)>0,$E28*$F28,0)","v":0},null,{"$f":"IF(SUM(BO$15:BO$22)>0,$E28*$F28,0)","v":0},null,{"$f":"IF(SUM(BQ$15:BQ$22)>0,$E28*$F28,0)","v":0},null,{"$f":"IF(SUM(BS$15:BS$22)>0,$E28*$F28,0)","v":0},null,{"$f":"IF(SUM(BU$15:BU$22)>0,$E28*$F28,0)","v":0},null,{"$f":"IF(SUM(BW$15:BW$22)>0,$E28*$F28,0)","v":0},null,{"$f":"IF(SUM(BY$15:BY$22)>0,$E28*$F28,0)","v":0},null,{"$f":"IF(SUM(CA$15:CA$22)>0,$E28*$F28,0)","v":0},null,{"$f":"IF(SUM(CC$15:CC$22)>0,$E28*$F28,0)","v":0},null,{"$f":"IF(SUM(CE$15:CE$22)>0,$E28*$F28,0)","v":0},null,{"$f":"IF(SUM(CG$15:CG$22)>0,$E28*$F28,0)","v":0},null,{"$f":"IF(SUM(CI$15:CI$22)>0,$E28*$F28,0)","v":0},null,{"$f":"IF(SUM(CK$15:CK$22)>0,$E28*$F28,0)","v":0},null,{"$f":"IF(SUM(CM$15:CM$22)>0,$E28*$F28,0)","v":0},null,{"$f":"IF(SUM(CO$15:CO$22)>0,$E28*$F28,0)","v":0},null,{"$f":"IF(SUM(CQ$15:CQ$22)>0,$E28*$F28,0)","v":0},null,{"$f":"IF(SUM(CS$15:CS$22)>0,$E28*$F28,0)","v":0},null,{"$f":"IF(SUM(CU$15:CU$22)>0,$E28*$F28,0)","v":0},null,{"$f":"IF(SUM(CW$15:CW$22)>0,$E28*$F28,0)","v":0},null,{"$f":"IF(SUM(CY$15:CY$22)>0,$E28*$F28,0)","v":0},null,{"$f":"IF(SUM(DA$15:DA$22)>0,$E28*$F28,0)","v":0},null,{"$f":"IF(SUM(DC$15:DC$22)>0,$E28*$F28,0)","v":0},null,{"$f":"IF(SUM(DE$15:DE$22)>0,$E28*$F28,0)","v":0},null,{"$f":"IF(SUM(DG$15:DG$22)>0,$E28*$F28,0)","v":0},null,{"$f":"IF(SUM(DI$15:DI$22)>0,$E28*$F28,0)","v":0},null,{"$f":"IF(SUM(DK$15:DK$22)>0,$E28*$F28,0)","v":0},null,{"$f":"IF(SUM(DM$15:DM$22)>0,$E28*$F28,0)","v":0},null,{"$f":"IF(SUM(DO$15:DO$22)>0,$E28*$F28,0)","v":0},null,{"$f":"IF(SUM(DQ$15:DQ$22)>0,$E28*$F28,0)","v":0},null,{"$f":"IF(SUM(DS$15:DS$22)>0,$E28*$F28,0)","v":0},null,{"$f":"IF(SUM(DU$15:DU$22)>0,$E28*$F28,0)","v":0},null,{"$f":"IF(SUM(DW$15:DW$22)>0,$E28*$F28,0)","v":0}]

{"sheet":"Mat Perm","index":27,"n_rows":113,"n_cols":136,"rows_kept":113,"cut":false,"hidden":true,"merged":[[9,1,9,3],[10,1,10,14]]}
[null,null,"CÂMARA DOS DEPUTADOS"]
[null,null,"DEPARTAMENTO TÉCNICO"]
[null,null,"Coordenação de Planejamento e Gestão"]
[]
[null,null,"Data:",{"$f":"'Dados Gerais'!#REF!","v":{"$error":"#REF!"}}]
[null,null,"Processo:",{"$f":"'Dados Gerais'!#REF!","v":{"$error":"#REF!"}}]
[null,null,"Objeto:",{"$f":"'Dados Gerais'!#REF!","v":{"$error":"#REF!"}}]
[]
[]
[]
[null,"MATERIAIS PERMANENTES RELACIONADOS AO POSTO - PAGAMENTO DA DEPRECIAÇÃO / MANUTENÇÃO",null,null,null,null,null,null,null,null,null,null,null,null,null,null,1,null,{"$f":"Q11+1","v":2},null,{"$f":"S11+1","v":3},null,{"$f":"U11+1","v":4},null,{"$f":"W11+1","v":5},null,{"$f":"Y11+1","v":6},null,{"$f":"AA11+1","v":7},null,{"$f":"AC11+1","v":8},null,{"$f":"AE11+1","v":9},null,{"$f":"AG11+1","v":10},null,{"$f":"AI11+1","v":11},null,{"$f":"AK11+1","v":12},null,{"$f":"AM11+1","v":13},null,{"$f":"AO11+1","v":14},null,{"$f":"AQ11+1","v":15},null,{"$f":"AS11+1","v":16},null,{"$f":"AU11+1","v":17},null,{"$f":"AW11+1","v":18},null,{"$f":"AY11+1","v":19},null,{"$f":"BA11+1","v":20},null,{"$f":"BC11+1","v":21},null,{"$f":"BE11+1","v":22},null,{"$f":"BG11+1","v":23},null,{"$f":"BI11+1","v":24},null,{"$f":"BK11+1","v":25},null,{"$f":"BM11+1","v":26},null,{"$f":"BO11+1","v":27},null,{"$f":"BQ11+1","v":28},null,{"$f":"BS11+1","v":29},null,{"$f":"BU11+1","v":30},null,{"$f":"BW11+1","v":31},null,{"$f":"BY11+1","v":32},null,{"$f":"CA11+1","v":33},null,{"$f":"CC11+1","v":34},null,{"$f":"CE11+1","v":35},null,{"$f":"CG11+1","v":36},null,{"$f":"CI11+1","v":37},null,{"$f":"CK11+1","v":38},null,{"$f":"CM11+1","v":39},null,{"$f":"CO11+1","v":40},null,{"$f":"CQ11+1","v":41},null,{"$f":"CS11+1","v":42},null,{"$f":"CU11+1","v":43},null,{"$f":"CW11+1","v":44},null,{"$f":"CY11+1","v":45},null,{"$f":"DA11+1","v":46},null,{"$f":"DC11+1","v":47},null,{"$f":"DE11+1","v":48},null,{"$f":"DG11+1","v":49},null,{"$f":"DI11+1","v":50},null,{"$f":"DK11+1","v":51},null,{"$f":"DM11+1","v":52},null,{"$f":"DO11+1","v":53},null,{"$f":"DQ11+1","v":54},null,{"$f":"DS11+1","v":55},null,{"$f":"DU11+1","v":56},null,{"$f":"DW11+1","v":57},null,{"$f":"DY11+1","v":58},null,{"$f":"EA11+1","v":59},null,{"$f":"EC11+1","v":60}]
[]
[null,null,null,null,null,null,null,null,null,null,null,null,null,null,null,null,{"$f":"SUM(R12:R94)","v":0},null,{"$f":"SUM(T12:T94)","v":0},null,{"$f":"SUM(V12:V94)","v":0},null,{"$f":"SUM(X12:X94)","v":0},null,{"$f":"SUM(Z12:Z94)","v":0},null,{"$f":"SUM(AB12:AB94)","v":0},null,{"$f":"SUM(AD12:AD94)","v":0},null,{"$f":"SUM(AF12:AF94)","v":0},null,{"$f":"SUM(AH12:AH94)","v":0},null,{"$f":"SUM(AJ12:AJ94)","v":0},null,{"$f":"SUM(AL12:AL94)","v":0},null,{"$f":"SUM(AN12:AN94)","v":0},null,{"$f":"SUM(AP12:AP94)","v":0},null,{"$f":"SUM(AR12:AR94)","v":0},null,{"$f":"SUM(AT12:AT94)","v":0},null,{"$f":"SUM(AV12:AV94)","v":0},null,{"$f":"SUM(AX12:AX94)","v":0},null,{"$f":"SUM(AZ12:AZ94)","v":0},null,{"$f":"SUM(BB12:BB94)","v":0},null,{"$f":"SUM(BD12:BD94)","v":0},null,{"$f":"SUM(BF12:BF94)","v":0},null,{"$f":"SUM(BH12:BH94)","v":0},null,{"$f":"SUM(BJ12:BJ94)","v":0},null,{"$f":"SUM(BL12:BL94)","v":0},null,{"$f":"SUM(BN12:BN94)","v":0},null,{"$f":"SUM(BP12:BP94)","v":0},null,{"$f":"SUM(BR12:BR94)","v":0},null,{"$f":"SUM(BT12:BT94)","v":0},null,{"$f":"SUM(BV12:BV94)","v":0},null,{"$f":"SUM(BX12:BX94)","v":0},null,{"$f":"SUM(BZ12:BZ94)","v":0},null,{"$f":"SUM(CB12:CB94)","v":0},null,{"$f":"SUM(CD12:CD94)","v":0},null,{"$f":"SUM(CF12:CF94)","v":0},null,{"$f":"SUM(CH12:CH94)","v":0},null,{"$f":"SUM(CJ12:CJ94)","v":0},null,{"$f":"SUM(CL12:CL94)","v":0},null,{"$f":"SUM(CN12:CN94)","v":0},null,{"$f":"SUM(CP12:CP94)","v":0},null,{"$f":"SUM(CR12:CR94)","v":0},null,{"$f":"SUM(CT12:CT94)","v":0},null,{"$f":"SUM(CV12:CV94)","v":0},null,{"$f":"SUM(CX12:CX94)","v":0},null,{"$f":"SUM(CZ12:CZ94)","v":0},null,{"$f":"SUM(DB12:DB94)","v":0},null,{"$f":"SUM(DD12:DD94)","v":0},null,{"$f":"SUM(DF12:DF94)","v":0},null,{"$f":"SUM(DH12:DH94)","v":0},null,{"$f":"SUM(DJ12:DJ94)","v":0},null,{"$f":"SUM(DL12:DL94)","v":0},null,{"$f":"SUM(DN12:DN94)","v":0},null,{"$f":"SUM(DP12:DP94)","v":0},null,{"$f":"SUM(DR12:DR94)","v":0},null,{"$f":"SUM(DT12:DT94)","v":0},null,{"$f":"SUM(DV12:DV94)","v":0},null,{"$f":"SUM(DX12:DX94)","v":0},null,{"$f":"SUM(DZ12:DZ94)","v":0},null,{"$f":"SUM(EB12:EB94)","v":0},null,{"$f":"SUM(ED12:ED94)","v":0},null,{"$f":"SUM(EF12:EF94)","v":0}]
[null,null,"CATEGORIAS",null,"QUANTIDADE"]
[null,null,null,null,null,null,null,null,null,null,null,null,null,null,null,null,{"$f":"IF($C15=Q$11,1,0)","v":0},null,{"$f":"IF($C15=S$11,1,0)","v":0},null,{"$f":"IF($C15=U$11,1,0)","v":0},null,{"$f":"IF($C15=W$11,1,0)","v":0},null,{"$f":"IF($C15=Y$11,1,0)","v":0},null,{"$f":"IF($C15=AA$11,1,0)","v":0},null,{"$f":"IF($C15=AC$11,1,0)","v":0},null,{"$f":"IF($C15=AE$11,1,0)","v":0},null,{"$f":"IF($C15=AG$11,1,0)","v":0},null,{"$f":"IF($C15=AI$11,1,0)","v":0},null,{"$f":"IF($C15=AK$11,1,0)","v":0},null,{"$f":"IF($C15=AM$11,1,0)","v":0},null,{"$f":"IF($C15=AO$11,1,0)","v":0},null,{"$f":"IF($C15=AQ$11,1,0)","v":0},null,{"$f":"IF($C15=AS$11,1,0)","v":0},null,{"$f":"IF($C15=AU$11,1,0)","v":0},null,{"$f":"IF($C15=AW$11,1,0)","v":0},null,{"$f":"IF($C15=AY$11,1,0)","v":0},null,{"$f":"IF($C15=BA$11,1,0)","v":0},null,{"$f":"IF($C15=BC$11,1,0)","v":0},null,{"$f":"IF($C15=BE$11,1,0)","v":0},null,{"$f":"IF($C15=BG$11,1,0)","v":0},null,{"$f":"IF($C15=BI$11,1,0)","v":0},null,{"$f":"IF($C15=BK$11,1,0)","v":0},null,{"$f":"IF($C15=BM$11,1,0)","v":0},null,{"$f":"IF($C15=BO$11,1,0)","v":0},null,{"$f":"IF($C15=BQ$11,1,0)","v":0},null,{"$f":"IF($C15=BS$11,1,0)","v":0},null,{"$f":"IF($C15=BU$11,1,0)","v":0},null,{"$f":"IF($C15=BW$11,1,0)","v":0},null,{"$f":"IF($C15=BY$11,1,0)","v":0},null,{"$f":"IF($C15=CA$11,1,0)","v":0},null,{"$f":"IF($C15=CC$11,1,0)","v":0},null,{"$f":"IF($C15=CE$11,1,0)","v":0},null,{"$f":"IF($C15=CG$11,1,0)","v":0},null,{"$f":"IF($C15=CI$11,1,0)","v":0},null,{"$f":"IF($C15=CK$11,1,0)","v":0},null,{"$f":"IF($C15=CM$11,1,0)","v":0},null,{"$f":"IF($C15=CO$11,1,0)","v":0},null,{"$f":"IF($C15=CQ$11,1,0)","v":0},null,{"$f":"IF($C15=CS$11,1,0)","v":0},null,{"$f":"IF($C15=CU$11,1,0)","v":0},null,{"$f":"IF($C15=CW$11,1,0)","v":0},null,{"$f":"IF($C15=CY$11,1,0)","v":0},null,{"$f":"IF($C15=DA$11,1,0)","v":0},null,{"$f":"IF($C15=DC$11,1,0)","v":0},null,{"$f":"IF($C15=DE$11,1,0)","v":0},null,{"$f":"IF($C15=DG$11,1,0)","v":0},null,{"$f":"IF($C15=DI$11,1,0)","v":0},null,{"$f":"IF($C15=DK$11,1,0)","v":0},null,{"$f":"IF($C15=DM$11,1,0)","v":0},null,{"$f":"IF($C15=DO$11,1,0)","v":0},null,{"$f":"IF($C15=DQ$11,1,0)","v":0},null,{"$f":"IF($C15=DS$11,1,0)","v":0},null,{"$f":"IF($C15=DU$11,1,0)","v":0},null,{"$f":"IF($C15=DW$11,1,0)","v":0},null,{"$f":"IF($C15=DY$11,1,0)","v":0},null,{"$f":"IF($C15=EA$11,1,0)","v":0},null,{"$f":"IF($C15=EC$11,1,0)","v":0},null,{"$f":"IF($C15=EE$11,1,0)","v":0}]
[null,null,null,{"$f":"HLOOKUP($C16,'Dados Gerais'!$D$5:$BK$10,6)","v":{"$error":"#N/A"}},{"$f":"HLOOKUP($C16,'Dados Gerais'!$D$5:$BK$14,10)","v":{"$error":"#N/A"}},null,null,null,null,null,null,null,null,null,null,null,0,null,0,null,0,null,0,null,0,null,0,null,0,null,0,null,0,null,0,null,0,null,0,null,0,null,0,null,0,null,0,null,0,null,0,null,0,null,0,null,0,null,0,null,0,null,0,null,0,null,0,null,0,null,0,null,0,null,0,null,0,null,0,null,0,null,0,null,0,null,0,null,0,null,0,null,0,null,0,null,0,null,0,null,0,null,0,null,0,null,0,null,0,null,0,null,0,null,0,null,0,null,0,null,0,null,0,null,0,null,0,null,0,null,0,null,0,null,0]
[null,null,null,{"$f":"HLOOKUP($C17,'Dados Gerais'!$D$5:$BK$10,6)","v":{"$error":"#N/A"}},{"$f":"HLOOKUP($C17,'Dados Gerais'!$D$5:$BK$14,10)","v":{"$error":"#N/A"}},null,null,null,null,null,null,null,null,null,null,null,0,null,0,null,0,null,0,null,0,null,0,null,0,null,0,null,0,null,0,null,0,null,0,null,0,null,0,null,0,null,0,null,0,null,0,null,0,null,0,null,0,null,0,null,0,null,0,null,0,null,0,null,0,null,0,null,0,null,0,null,0,null,0,null,0,null,0,null,0,null,0,null,0,null,0,null,0,null,0,null,0,null,0,null,0,null,0,null,0,null,0,null,0,null,0,null,0,null,0,null,0,null,0,null,0,null,0,null,0,null,0,null,0,null,0,null,0,null,0]
[null,null,null,{"$f":"HLOOKUP($C18,'Dados Gerais'!$D$5:$BK$10,6)","v":{"$error":"#N/A"}},{"$f":"HLOOKUP($C18,'Dados Gerais'!$D$5:$BK$14,10)","v":{"$error":"#N/A"}},null,null,null,null,null,null,null,null,null,null,null,0,null,0,null,0,null,0,null,0,null,0,null,0,null,0,null,0,null,0,null,0,null,0,null,0,null,0,null,0,null,0,null,0,null,0,null,0,null,0,null,0,null,0,null,0,null,0,null,0,null,0,null,0,null,0,null,0,null,0,null,0,null,0,null,0,null,0,null,0,null,0,null,0,null,0,null,0,null,0,null,0,null,0,null,0,null,0,null,0,null,0,null,0,null,0,null,0,null,0,null,0,null,0,null,0,null,0,null,0,null,0,null,0,null,0,null,0,null,0]
[null,null,null,{"$f":"HLOOKUP($C19,'Dados Gerais'!$D$5:$BK$10,6)","v":{"$error":"#N/A"}},{"$f":"HLOOKUP($C19,'Dados Gerais'!$D$5:$BK$14,10)","v":{"$error":"#N/A"}},null,null,null,null,null,null,null,null,null,null,null,0,null,0,null,0,null,0,null,0,null,0,null,0,null,0,null,0,null,0,null,0,null,0,null,0,null,0,null,0,null,0,null,0,null,0,null,0,null,0,null,0,null,0,null,0,null,0,null,0,null,0,null,0,null,0,null,0,null,0,null,0,null,0,null,0,null,0,null,0,null,0,null,0,null,0,null,0,null,0,null,0,null,0,null,0,null,0,null,0,null,0,null,0,null,0,null,0,null,0,null,0,null,0,null,0,null,0,null,0,null,0,null,0,null,0,null,0,null,0]
[null,null,null,{"$f":"HLOOKUP($C20,'Dados Gerais'!$D$5:$BK$10,6)","v":{"$error":"#N/A"}},{"$f":"HLOOKUP($C20,'Dados Gerais'!$D$5:$BK$14,10)","v":{"$error":"#N/A"}},null,null,null,null,null,null,null,null,null,null,null,0,null,0,null,0,null,0,null,0,null,0,null,0,null,0,null,0,null,0,null,0,null,0,null,0,null,0,null,0,null,0,null,0,null,0,null,0,null,0,null,0,null,0,null,0,null,0,null,0,null,0,null,0,null,0,null,0,null,0,null,0,null,0,null,0,null,0,null,0,null,0,null,0,null,0,null,0,null,0,null,0,null,0,null,0,null,0,null,0,null,0,null,0,null,0,null,0,null,0,null,0,null,0,null,0,null,0,null,0,null,0,null,0,null,0,null,0,null,0]
[null,null,null,{"$f":"HLOOKUP($C21,'Dados Gerais'!$D$5:$BK$10,6)","v":{"$error":"#N/A"}},{"$f":"HLOOKUP($C21,'Dados Gerais'!$D$5:$BK$14,10)","v":{"$error":"#N/A"}},null,null,null,null,null,null,null,null,null,null,null,0,null,0,null,0,null,0,null,0,null,0,null,0,null,0,null,0,null,0,null,0,null,0,null,0,null,0,null,0,null,0,null,0,null,0,null,0,null,0,null,0,null,0,null,0,null,0,null,0,null,0,null,0,null,0,null,0,null,0,null,0,null,0,null,0,null,0,null,0,null,0,null,0,null,0,null,0,null,0,null,0,null,0,null,0,null,0,null,0,null,0,null,0,null,0,null,0,null,0,null,0,null,0,null,0,null,0,null,0,null,0,null,0,null,0,null,0,null,0]
[null,null,null,null,null,null,null,null,null,null,null,null,null,null,null,null,0,null,0,null,0,null,0,null,0,null,0,null,0,null,0,null,0,null,0,null,0,null,0,null,0,null,0,null,0,null,0,null,0,null,0,null,0,null,0,null,0,null,0,null,0,null,0,null,0,null,0,null,0,null,0,null,0,null,0,null,0,null,0,null,0,null,0,null,0,null,0,null,0,null,0,null,0,null,0,null,0,null,0,null,0,null,0,null,0,null,0,null,0,null,0,null,0,null,0,null,0,null,0,null,0,null,0,null,0,null,0,null,0,null,0,null,0,null,0]
[]
[null,null,"PAGAMENTO DA DEPRECIAÇÃO"]
[null,null,"ITEM","DESCRIÇÃO","QUANT ANUAL","CONTA SIAFI","VALOR DE AQ.","% RESIDUAL","VIDA ÚTIL","DEP. MENSAL","CUSTO TOTAL","BDI (%)","PREÇO TOTAL","FONTE","REFERÊNCIA"]
[]
[null,null,null,null,null,"12311.01.09",89.34,0.1,10,{"$f":"G27*(1-H27)/(I27*12)","v":0.67005000000000003},{"$f":"J27*E27","v":0},{"$f":"BDI!$E$26","v":0.21690000000000001},{"$f":"ROUND(K27*(1+L27),2)","v":0},"COTAÇÃO"]
[null,null,null,null,null,"12311.01.09",39,0.1,10,{"$f":"G28*(1-H28)/(I28*12)","v":0.29250000000000004},{"$f":"J28*E28","v":0},{"$f":"BDI!$E$26","v":0.21690000000000001},{"$f":"ROUND(K28*(1+L28),2)","v":0},"COTAÇÃO"]
[null,null,null,null,null,"12311.01.09",22.08,0.1,10,0.1656,0,{"$f":"BDI!$E$26","v":0.21690000000000001},0,"COTAÇÃO"]
[null,null,null,null,null,"12311.01.09",8.02,0.1,10,6.0150000000000002E-2,0,{"$f":"BDI!$E$26","v":0.21690000000000001},0,"COTAÇÃO"]
[null,null,null,null,null,"12311.01.09",15.64,0.1,10,0.1173,0,{"$f":"BDI!$E$26","v":0.21690000000000001},0,"COTAÇÃO"]
[null,null,null,null,null,"12311.01.09",7.63,0.1,10,5.7224999999999998E-2,0,{"$f":"BDI!$E$26","v":0.21690000000000001},0,"COTAÇÃO"]
[null,null,null,null,null,"12311.01.09",21.48,0.1,10,0.16109999999999999,0,{"$f":"BDI!$E$26","v":0.21690000000000001},0,"COTAÇÃO"]
[null,null,null,null,null,"12311.01.09",7.87,0.1,10,5.9025000000000001E-2,0,{"$f":"BDI!$E$26","v":0.21690000000000001},0,"COTAÇÃO"]
[null,null,null,null,null,"12311.01.09",6.73,0.1,10,5.0475000000000006E-2,0,{"$f":"BDI!$E$26","v":0.21690000000000001},0,"COTAÇÃO"]
[null,null,null,null,null,"12311.01.09",15.35,0.1,10,0.11512499999999999,0,{"$f":"BDI!$E$26","v":0.21690000000000001},0,"COTAÇÃO"]
[null,null,null,null,null,"12311.01.09",12.86,0.1,10,9.6449999999999994E-2,0,{"$f":"BDI!$E$26","v":0.21690000000000001},0,"COTAÇÃO"]
[null,null,null,null,null,"12311.01.09",10.119999999999999,0.1,10,7.5899999999999995E-2,0,{"$f":"BDI!$E$26","v":0.21690000000000001},0,"COTAÇÃO"]
[null,null,null,null,null,"12311.01.09",61.31,0.1,10,0.45982500000000004,0,{"$f":"BDI!$E$26","v":0.21690000000000001},0,"COTAÇÃO"]
[null,null,null,null,null,"12311.01.09",40.409999999999997,0.1,10,0.30307499999999998,0,{"$f":"BDI!$E$26","v":0.21690000000000001},0,"COTAÇÃO"]
[null,null,null,null,null,"12311.01.09",120.53,0.1,10,0.90397500000000008,0,{"$f":"BDI!$E$26","v":0.21690000000000001},0,"COTAÇÃO"]
[null,null,null,null,null,"12311.01.09",31.48,0.1,10,0.2361,0,{"$f":"BDI!$E$26","v":0.21690000000000001},0,"COTAÇÃO"]
[null,null,null,null,null,"12311.01.09",191.93,0.1,10,1.4394750000000003,0,{"$f":"BDI!$E$26","v":0.21690000000000001},0,"COTAÇÃO"]
[null,null,null,null,null,"12311.01.09",92.78,0.1,10,0.69585000000000008,0,{"$f":"BDI!$E$26","v":0.21690000000000001},0,"COTAÇÃO"]
[null,null,null,null,null,"12311.01.09",36.01,0.1,10,0.27007500000000001,0,{"$f":"BDI!$E$26","v":0.21690000000000001},0,"COTAÇÃO"]
[null,null,null,null,null,"12311.01.09",16.579999999999998,0.1,10,0.12434999999999999,0,{"$f":"BDI!$E$26","v":0.21690000000000001},0,"COTAÇÃO"]
[null,null,null,null,null,"12311.01.09",57.93,0.1,10,0.434475,0,{"$f":"BDI!$E$26","v":0.21690000000000001},0,"COTAÇÃO"]
[null,null,null,null,null,"12311.01.09",47.81,0.1,10,0.35857500000000003,0,{"$f":"BDI!$E$26","v":0.21690000000000001},0,"COTAÇÃO"]
[null,null,null,null,null,"12311.01.09",31.18,0.1,10,0.23385,0,{"$f":"BDI!$E$26","v":0.21690000000000001},0,"COTAÇÃO"]
[null,null,null,null,null,"12311.01.09",23.95,0.1,10,0.17962500000000001,0,{"$f":"BDI!$E$26","v":0.21690000000000001},0,"COTAÇÃO"]
[null,null,null,null,null,"12311.01.09",35.04,0.1,10,0.26280000000000003,0,{"$f":"BDI!$E$26","v":0.21690000000000001},0,"COTAÇÃO"]
[null,null,null,null,null,"12311.01.09",200.31,0.1,10,1.5023249999999999,0,{"$f":"BDI!$E$26","v":0.21690000000000001},0,"COTAÇÃO"]
[null,null,null,null,null,"12311.01.09",79.59,0.1,10,0.59692500000000004,0,{"$f":"BDI!$E$26","v":0.21690000000000001},0,"COTAÇÃO"]
[null,null,null,null,null,"12311.01.09",227.75,0.1,10,1.7081249999999999,0,{"$f":"BDI!$E$26","v":0.21690000000000001},0,"COTAÇÃO"]
[null,null,null,null,null,"12311.01.09",127.59,0.1,10,0.95692500000000003,0,{"$f":"BDI!$E$26","v":0.21690000000000001},0,"COTAÇÃO"]
[]
[]
[null,null,"PAGAMENTO DA MANUTENÇÃO"]
[null,null,"ITEM","DESCRIÇÃO",null,null,null,"K (calculado)","MENSAL DEPR.","% MAN X DEP","MENSAL MAN.","BDI (%)","PREÇO TOTAL"]
[]
[null,null,null,null,null,null,null,{"$f":"H68","v":0.42411600000000005},{"$f":"SUM(M27:M55)","v":0},{"$f":"H61","v":0.42411600000000005},{"$f":"I61*H61","v":0},{"$f":"L27","v":0.21690000000000001},{"$f":"ROUND(K61*(1+L61),2)","v":0}]
[]
[null,null,null,null,"K1","K2","K3","K4"]
[null,null,null,null,0.85,1,0.8,1]
[null,null,null,null,"K5","K6","K7","K8"]
[null,null,null,null,1,0.6,0.5,1.1000000000000001]
[null,null,null,null,"K9","K10","K11","RESULTADO"]
[null,null,null,"* a descrição de cada coeficiente segue abaixo",1.5,0.9,1.4,{"$f":"E64*F64*G64*H64*E66*F66*G66*H66*E68*F68*G68","v":0.42411600000000005}]
[]
[]
[null,null,"MATERIAL DE CONSUMO ASSOCIADO"]
[null,null,"ITEM","DESCRIÇÃO",null,null,null,"QUANTID/ANO","UNIDADE","VALOR DE AQ.","MENSAL MAT","BDI (%)","PREÇO TOTAL"]
[]
[null,null,null,null,null,null,null,null,null,null,{"$f":"J74*H74/12","v":0},{"$f":"L61","v":0.21690000000000001},{"$f":"ROUND(K74*(1+L74),2)","v":0}]
[]
[]
[null,null,"MATERIAL DE CONSUMO ASSOCIADO"]
[null,null,"ITEM","DESCRIÇÃO",null,null,null,null,null,null,null,null,"PREÇO TOTAL"]
[]
[null,null,1,"Componente DEPRECIAÇÃO - POR POSTO",null,null,null,null,null,null,null,null,{"$f":"I61","v":0}]
[null,null,2,"Componente MANUTENÇÃO - POR POSTO",null,null,null,null,null,null,null,null,{"$f":"M61","v":0}]
[null,null,3,"Componente MATERIAL DE CONSUMO ASSOCIADO - POR POSTO",null,null,null,null,null,null,null,null,{"$f":"M74","v":0}]
[]
[null,null,null,null,null,null,null,null,null,null,null,"SOMATÓRIO TOTAL MENSAL - POR POSTO",{"$f":"SUM(M79:M83)","v":0},null,null,null,null,{"$f":"IF(SUM(Q$15:Q$22)>0,$M84,0)","v":0},null,{"$f":"IF(SUM(S$15:S$22)>0,$M84,0)","v":0},null,{"$f":"IF(SUM(U$15:U$22)>0,$M84,0)","v":0},null,{"$f":"IF(SUM(W$15:W$22)>0,$M84,0)","v":0},null,{"$f":"IF(SUM(Y$15:Y$22)>0,$M84,0)","v":0},null,{"$f":"IF(SUM(AA$15:AA$22)>0,$M84,0)","v":0},null,{"$f":"IF(SUM(AC$15:AC$22)>0,$M84,0)","v":0},null,{"$f":"IF(SUM(AE$15:AE$22)>0,$M84,0)","v":0},null,{"$f":"IF(SUM(AG$15:AG$22)>0,$M84,0)","v":0},null,{"$f":"IF(SUM(AI$15:AI$22)>0,$M84,0)","v":0},null,{"$f":"IF(SUM(AK$15:AK$22)>0,$M84,0)","v":0},null,{"$f":"IF(SUM(AM$15:AM$22)>0,$M84,0)","v":0},null,{"$f":"IF(SUM(AO$15:AO$22)>0,$M84,0)","v":0},null,{"$f":"IF(SUM(AQ$15:AQ$22)>0,$M84,0)","v":0},null,{"$f":"IF(SUM(AS$15:AS$22)>0,$M84,0)","v":0},null,{"$f":"IF(SUM(AU$15:AU$22)>0,$M84,0)","v":0},null,{"$f":"IF(SUM(AW$15:AW$22)>0,$M84,0)","v":0},null,{"$f":"IF(SUM(AY$15:AY$22)>0,$M84,0)","v":0},null,{"$f":"IF(SUM(BA$15:BA$22)>0,$M84,0)","v":0},null,{"$f":"IF(SUM(BC$15:BC$22)>0,$M84,0)","v":0},null,{"$f":"IF(SUM(BE$15:BE$22)>0,$M84,0)","v":0},null,{"$f":"IF(SUM(BG$15:BG$22)>0,$M84,0)","v":0},null,{"$f":"IF(SUM(BI$15:BI$22)>0,$M84,0)","v":0},null,{"$f":"IF(SUM(BK$15:BK$22)>0,$M84,0)","v":0},null,{"$f":"IF(SUM(BM$15:BM$22)>0,$M84,0)","v":0},null,{"$f":"IF(SUM(BO$15:BO$22)>0,$M84,0)","v":0},null,{"$f":"IF(SUM(BQ$15:BQ$22)>0,$M84,0)","v":0},null,{"$f":"IF(SUM(BS$15:BS$22)>0,$M84,0)","v":0},null,{"$f":"IF(SUM(BU$15:BU$22)>0,$M84,0)","v":0},null,{"$f":"IF(SUM(BW$15:BW$22)>0,$M84,0)","v":0},null,{"$f":"IF(SUM(BY$15:BY$22)>0,$M84,0)","v":0},null,{"$f":"IF(SUM(CA$15:CA$22)>0,$M84,0)","v":0},null,{"$f":"IF(SUM(CC$15:CC$22)>0,$M84,0)","v":0},null,{"$f":"IF(SUM(CE$15:CE$22)>0,$M84,0)","v":0},null,{"$f":"IF(SUM(CG$15:CG$22)>0,$M84,0)","v":0},null,{"$f":"IF(SUM(CI$15:CI$22)>0,$M84,0)","v":0},null,{"$f":"IF(SUM(CK$15:CK$22)>0,$M84,0)","v":0},null,{"$f":"IF(SUM(CM$15:CM$22)>0,$M84,0)","v":0},null,{"$f":"IF(SUM(CO$15:CO$22)>0,$M84,0)","v":0},null,{"$f":"IF(SUM(CQ$15:CQ$22)>0,$M84,0)","v":0},null,{"$f":"IF(SUM(CS$15:CS$22)>0,$M84,0)","v":0},null,{"$f":"IF(SUM(CU$15:CU$22)>0,$M84,0)","v":0},null,{"$f":"IF(SUM(CW$15:CW$22)>0,$M84,0)","v":0},null,{"$f":"IF(SUM(CY$15:CY$22)>0,$M84,0)","v":0},null,{"$f":"IF(SUM(DA$15:DA$22)>0,$M84,0)","v":0},null,{"$f":"IF(SUM(DC$15:DC$22)>0,$M84,0)","v":0},null,{"$f":"IF(SUM(DE$15:DE$22)>0,$M84,0)","v":0},null,{"$f":"IF(SUM(DG$15:DG$22)>0,$M84,0)","v":0},null,{"$f":"IF(SUM(DI$15:DI$22)>0,$M84,0)","v":0},null,{"$f":"IF(SUM(DK$15:DK$22)>0,$M84,0)","v":0},null,{"$f":"IF(SUM(DM$15:DM$22)>0,$M84,0)","v":0},null,{"$f":"IF(SUM(DO$15:DO$22)>0,$M84,0)","v":0},null,{"$f":"IF(SUM(DQ$15:DQ$22)>0,$M84,0)","v":0},null,{"$f":"IF(SUM(DS$15:DS$22)>0,$M84,0)","v":0},null,{"$f":"IF(SUM(DU$15:DU$22)>0,$M84,0)","v":0},null,{"$f":"IF(SUM(DW$15:DW$22)>0,$M84,0)","v":0},null,{"$f":"IF(SUM(DY$15:DY$22)>0,$M84,0)","v":0},null,{"$f":"IF(SUM(EA$15:EA$22)>0,$M84,0)","v":0},null,{"$f":"IF(SUM(EC$15:EC$22)>0,$M84,0)","v":0},null,{"$f":"IF(SUM(EE$15:EE$22)>0,$M84,0)","v":0}]
[null,null,null,null,null,null,null,null,null,null,null,"SOMATÓRIO TOTAL ANUAL - POR POSTO",{"$f":"M84*12","v":0}]
[]
[]
[null,null,"MATERIAL DE CONSUMO ASSOCIADO"]
[null,null,"MEMÓRIA DE CÁLCULO DO COEFICIENTE DE CORRELAÇÃO MANUTENÇÃO X DEPRECIAÇÃO (K)"]
[]
[null,null,"JUSTIFICATIVAS",null,"TIPO","K1",null,"Condições de Trab","K4",null,"Tempo Vida (anos)","K6",null,"Temperatura","K8"]
[null,null,null,null,"Guindaste",0.5,null,"Em espera",0.4,null,1,0.6,null,"Muito quente (> 40º C)",1.3]
[null,null,"K1","Considerado o valor médio de 0,85","Caminhão-comum",0.8,null,"Leves",0.8,null,2,0.7,null,"Quente (30º a 40º C)",1.1000000000000001]
[null,null,"K2","Considerado o operador médio","Fora-de-estrada",1,null,"Médias",1,null,3,0.8,null,"Médio (10º a 30º C)",1]
[null,null,"K3","Consideradas ferramentas de primeira qualidade","Carregadeira",1,null,"Pesadas",1.4,null,4,0.9,null,"Frio (< 10º C)",1.2]
[null,null,"K4","Há todo o tipo de trabalho, foi considerado o valor médio","Escavadeira",1.4,null,"Severas",2,null,5,1]
[null,null,"K5","Considerando manutenção normal","Motoescrêiper",1.1000000000000001,null,null,null,null,6,1,null,"Ritmo de Trabalho","K9"]
[null,null,"K6","Equipamentos novos","Trator de esteira",1.2,null,"Manutenção","K5",null,7,1,null,"Folgado",0.9]
[null,null,"K7","220h por mês, 252 dias por ano",null,null,null,"Excelente",0.6,null,8,1.2,null,"Médio ",1]
[null,null,"K8","Clima quente, acima de 30º C","Qualid do Operador","K2",null,"Boa",0.8,null,9,1.3,null,"Com pressa",1.5]
[null,null,"K9","Ritmo de trabalho usualmente com pressa","Excelente",0.8,null,"Média",1,null,10,1.4]
[null,null,"K10","Considerado o operador médio","Boa",0.9,null,"Ruim ",1.5,null,11,2,null,"Conh do Serviço","K10"]
[null,null,"K11","Foi considerada a opção de aluguel a terceiros, ainda que a simulação seja dos custos do contratado, contudo a execução dos serviços é em local de terceiros","Média",1,null,"Inexistente",3,null,15,2,null,"Grande ",0.8]
[null,null,null,null,"Ruim",1.2,null,null,null,null,null,null,null,"Médio     ",0.9]
[null,null,null,null,"Péssima",2,null,"Horas de Uso ","K7",6000,1,null,null,"Pouco ",1]
[null,null,null,null,null,null,null,1000,0.5,8000,1.3]
[null,null,null,null,"Qualidade do Equip","K3",null,2000,0.5,10000,1.6,null,null,"Tipo do Serviço","K11"]
[null,null,null,null,"De primeira",0.8,null,3000,0.6,12000,1.9,null,null,"Mina ou Pedreira",0.8]
[null,null,null,null,"Média",1,null,4000,0.7,15000,2.2999999999999998,null,null,"Construção Geral",1]
[null,null,null,null,"Ruim",1.5,null,5000,0.9,20000,3,null,null,"Aluguel a Terceiros",1.4]
[]
[null,null,null,null,"Fonte: "]
[null,null,null,null,"MATTOS, Aldo Dórea. Como preparar orçamentos de obras. São Paulo: Pini, 2006. 281 p., il"]