{"text_format":"1","workbook":"xlsx","n_sheets":28,"sheets":["GUIA PARA PREENCHIMENTO","MODELO PROPOSTA","Remunerações","Resumo","1","2","3","4","5","6","7","8","9","Dados Gerais","Encargos Sociais","BDI","Uniformes","EPI","SREP","Não Rel - EPI","Equip Rel","Não Rel - Depr","Não Rel - Mat Consumo","Não Rel - Mat Cons Durável","Não Rel - Serviços","Not. Demanda","Mat Cons","Mat Perm"],"not_rendered":{"charts":0,"images":9,"macros":1,"external_links":0,"defined_names":38,"comments":0,"pivot_tables":0},"unopened":[],"bounds":{"document_bytes":16777216,"sheet_cells":100000,"rows_first":2000,"rows_last":500,"rows_between":2000,"halvings":0,"cell_chars":16384,"cell_head_chars":4096},"cells_cut":0,"cells_raw":0,"read":"whole","date_system":"1900"}

{"sheet":"GUIA PARA PREENCHIMENTO","index":0,"n_rows":5,"n_cols":1,"rows_kept":5,"cut":false,"hidden":false,"merged":[]}
["GUIA PARA PREENCHIMENTO"]
[]
["1 - Preencher apenas as guias azuis:"]
[]
["2 - Recomendamos preencher somente as células com fundo azul claro. As demais possuem fórmulas e sugerimos não alterá-las."]

{"sheet":"MODELO PROPOSTA","index":1,"n_rows":83,"n_cols":2,"rows_kept":83,"cut":false,"hidden":false,"merged":[[68,1,68,9],[77,1,77,9],[78,1,78,9],[79,1,79,9],[82,1,82,9],[70,1,75,9],[54,1,55,9],[67,1,67,4],[67,5,67,9],[57,1,57,9],[60,1,60,9],[62,1,62,9],[64,1,64,9],[65,1,65,4],[65,5,65,9],[66,1,66,4],[66,5,66,9],[58,1,59,9],[45,1,45,9],[48,1,48,9],[50,1,50,9],[51,1,51,9],[52,1,52,9],[35,1,35,9],[41,6,41,10],[42,1,42,9],[43,1,43,9],[44,1,44,9],[36,1,40,9],[31,1,31,4],[31,5,31,9],[32,1,32,4],[32,5,32,9],[33,1,33,4],[33,5,33,9],[28,1,28,4],[28,5,28,9],[29,1,29,4],[29,5,29,9],[30,1,30,4],[30,5,30,9],[27,1,27,4],[27,5,27,9],[12,1,12,9],[13,1,13,9],[14,1,14,9],[16,1,16,9],[17,1,17,9],[18,1,18,2],[19,1,20,9],[21,1,21,9],[23,1,23,9],[24,1,24,9],[25,1,25,9],[11,1,11,9],[1,1,1,9],[4,1,4,9],[6,1,6,9],[10,1,10,9],[7,1,9,9]]}
[]
[null,"MODELO DA PROPOSTA COMPLETA"]
[]
[null,"."]
[null,"I – FORMALIZAÇÃO"]
[]
{"$rows_left_out":78}
{"sheet":"Remunerações","index":2,"n_rows":53,"n_cols":12,"rows_kept":53,"cut":false,"hidden":false,"merged":[[0,1,0,10]]}
[null,"QUADRO DE REMUNERAÇÕES"]
[]
[null,null,"ITEM","POSTO DE TRABALHO","QUANTIDADE","SALÁRIO","ADICIONAL DE PERICULOSIDADE","ADICIONAL DE INSALUBRIDADE","ADICIONAL NOTURNO","OUTROS","SALÁRIO COM ADICIONAIS"]
[null,null,null,"POSTO DE TRABALHO - EQUIPE DE TRABALHO"]
[null,null,1,{"$f":"HLOOKUP($C5,'Dados Gerais'!$D$5:$L$68,6)","v":"ENCARREGADO GERAL"},{"$f":"HLOOKUP($C5,'Dados Gerais'!$D$5:$L$68,10)","v":1},{"$f":"HLOOKUP($C5,'Dados Gerais'!$D$5:$L$68,8)","v":7744.91},{"$f":"HLOOKUP($C5,'Dados Gerais'!$D$5:$L$68,26)","v":0},{"$f":"HLOOKUP($C5,'Dados Gerais'!$D$5:$L$68,31)","v":0},{"$f":"HLOOKUP($C5,'Dados Gerais'!$D$5:$L$68,46)","v":0},{"$f":"HLOOKUP($C5,'Dados Gerais'!$D$5:$L$68,33)","v":0},{"$f":"SUM(F5:J5)","v":7744.91}]
[null,null,2,{"$f":"HLOOKUP($C6,'Dados Gerais'!$D$5:$L$68,6)","v":"ENCARREGADO SETORIAL"},{"$f":"HLOOKUP($C6,'Dados Gerais'!$D$5:$L$68,10)","v":2},{"$f":"HLOOKUP($C6,'Dados Gerais'!$D$5:$L$68,8)","v":4428.78},{"$f":"HLOOKUP($C6,'Dados Gerais'!$D$5:$L$68,26)","v":0},{"$f":"HLOOKUP($C6,'Dados Gerais'!$D$5:$L$68,31)","v":0},{"$f":"HLOOKUP($C6,'Dados Gerais'!$D$5:$L$68,46)","v":0},{"$f":"HLOOKUP($C6,'Dados Gerais'!$D$5:$L$68,33)","v":0},{"$f":"SUM(F6:J6)","v":4428.78}]
{"$rows_left_out":48}
{"sheet":"Resumo","index":3,"n_rows":103,"n_cols":12,"rows_kept":103,"cut":false,"hidden":false,"merged":[[2,1,2,8],[36,1,36,8],[19,1,19,8],[96,3,96,7],[107,10,108,18],[90,10,95,18],[75,3,75,7],[100,3,100,7],[86,3,86,7],[64,1,64,8],[92,3,92,7]]}
[]
[]
[null,"RESUMO - TOTAIS MENSAIS - FATURA ORDINÁRIA (SEM O 13º E SEM OS ITENS SOB DEMANDA)"]
[]
[]
[null,null,"ITEM","POSTO DE TRABALHO","QUANTIDADE","PREÇO UNIT       (SEM O 13º)","DESTAQUE DO 13º","PREÇO POR EMPREGADO","PREÇO TOTAL (MENSAL)"]
{"$rows_left_out":98}
{"sheet":"1","index":4,"n_rows":119,"n_cols":12,"rows_kept":119,"cut":false,"hidden":false,"merged":[[106,1,106,3],[1,1,1,5],[2,1,2,5],[7,1,7,3],[17,1,17,3],[4,1,4,2],[46,1,46,3],[56,1,56,3],[74,1,74,3],[83,1,83,3],[5,1,5,2],[39,3,39,5],[68,3,68,5]]}
[]
[null,"PLANILHA DE ESTIMATIVA DE CUSTOS"]
[null,"Padrão IN 05/2017 e IN 07/2018 - MPDG"]
[]
[null,1,null,{"$f":"HLOOKUP($B$5,'Dados Gerais'!$D$5:$BK$20,6)","v":"ENCARREGADO GERAL"},"QUANTIDADE",{"$f":"HLOOKUP($B$5,'Dados Gerais'!$D$5:$BK$20,10)","v":1}]
[null,"CCT",null,{"$f":"HLOOKUP($B$5,'Dados Gerais'!$D$5:$BK$20,15)","v":"SEAC/DF X SINDISERVIÇOS/DF 2024/2024 Nº DF000012/2024"},"DATA-BASE",{"$f":"HLOOKUP($B$5,'Dados Gerais'!$D$5:$BK$20,16)","v":"2024-01-01"}]
{"$rows_left_out":114}
{"sheet":"2","index":5,"n_rows":119,"n_cols":12,"rows_kept":119,"cut":false,"hidden":false,"merged":[[17,1,17,3],[106,1,106,3],[39,3,39,5],[46,1,46,3],[56,1,56,3],[68,3,68,5],[74,1,74,3],[83,1,83,3],[1,1,1,5],[2,1,2,5],[4,1,4,2],[5,1,5,2],[7,1,7,3]]}
[]
[null,"PLANILHA DE ESTIMATIVA DE CUSTOS"]
[null,"Padrão IN 05/2017 e IN 07/2018 - MPDG"]
[]
[null,2,null,{"$f":"HLOOKUP($B$5,'Dados Gerais'!$D$5:$BK$20,6)","v":"ENCARREGADO SETORIAL"},"QUANTIDADE",{"$f":"HLOOKUP($B$5,'Dados Gerais'!$D$5:$BK$20,10)","v":2}]
[null,"CCT",null,{"$f":"HLOOKUP($B$5,'Dados Gerais'!$D$5:$BK$20,15)","v":"SEAC/DF X SINDISERVIÇOS/DF 2024/2024 Nº DF000012/2024"},"DATA-BASE",{"$f":"HLOOKUP($B$5,'Dados Gerais'!$D$5:$BK$20,16)","v":"2024-01-01"}]
{"$rows_left_out":114}
{"sheet":"3","index":6,"n_rows":118,"n_cols":12,"rows_kept":118,"cut":false,"hidden":false,"merged":[[17,1,17,3],[106,1,106,3],[39,3,39,5],[46,1,46,3],[56,1,56,3],[68,3,68,5],[74,1,74,3],[83,1,83,3],[1,1,1,5],[2,1,2,5],[4,1,4,2],[5,1,5,2],[7,1,7,3]]}
[]
[null,"PLANILHA DE ESTIMATIVA DE CUSTOS"]
[null,"Padrão IN 05/2017 e IN 07/2018 - MPDG"]
[]
[null,3,null,{"$f":"HLOOKUP($B$5,'Dados Gerais'!$D$5:$BK$20,6)","v":"ENCARREGADO DE SERVIÇO"},"QUANTIDADE",{"$f":"HLOOKUP($B$5,'Dados Gerais'!$D$5:$BK$20,10)","v":12}]
[null,"CCT",null,{"$f":"HLOOKUP($B$5,'Dados Gerais'!$D$5:$BK$20,15)","v":"SEAC/DF X SINDISERVIÇOS/DF 2024/2024 Nº DF000012/2024"},"DATA-BASE",{"$f":"HLOOKUP($B$5,'Dados Gerais'!$D$5:$BK$20,16)","v":"2024-01-01"}]
{"$rows_left_out":113}
{"sheet":"4","index":7,"n_rows":118,"n_cols":12,"rows_kept":118,"cut":false,"hidden":false,"merged":[[17,1,17,3],[106,1,106,3],[39,3,39,5],[46,1,46,3],[56,1,56,3],[68,3,68,5],[74,1,74,3],[83,1,83,3],[1,1,1,5],[2,1,2,5],[4,1,4,2],[5,1,5,2],[7,1,7,3]]}
[]
[null,"PLANILHA DE ESTIMATIVA DE CUSTOS"]
[null,"Padrão IN 05/2017 e IN 07/2018 - MPDG"]
[]
[null,4,null,{"$f":"HLOOKUP($B$5,'Dados Gerais'!$D$5:$BK$20,6)","v":"AUXILIAR DE ENCARREGADO"},"QUANTIDADE",{"$f":"HLOOKUP($B$5,'Dados Gerais'!$D$5:$BK$20,10)","v":1}]
[null,"CCT",null,{"$f":"HLOOKUP($B$5,'Dados Gerais'!$D$5:$BK$20,15)","v":"SEAC/DF X SINDISERVIÇOS/DF 2024/2024 Nº DF000012/2024"},"DATA-BASE",{"$f":"HLOOKUP($B$5,'Dados Gerais'!$D$5:$BK$20,16)","v":"2024-01-01"}]
{"$rows_left_out":113}
{"sheet":"5","index":8,"n_rows":118,"n_cols":12,"rows_kept":118,"cut":false,"hidden":false,"merged":[[17,1,17,3],[106,1,106,3],[39,3,39,5],[46,1,46,3],[56,1,56,3],[68,3,68,5],[74,1,74,3],[83,1,83,3],[1,1,1,5],[2,1,2,5],[4,1,4,2],[5,1,5,2],[7,1,7,3]]}
[]
[null,"PLANILHA DE ESTIMATIVA DE CUSTOS"]
[null,"Padrão IN 05/2017 e IN 07/2018 - MPDG"]
[]
[null,5,null,{"$f":"HLOOKUP($B$5,'Dados Gerais'!$D$5:$BK$20,6)","v":"ALMOXARIFE"},"QUANTIDADE",{"$f":"HLOOKUP($B$5,'Dados Gerais'!$D$5:$BK$20,10)","v":2}]
[null,"CCT",null,{"$f":"HLOOKUP($B$5,'Dados Gerais'!$D$5:$BK$20,15)","v":"SEAC/DF X SINDISERVIÇOS/DF 2024/2024 Nº DF000012/2024"},"DATA-BASE",{"$f":"HLOOKUP($B$5,'Dados Gerais'!$D$5:$BK$20,16)","v":"2024-01-01"}]
{"$rows_left_out":113}
{"sheet":"6","index":9,"n_rows":118,"n_cols":12,"rows_kept":118,"cut":false,"hidden":false,"merged":[[106,1,106,3],[39,3,39,5],[46,1,46,3],[56,1,56,3],[68,3,68,5],[74,1,74,3],[83,1,83,3],[17,1,17,3],[1,1,1,5],[2,1,2,5],[4,1,4,2],[5,1,5,2],[7,1,7,3]]}
[]
[null,"PLANILHA DE ESTIMATIVA DE CUSTOS"]
[null,"Padrão IN 05/2017 e IN 07/2018 - MPDG"]
[]
[null,6,null,{"$f":"HLOOKUP($B$5,'Dados Gerais'!$D$5:$BK$20,6)","v":"SERVENTE"},"QUANTIDADE",{"$f":"HLOOKUP($B$5,'Dados Gerais'!$D$5:$BK$20,10)","v":189}]
[null,"CCT",null,{"$f":"HLOOKUP($B$5,'Dados Gerais'!$D$5:$BK$20,15)","v":"SEAC/DF X SINDISERVIÇOS/DF 2024/2024 Nº DF000012/2024"},"DATA-BASE",{"$f":"HLOOKUP($B$5,'Dados Gerais'!$D$5:$BK$20,16)","v":"2024-01-01"}]
{"$rows_left_out":113}
{"sheet":"7","index":10,"n_rows":118,"n_cols":8,"rows_kept":118,"cut":false,"hidden":true,"merged":[[17,1,17,3],[1,1,1,5],[2,1,2,5],[4,1,4,2],[5,1,5,2],[7,1,7,3],[106,1,106,3],[39,3,39,5],[46,1,46,3],[56,1,56,3],[68,3,68,5],[74,1,74,3],[83,1,83,3]]}
[]
[null,"PLANILHA DE ESTIMATIVA DE CUSTOS"]
[null,"Padrão IN 05/2017 e IN 07/2018 - MPDG"]
[]
[null,7,null,{"$f":"HLOOKUP($B$5,'Dados Gerais'!$D$5:$BK$20,6)","v":0},"QUANTIDADE",{"$f":"HLOOKUP($B$5,'Dados Gerais'!$D$5:$BK$20,10)","v":0}]
[null,"CCT",null,{"$f":"HLOOKUP($B$5,'Dados Gerais'!$D$5:$BK$20,15)","v":0},"DATA-BASE",{"$f":"HLOOKUP($B$5,'Dados Gerais'!$D$5:$BK$20,16)","v":"00:00:00"}]
{"$rows_left_out":113}
{"sheet":"8","index":11,"n_rows":118,"n_cols":8,"rows_kept":118,"cut":false,"hidden":true,"merged":[[17,1,17,3],[1,1,1,5],[2,1,2,5],[4,1,4,2],[5,1,5,2],[7,1,7,3],[106,1,106,3],[39,3,39,5],[46,1,46,3],[56,1,56,3],[68,3,68,5],[74,1,74,3],[83,1,83,3]]}
[]
[null,"PLANILHA DE ESTIMATIVA DE CUSTOS"]
[null,"Padrão IN 05/2017 e IN 07/2018 - MPDG"]
[]
[null,8,null,{"$f":"HLOOKUP($B$5,'Dados Gerais'!$D$5:$BK$20,6)","v":0},"QUANTIDADE",{"$f":"HLOOKUP($B$5,'Dados Gerais'!$D$5:$BK$20,10)","v":0}]
[null,"CCT",null,{"$f":"HLOOKUP($B$5,'Dados Gerais'!$D$5:$BK$20,15)","v":0},"DATA-BASE",{"$f":"HLOOKUP($B$5,'Dados Gerais'!$D$5:$BK$20,16)","v":"00:00:00"}]
{"$rows_left_out":113}
{"sheet":"9","index":12,"n_rows":118,"n_cols":8,"rows_kept":118,"cut":false,"hidden":true,"merged":[[17,1,17,3],[1,1,1,5],[2,1,2,5],[4,1,4,2],[5,1,5,2],[7,1,7,3],[106,1,106,3],[39,3,39,5],[46,1,46,3],[56,1,56,3],[68,3,68,5],[74,1,74,3],[83,1,83,3]]}
[]
[null,"PLANILHA DE ESTIMATIVA DE CUSTOS"]
[null,"Padrão IN 05/2017 e IN 07/2018 - MPDG"]
[]
[null,9,null,{"$f":"HLOOKUP($B$5,'Dados Gerais'!$D$5:$BK$20,6)","v":0},"QUANTIDADE",{"$f":"HLOOKUP($B$5,'Dados Gerais'!$D$5:$BK$20,10)","v":0}]
[null,"CCT",null,{"$f":"HLOOKUP($B$5,'Dados Gerais'!$D$5:$BK$20,15)","v":0},"DATA-BASE",{"$f":"HLOOKUP($B$5,'Dados Gerais'!$D$5:$BK$20,16)","v":"00:00:00"}]
{"$rows_left_out":113}
{"sheet":"Dados Gerais","index":13,"n_rows":118,"n_cols":63,"rows_kept":118,"cut":false,"hidden":false,"merged":[[2,1,2,2]]}
[]
[]
[null,"INFORMAÇÕES DE ENTRADA"]
[]
[null,null,null,1,2,3,4,5,6,7,8,9,10,11,12,13,14,15,16,17,18,19,20,21,22,23,24,25,26,27,28,29,30,31,32,33,34,35,36,37,38,39,40,41,42,43,44,45,46,47,48,49,50,51,52,53,54,55,56,57,58,59,60]
[null,"",null,"CARGO 1","CARGO 2","CARGO 3","CARGO 4","CARGO 5","CARGO 6","CARGO 7","CARGO 8","CARGO 9","CARGO 10","CARGO 11","CARGO 12","CARGO 13","CARGO 14","CARGO 15","CARGO 16","CARGO 17","CARGO 18","CARGO 19","CARGO 20","CARGO 21","CARGO 22","CARGO 23","CARGO 24","CARGO 25","CARGO 26","CARGO 27","CARGO 28","CARGO 29","CARGO 30","CARGO 31","CARGO 32","CARGO 33","CARGO 34","CARGO 35","CARGO 36","CARGO 37","CARGO 38","CARGO 39","CARGO 40","CARGO 41","CARGO 42","CARGO 43","CARGO 44","CARGO 45","CARGO 46","CARGO 47","CARGO 48","CARGO 49","CARGO 50","CARGO 51","CARGO 52","CARGO 53","CARGO 54","CARGO 55","CARGO 56","CARGO 57","CARGO 58","CARGO 59","CARGO 60"]
{"$rows_left_out":113}
{"sheet":"Encargos Sociais","index":14,"n_rows":53,"n_cols":12,"rows_kept":53,"cut":false,"hidden":false,"merged":[[2,1,2,3],[3,1,3,4]]}
[]
[]
[]
[null,"ENCARGOS SOCIAIS SOBRE A MÃO DE OBRA"]
[null,null,null,null,"Percentuais"]
[]
{"$rows_left_out":48}
{"sheet":"BDI","index":15,"n_rows":53,"n_cols":12,"rows_kept":53,"cut":false,"hidden":false,"merged":[[1,1,1,3],[2,1,2,4]]}
[]
[]
[null,"COMPOSIÇÃO DA TAXA DE CUSTOS INDIRETOS, TRIBUTOS E LUCRO - BDI"]
[null,"APLICAÇÃO: MÃO DE OBRA, 13º, MATERIAIS, EPC E EQUIPAMENTO DE REGISTRO DE FREQUÊNCIA",null,null,"Percentuais"]
[]
[null,"Custos Indiretos da Contratada",null,null,{"$f":"SUM(E7:E8)","v":2.7000000000000003E-2}]
{"$rows_left_out":48}
{"sheet":"Uniformes","index":16,"n_rows":87,"n_cols":131,"rows_kept":87,"cut":false,"hidden":false,"merged":[[80,2,82,2],[83,2,85,2],[65,2,69,2],[2,1,2,3],[3,1,3,8],[14,2,18,2],[19,2,23,2],[60,2,64,2]]}
[]
[]
[]
[null,"UNIFORMES - AQUISIÇÃO",null,null,null,null,null,null,null,null,null,1,null,{"$f":"L4+1","v":2},null,{"$f":"N4+1","v":3},null,{"$f":"P4+1","v":4},null,{"$f":"R4+1","v":5},null,{"$f":"T4+1","v":6},null,{"$f":"V4+1","v":7},null,{"$f":"X4+1","v":8},null,{"$f":"Z4+1","v":9},null,{"$f":"AB4+1","v":10},null,{"$f":"AD4+1","v":11},null,{"$f":"AF4+1","v":12},null,{"$f":"AH4+1","v":13},null,{"$f":"AJ4+1","v":14},null,{"$f":"AL4+1","v":15},null,{"$f":"AN4+1","v":16},null,{"$f":"AP4+1","v":17},null,{"$f":"AR4+1","v":18},null,{"$f":"AT4+1","v":19},null,{"$f":"AV4+1","v":20},null,{"$f":"AX4+1","v":21},null,{"$f":"AZ4+1","v":22},null,{"$f":"BB4+1","v":23},null,{"$f":"BD4+1","v":24},null,{"$f":"BF4+1","v":25},null,{"$f":"BH4+1","v":26},null,{"$f":"BJ4+1","v":27},null,{"$f":"BL4+1","v":28},null,{"$f":"BN4+1","v":29},null,{"$f":"BP4+1","v":30},null,{"$f":"BR4+1","v":31},null,{"$f":"BT4+1","v":32},null,{"$f":"BV4+1","v":33},null,{"$f":"BX4+1","v":34},null,{"$f":"BZ4+1","v":35},null,{"$f":"CB4+1","v":36},null,{"$f":"CD4+1","v":37},null,{"$f":"CF4+1","v":38},null,{"$f":"CH4+1","v":39},null,{"$f":"CJ4+1","v":40},null,{"$f":"CL4+1","v":41},null,{"$f":"CN4+1","v":42},null,{"$f":"CP4+1","v":43},null,{"$f":"CR4+1","v":44},null,{"$f":"CT4+1","v":45},null,{"$f":"CV4+1","v":46},null,{"$f":"CX4+1","v":47},null,{"$f":"CZ4+1","v":48},null,{"$f":"DB4+1","v":49},null,{"$f":"DD4+1","v":50},null,{"$f":"DF4+1","v":51},null,{"$f":"DH4+1","v":52},null,{"$f":"DJ4+1","v":53},null,{"$f":"DL4+1","v":54},null,{"$f":"DN4+1","v":55},null,{"$f":"DP4+1","v":56},null,{"$f":"DR4+1","v":57},null,{"$f":"DT4+1","v":58},null,{"$f":"DV4+1","v":59},null,{"$f":"DX4+1","v":60}]
[]
[null,null,null,null,null,null,null,null,null,null,null,{"$f":"ROUND(SUM(M5:M107),2)","v":1373.36},null,{"$f":"ROUND(SUM(O5:O107),2)","v":1373.36},null,{"$f":"ROUND(SUM(Q5:Q107),2)","v":1354.19},null,{"$f":"ROUND(SUM(S5:S107),2)","v":1354.19},null,{"$f":"ROUND(SUM(U5:U107),2)","v":447.52},null,{"$f":"ROUND(SUM(W5:W107),2)","v":447.52},null,{"$f":"ROUND(SUM(Y5:Y107),2)","v":0},null,{"$f":"ROUND(SUM(AA5:AA107),2)","v":0},null,{"$f":"ROUND(SUM(AC5:AC107),2)","v":0},null,{"$f":"ROUND(SUM(AE5:AE107),2)","v":0},null,{"$f":"ROUND(SUM(AG5:AG107),2)","v":0},null,{"$f":"ROUND(SUM(AI5:AI107),2)","v":0},null,{"$f":"ROUND(SUM(AK5:AK107),2)","v":0},null,{"$f":"ROUND(SUM(AM5:AM107),2)","v":0},null,{"$f":"ROUND(SUM(AO5:AO107),2)","v":0},null,{"$f":"ROUND(SUM(AQ5:AQ107),2)","v":0},null,{"$f":"ROUND(SUM(AS5:AS107),2)","v":0},null,{"$f":"ROUND(SUM(AU5:AU107),2)","v":0},null,{"$f":"ROUND(SUM(AW5:AW107),2)","v":0},null,{"$f":"ROUND(SUM(AY5:AY107),2)","v":0},null,{"$f":"ROUND(SUM(BA5:BA107),2)","v":0},null,{"$f":"ROUND(SUM(BC5:BC107),2)","v":0},null,{"$f":"ROUND(SUM(BE5:BE107),2)","v":0},null,{"$f":"ROUND(SUM(BG5:BG107),2)","v":0},null,{"$f":"ROUND(SUM(BI5:BI107),2)","v":0},null,{"$f":"ROUND(SUM(BK5:BK107),2)","v":0},null,{"$f":"ROUND(SUM(BM5:BM107),2)","v":0},null,{"$f":"ROUND(SUM(BO5:BO107),2)","v":0},null,{"$f":"ROUND(SUM(BQ5:BQ107),2)","v":0},null,{"$f":"ROUND(SUM(BS5:BS107),2)","v":0},null,{"$f":"ROUND(SUM(BU5:BU107),2)","v":0},null,{"$f":"ROUND(SUM(BW5:BW107),2)","v":0},null,{"$f":"ROUND(SUM(BY5:BY107),2)","v":0},null,{"$f":"ROUND(SUM(CA5:CA107),2)","v":0},null,{"$f":"ROUND(SUM(CC5:CC107),2)","v":0},null,{"$f":"ROUND(SUM(CE5:CE107),2)","v":0},null,{"$f":"ROUND(SUM(CG5:CG107),2)","v":0},null,{"$f":"ROUND(SUM(CI5:CI107),2)","v":0},null,{"$f":"ROUND(SUM(CK5:CK107),2)","v":0},null,{"$f":"ROUND(SUM(CM5:CM107),2)","v":0},null,{"$f":"ROUND(SUM(CO5:CO107),2)","v":0},null,{"$f":"ROUND(SUM(CQ5:CQ107),2)","v":0},null,{"$f":"ROUND(SUM(CS5:CS107),2)","v":0},null,{"$f":"ROUND(SUM(CU5:CU107),2)","v":0},null,{"$f":"ROUND(SUM(CW5:CW107),2)","v":0},null,{"$f":"ROUND(SUM(CY5:CY107),2)","v":0},null,{"$f":"ROUND(SUM(DA5:DA107),2)","v":0},null,{"$f":"ROUND(SUM(DC5:DC107),2)","v":0},null,{"$f":"ROUND(SUM(DE5:DE107),2)","v":0},null,{"$f":"ROUND(SUM(DG5:DG107),2)","v":0},null,{"$f":"ROUND(SUM(DI5:DI107),2)","v":0},null,{"$f":"ROUND(SUM(DK5:DK107),2)","v":0},null,{"$f":"ROUND(SUM(DM5:DM107),2)","v":0},null,{"$f":"ROUND(SUM(DO5:DO107),2)","v":0},null,{"$f":"ROUND(SUM(DQ5:DQ107),2)","v":0},null,{"$f":"ROUND(SUM(DS5:DS107),2)","v":0},null,{"$f":"ROUND(SUM(DU5:DU107),2)","v":0},null,{"$f":"ROUND(SUM(DW5:DW107),2)","v":0},null,{"$f":"ROUND(SUM(DY5:DY107),2)","v":0},null,{"$f":"ROUND(SUM(EA5:EA107),2)","v":0}]
{"$rows_left_out":82}
{"sheet":"EPI","index":17,"n_rows":73,"n_cols":129,"rows_kept":73,"cut":false,"hidden":false,"merged":[[2,1,2,3],[3,1,3,6]]}
[]
[]
[]
[null,"EQUIPAMENTOS DE PROTEÇÃO INDIVIDUAL - AQUISIÇÃO",null,null,null,null,null,null,null,1,null,{"$f":"J4+1","v":2},null,{"$f":"L4+1","v":3},null,{"$f":"N4+1","v":4},null,{"$f":"P4+1","v":5},null,{"$f":"R4+1","v":6},null,{"$f":"T4+1","v":7},null,{"$f":"V4+1","v":8},null,{"$f":"X4+1","v":9},null,{"$f":"Z4+1","v":10},null,{"$f":"AB4+1","v":11},null,{"$f":"AD4+1","v":12},null,{"$f":"AF4+1","v":13},null,{"$f":"AH4+1","v":14},null,{"$f":"AJ4+1","v":15},null,{"$f":"AL4+1","v":16},null,{"$f":"AN4+1","v":17},null,{"$f":"AP4+1","v":18},null,{"$f":"AR4+1","v":19},null,{"$f":"AT4+1","v":20},null,{"$f":"AV4+1","v":21},null,{"$f":"AX4+1","v":22},null,{"$f":"AZ4+1","v":23},null,{"$f":"BB4+1","v":24},null,{"$f":"BD4+1","v":25},null,{"$f":"BF4+1","v":26},null,{"$f":"BH4+1","v":27},null,{"$f":"BJ4+1","v":28},null,{"$f":"BL4+1","v":29},null,{"$f":"BN4+1","v":30},null,{"$f":"BP4+1","v":31},null,{"$f":"BR4+1","v":32},null,{"$f":"BT4+1","v":33},null,{"$f":"BV4+1","v":34},null,{"$f":"BX4+1","v":35},null,{"$f":"BZ4+1","v":36},null,{"$f":"CB4+1","v":37},null,{"$f":"CD4+1","v":38},null,{"$f":"CF4+1","v":39},null,{"$f":"CH4+1","v":40},null,{"$f":"CJ4+1","v":41},null,{"$f":"CL4+1","v":42},null,{"$f":"CN4+1","v":43},null,{"$f":"CP4+1","v":44},null,{"$f":"CR4+1","v":45},null,{"$f":"CT4+1","v":46},null,{"$f":"CV4+1","v":47},null,{"$f":"CX4+1","v":48},null,{"$f":"CZ4+1","v":49},null,{"$f":"DB4+1","v":50},null,{"$f":"DD4+1","v":51},null,{"$f":"DF4+1","v":52},null,{"$f":"DH4+1","v":53},null,{"$f":"DJ4+1","v":54},null,{"$f":"DL4+1","v":55},null,{"$f":"DN4+1","v":56},null,{"$f":"DP4+1","v":57},null,{"$f":"DR4+1","v":58},null,{"$f":"DT4+1","v":59},null,{"$f":"DV4+1","v":60}]
[]
[null,null,null,null,null,null,null,null,null,{"$f":"ROUND(SUM(K5:K110),2)","v":1.62},null,{"$f":"ROUND(SUM(M5:M110),2)","v":4.1100000000000003},null,{"$f":"ROUND(SUM(O5:O110),2)","v":4.1100000000000003},null,{"$f":"ROUND(SUM(Q5:Q110),2)","v":4.1100000000000003},null,{"$f":"ROUND(SUM(S5:S110),2)","v":276.33999999999997},null,{"$f":"ROUND(SUM(U5:U110),2)","v":291.77},null,{"$f":"ROUND(SUM(W5:W110),2)","v":0},null,{"$f":"ROUND(SUM(Y5:Y110),2)","v":0},null,{"$f":"ROUND(SUM(AA5:AA110),2)","v":0},null,{"$f":"ROUND(SUM(AC5:AC110),2)","v":0},null,{"$f":"ROUND(SUM(AE5:AE110),2)","v":0},null,{"$f":"ROUND(SUM(AG5:AG110),2)","v":0},null,{"$f":"ROUND(SUM(AI5:AI110),2)","v":0},null,{"$f":"ROUND(SUM(AK5:AK110),2)","v":0},null,{"$f":"ROUND(SUM(AM5:AM110),2)","v":0},null,{"$f":"ROUND(SUM(AO5:AO110),2)","v":0},null,{"$f":"ROUND(SUM(AQ5:AQ110),2)","v":0},null,{"$f":"ROUND(SUM(AS5:AS110),2)","v":0},null,{"$f":"ROUND(SUM(AU5:AU110),2)","v":0},null,{"$f":"ROUND(SUM(AW5:AW110),2)","v":0},null,{"$f":"ROUND(SUM(AY5:AY110),2)","v":0},null,{"$f":"ROUND(SUM(BA5:BA110),2)","v":0},null,{"$f":"ROUND(SUM(BC5:BC110),2)","v":0},null,{"$f":"ROUND(SUM(BE5:BE110),2)","v":0},null,{"$f":"ROUND(SUM(BG5:BG110),2)","v":0},null,{"$f":"ROUND(SUM(BI5:BI110),2)","v":0},null,{"$f":"ROUND(SUM(BK5:BK110),2)","v":0},null,{"$f":"ROUND(SUM(BM5:BM110),2)","v":0},null,{"$f":"ROUND(SUM(BO5:BO110),2)","v":0},null,{"$f":"ROUND(SUM(BQ5:BQ110),2)","v":0},null,{"$f":"ROUND(SUM(BS5:BS110),2)","v":0},null,{"$f":"ROUND(SUM(BU5:BU110),2)","v":0},null,{"$f":"ROUND(SUM(BW5:BW110),2)","v":0},null,{"$f":"ROUND(SUM(BY5:BY110),2)","v":0},null,{"$f":"ROUND(SUM(CA5:CA110),2)","v":0},null,{"$f":"ROUND(SUM(CC5:CC110),2)","v":0},null,{"$f":"ROUND(SUM(CE5:CE110),2)","v":0},null,{"$f":"ROUND(SUM(CG5:CG110),2)","v":0},null,{"$f":"ROUND(SUM(CI5:CI110),2)","v":0},null,{"$f":"ROUND(SUM(CK5:CK110),2)","v":0},null,{"$f":"ROUND(SUM(CM5:CM110),2)","v":0},null,{"$f":"ROUND(SUM(CO5:CO110),2)","v":0},null,{"$f":"ROUND(SUM(CQ5:CQ110),2)","v":0},null,{"$f":"ROUND(SUM(CS5:CS110),2)","v":0},null,{"$f":"ROUND(SUM(CU5:CU110),2)","v":0},null,{"$f":"ROUND(SUM(CW5:CW110),2)","v":0},null,{"$f":"ROUND(SUM(CY5:CY110),2)","v":0},null,{"$f":"ROUND(SUM(DA5:DA110),2)","v":0},null,{"$f":"ROUND(SUM(DC5:DC110),2)","v":0},null,{"$f":"ROUND(SUM(DE5:DE110),2)","v":0},null,{"$f":"ROUND(SUM(DG5:DG110),2)","v":0},null,{"$f":"ROUND(SUM(DI5:DI110),2)","v":0},null,{"$f":"ROUND(SUM(DK5:DK110),2)","v":0},null,{"$f":"ROUND(SUM(DM5:DM110),2)","v":0},null,{"$f":"ROUND(SUM(DO5:DO110),2)","v":0},null,{"$f":"ROUND(SUM(DQ5:DQ110),2)","v":0},null,{"$f":"ROUND(SUM(DS5:DS110),2)","v":0},null,{"$f":"ROUND(SUM(DU5:DU110),2)","v":0},null,{"$f":"ROUND(SUM(DW5:DW110),2)","v":0},null,{"$f":"ROUND(SUM(DY5:DY110),2)","v":0}]
{"$rows_left_out":68}
{"sheet":"SREP","index":18,"n_rows":75,"n_cols":15,"rows_kept":75,"cut":false,"hidden":false,"merged":[[2,1,2,3],[3,1,3,14]]}
[]
[]
[]
[null,"SISTEMA DE REGISTRO ELETRÔNICO DE PRESENÇA - SREP"]
[]
[]
{"$rows_left_out":70}
{"sheet":"Não Rel - EPI","index":19,"n_rows":53,"n_cols":15,"rows_kept":53,"cut":false,"hidden":false,"merged":[[2,1,2,4],[3,1,3,11]]}
[]
[]
[]
[null,"EPIS NÃO RELACIONADOS DIRETAMENTE A UM POSTO DE TRABALHO - AQUISIÇÃO"]
[]
[]
{"$rows_left_out":48}
{"sheet":"Equip Rel","index":20,"n_rows":80,"n_cols":136,"rows_kept":80,"cut":false,"hidden":true,"merged":[[9,1,9,3],[10,1,10,14]]}
[null,null,"CÂMARA DOS DEPUTADOS"]
[null,null,"DEPARTAMENTO TÉCNICO"]
[null,null,"Coordenação de Planejamento e Gestão"]
[]
[null,null,"Data:",{"$f":"'Dados Gerais'!#REF!","v":{"$error":"#REF!"}}]
[null,null,"Processo:",{"$f":"'Dados Gerais'!#REF!","v":{"$error":"#REF!"}}]
{"$rows_left_out":75}
{"sheet":"Não Rel - Depr","index":21,"n_rows":90,"n_cols":15,"rows_kept":90,"cut":false,"hidden":false,"merged":[[2,1,2,3],[3,1,3,14]]}
[]
[]
[]
[null,"EQUIPAMENTOS NÃO RELACIONADOS DIRETAMENTE A UM POSTO DE TRABALHO - PAGAMENTO DA DEPRECIAÇÃO / MANUTENÇÃO"]
[]
[]
{"$rows_left_out":85}
{"sheet":"Não Rel - Mat Consumo","index":22,"n_rows":53,"n_cols":14,"rows_kept":53,"cut":false,"hidden":false,"merged":[[2,1,2,4],[3,1,3,13]]}
[]
[]
[]
[null,"MATERIAIS NÃO RELACIONADOS DIRETAMENTE A UM POSTO DE TRABALHO"]
[]
[]
{"$rows_left_out":48}
{"sheet":"Não Rel - Mat Cons Durável","index":23,"n_rows":53,"n_cols":15,"rows_kept":53,"cut":false,"hidden":false,"merged":[[2,1,2,4],[3,1,3,14]]}
[]
[]
[]
[null,"MATERIAIS DE CONSUMO PERMANENTE NÃO RELACIONADOS DIRETAMENTE A UM POSTO DE TRABALHO"]
[]
[]
{"$rows_left_out":48}
{"sheet":"Não Rel - Serviços","index":24,"n_rows":53,"n_cols":13,"rows_kept":53,"cut":false,"hidden":false,"merged":[[1,1,1,4],[2,1,2,12]]}
[]
[]
[null,"SERVIÇOS NÃO RELACIONADOS DIRETAMENTE A UM POSTO DE TRABALHO - SOB DEMANDA"]
[]
[]
[null,null,"ITEM","CÓDIGO","DESCRIÇÃO","QUANT ANUAL","UNIDADE","CUSTO UNITÁRIO","CUSTO TOTAL","BDI (%)","PREÇO TOTAL","FONTE","REFERÊNCIA"]
{"$rows_left_out":48}
{"sheet":"Not. Demanda","index":25,"n_rows":51,"n_cols":8,"rows_kept":51,"cut":false,"hidden":true,"merged":[[1,1,1,3],[2,1,2,7]]}
[]
[]
[null,"ADICIONAL NOTURNO SOB DEMANDA"]
[]
[]
[null,null,"CATEGORIAS",null,null,null,"HORAS / MÊS","% NOTURNA"]
{"$rows_left_out":46}
{"sheet":"Mat Cons","index":26,"n_rows":28,"n_cols":128,"rows_kept":28,"cut":false,"hidden":true,"merged":[[9,1,9,3],[10,1,10,5]]}
[null,null,"CÂMARA DOS DEPUTADOS"]
[null,null,"DEPARTAMENTO TÉCNICO"]
[null,null,"Coordenação de Planejamento e Gestão"]
[]
[null,null,"Data:",{"$f":"'Dados Gerais'!#REF!","v":{"$error":"#REF!"}}]
[null,null,"Processo:",{"$f":"'Dados Gerais'!#REF!","v":{"$error":"#REF!"}}]
{"$rows_left_out":23}
{"sheet":"Mat Perm","index":27,"n_rows":113,"n_cols":136,"rows_kept":113,"cut":false,"hidden":true,"merged":[[9,1,9,3],[10,1,10,14]]}
[null,null,"CÂMARA DOS DEPUTADOS"]
[null,null,"DEPARTAMENTO TÉCNICO"]
[null,null,"Coordenação de Planejamento e Gestão"]
[]
[null,null,"Data:",{"$f":"'Dados Gerais'!#REF!","v":{"$error":"#REF!"}}]
[null,null,"Processo:",{"$f":"'Dados Gerais'!#REF!","v":{"$error":"#REF!"}}]
{"$rows_left_out":107}