{"text_format":"1","workbook":"xlsx","n_sheets":24,"sheets":["GUIA PARA PREENCHIMENTO","MODELO PROPOSTA","Remunerações","Resumo","1","3","4","5","6","Dados Gerais","Encargos Sociais (APRENDIZ)","BDI","Uniformes","EPI","SREP","Não Rel - EPI","Equip Rel","Não Rel - Depr","Não Rel - Mat Consumo","Não Rel - Mat Cons Durável","Não Rel - Serviços","Not. Demanda","Mat Cons","Mat Perm"],"not_rendered":{"charts":0,"images":8,"macros":1,"external_links":0,"defined_names":29,"comments":1,"pivot_tables":0},"unopened":[],"bounds":{"document_bytes":16777216,"sheet_cells":100000,"rows_first":2000,"rows_last":500,"rows_between":2000,"halvings":0,"cell_chars":16384,"cell_head_chars":4096},"cells_cut":0,"cells_raw":0,"read":"whole","date_system":"1900"}

{"sheet":"GUIA PARA PREENCHIMENTO","index":0,"n_rows":5,"n_cols":1,"rows_kept":5,"cut":false,"hidden":false,"merged":[]}
["GUIA PARA PREENCHIMENTO"]
[]
["1 - Preencher apenas as guias azuis:"]
[]
["2 - Recomendamos preencher somente as células com fundo azul claro. As demais possuem fórmulas e sugerimos não alterá-las."]

{"sheet":"MODELO PROPOSTA","index":1,"n_rows":57,"n_cols":2,"rows_kept":57,"cut":false,"hidden":false,"merged":[[9,1,9,9],[1,1,1,9],[4,1,4,9],[6,1,6,9],[7,1,7,9],[8,1,8,9],[27,1,27,4],[27,5,27,9],[10,1,10,9],[11,1,11,9],[12,1,12,9],[16,1,16,9],[17,1,17,9],[18,1,18,2],[19,1,20,9],[21,1,21,9],[23,1,23,9],[24,1,24,9],[25,1,25,9],[28,1,28,4],[28,5,28,9],[29,1,29,4],[29,5,29,9],[30,1,30,4],[30,5,30,9],[31,1,31,4],[31,5,31,9],[32,1,32,4],[32,5,32,9],[34,1,34,9],[35,6,35,10],[36,1,36,9],[37,1,37,9],[38,1,38,9],[39,1,39,9],[47,1,47,4],[47,5,47,9],[44,1,44,9],[45,1,45,4],[45,5,45,9],[46,1,46,4],[46,5,46,9],[48,1,48,9],[51,1,51,9],[52,1,52,9],[53,1,53,9],[56,1,56,9]]}
[]
[null,"MODELO DA PROPOSTA COMPLETA"]
[]
[null,"."]
[null,"I – FORMALIZAÇÃO"]
[]
[null,"PREGÃO ELETRÔNICO N.    138/2023"]
[null,"OBJETO: Prestação de serviços de formação técnico-profissional metódica de adolescentes aprendizes, por entidade sem fins lucrativos (ESFL), com atividades teóricas a serem realizadas em local(is) a ser(em) disponibilizado(s) pela Contratada e atividades práticas a serem realizadas nas dependências da Contratante, pelo período de 24 (vinte e quatro) meses."]
{"$rows_left_out":50}
{"sheet":"Remunerações","index":2,"n_rows":12,"n_cols":11,"rows_kept":12,"cut":false,"hidden":false,"merged":[[0,1,0,10]]}
[null,"QUADRO DE REMUNERAÇÕES"]
[]
[null,null,"ITEM","CATEGORIA","QUANTIDADE","SALÁRIO","ADICIONAL DE PERICULOSIDADE","ADICIONAL DE INSALUBRIDADE","ADICIONAL NOTURNO","OUTROS","SALÁRIO COM ADICIONAIS"]
[]
[null,null,1,{"$f":"HLOOKUP($C5,'Dados Gerais'!$D$5:$G$68,6)","v":"ADOLESCENTE APRENDIZ"},{"$f":"HLOOKUP($C5,'Dados Gerais'!$D$5:$G$68,10)","v":180},{"$f":"HLOOKUP($C5,'Dados Gerais'!$D$5:$G$68,8)","v":1320},{"$f":"HLOOKUP($C5,'Dados Gerais'!$D$5:$G$68,26)","v":0},{"$f":"HLOOKUP($C5,'Dados Gerais'!$D$5:$G$68,32)","v":0},{"$f":"HLOOKUP($C5,'Dados Gerais'!$D$5:$G$68,47)","v":0},{"$f":"HLOOKUP($C5,'Dados Gerais'!$D$5:$G$68,34)","v":0},{"$f":"SUM(F5:J5)","v":1320}]
[]
[null,null,3,{"$f":"HLOOKUP($C7,'Dados Gerais'!$D$5:$G$68,6)","v":0},{"$f":"HLOOKUP($C7,'Dados Gerais'!$D$5:$G$68,10)","v":0},{"$f":"HLOOKUP($C7,'Dados Gerais'!$D$5:$G$68,8)","v":0},{"$f":"HLOOKUP($C7,'Dados Gerais'!$D$5:$G$68,26)","v":0},{"$f":"HLOOKUP($C7,'Dados Gerais'!$D$5:$G$68,32)","v":0},{"$f":"HLOOKUP($C7,'Dados Gerais'!$D$5:$G$68,47)","v":0},{"$f":"HLOOKUP($C7,'Dados Gerais'!$D$5:$G$68,34)","v":0},{"$f":"SUM(F7:J7)","v":0}]
[null,null,4,{"$f":"HLOOKUP($C8,'Dados Gerais'!$D$5:$G$68,6)","v":0},{"$f":"HLOOKUP($C8,'Dados Gerais'!$D$5:$G$68,10)","v":0},{"$f":"HLOOKUP($C8,'Dados Gerais'!$D$5:$G$68,8)","v":0},{"$f":"HLOOKUP($C8,'Dados Gerais'!$D$5:$G$68,26)","v":0},{"$f":"HLOOKUP($C8,'Dados Gerais'!$D$5:$G$68,32)","v":0},{"$f":"HLOOKUP($C8,'Dados Gerais'!$D$5:$G$68,47)","v":0},{"$f":"HLOOKUP($C8,'Dados Gerais'!$D$5:$G$68,34)","v":0},0]
{"$rows_left_out":5}
{"sheet":"Resumo","index":3,"n_rows":74,"n_cols":12,"rows_kept":74,"cut":false,"hidden":false,"merged":[[71,3,71,7],[41,3,41,7],[57,3,57,7],[63,3,63,7],[2,1,2,8],[20,1,20,8],[11,1,11,8],[53,3,53,7],[67,3,67,7]]}
[]
[]
[null,"RESUMO - TOTAIS MENSAIS - FATURA ORDINÁRIA (SEM O 13º E SEM OS ITENS SOB DEMANDA)"]
[]
[]
[null,null,"ITEM","POSTO DE TRABALHO","QUANTIDADE","PREÇO UNIT       (SEM O 13º)","DESTAQUE DO 13º","PREÇO POR EMPREGADO","PREÇO TOTAL (MENSAL)"]
[null,null,1,{"$f":"HLOOKUP(C7,'Dados Gerais'!$D$5:$BJ$10,6)","v":"ADOLESCENTE APRENDIZ"},{"$f":"HLOOKUP(C7,'Dados Gerais'!$D$5:$BJ$14,10)","v":180},{"$f":"'1'!$E$116","v":2734.1840750000001},0,{"$f":"G7+F7","v":2734.1840750000001},{"$f":"H7*E7","v":492153.1335}]
[]
{"$rows_left_out":67}
{"sheet":"1","index":4,"n_rows":119,"n_cols":8,"rows_kept":119,"cut":false,"hidden":false,"merged":[[107,1,107,3],[1,1,1,5],[2,1,2,5],[7,1,7,3],[17,1,17,3],[4,1,4,2],[46,1,46,3],[56,1,56,3],[74,1,74,3],[84,1,84,3],[5,1,5,2],[39,3,39,5],[68,3,68,5]]}
[]
[null,"PLANILHA DE ESTIMATIVA DE CUSTOS"]
[null,"Padrão IN 05/2017 e IN 07/2018 - MPDG"]
[]
[null,1,null,{"$f":"HLOOKUP($B$5,'Dados Gerais'!$D$5:$BJ$20,6)","v":"ADOLESCENTE APRENDIZ"},"QUANTIDADE",{"$f":"HLOOKUP($B$5,'Dados Gerais'!$D$5:$BJ$20,10)","v":180}]
[null,"CCT",null,{"$f":"HLOOKUP($B$5,'Dados Gerais'!$D$5:$BJ$20,15)","v":"-"},"DATA-BASE",{"$f":"HLOOKUP($B$5,'Dados Gerais'!$D$5:$BJ$20,16)","v":"-"}]
[]
[null,"MÓDULO 1 - COMPOSIÇÃO DA REMUNERAÇÃO",null,null,null,"Valor"]
{"$rows_left_out":112}
{"sheet":"3","index":5,"n_rows":118,"n_cols":8,"rows_kept":118,"cut":false,"hidden":true,"merged":[[1,1,1,5],[2,1,2,5],[4,1,4,2],[5,1,5,2],[7,1,7,3],[17,1,17,3],[106,1,106,3],[39,3,39,5],[46,1,46,3],[56,1,56,3],[68,3,68,5],[74,1,74,3],[83,1,83,3]]}
[]
[null,"PLANILHA DE ESTIMATIVA DE CUSTOS"]
[null,"Padrão IN 05/2017 e IN 07/2018 - MPDG"]
[]
[null,3,null,{"$f":"HLOOKUP($B$5,'Dados Gerais'!$D$5:$BJ$20,6)","v":0},"QUANTIDADE",{"$f":"HLOOKUP($B$5,'Dados Gerais'!$D$5:$BJ$20,10)","v":0}]
[null,"CCT",null,{"$f":"HLOOKUP($B$5,'Dados Gerais'!$D$5:$BJ$20,15)","v":0},"DATA-BASE",{"$f":"HLOOKUP($B$5,'Dados Gerais'!$D$5:$BJ$20,16)","v":"00:00:00"}]
[]
[null,"MÓDULO 1 - COMPOSIÇÃO DA REMUNERAÇÃO",null,null,null,"Valor"]
{"$rows_left_out":111}
{"sheet":"4","index":6,"n_rows":118,"n_cols":8,"rows_kept":118,"cut":false,"hidden":true,"merged":[[1,1,1,5],[2,1,2,5],[4,1,4,2],[5,1,5,2],[7,1,7,3],[17,1,17,3],[106,1,106,3],[39,3,39,5],[46,1,46,3],[56,1,56,3],[68,3,68,5],[74,1,74,3],[83,1,83,3]]}
[]
[null,"PLANILHA DE ESTIMATIVA DE CUSTOS"]
[null,"Padrão IN 05/2017 e IN 07/2018 - MPDG"]
[]
[null,4,null,{"$f":"HLOOKUP($B$5,'Dados Gerais'!$D$5:$BJ$20,6)","v":0},"QUANTIDADE",{"$f":"HLOOKUP($B$5,'Dados Gerais'!$D$5:$BJ$20,10)","v":0}]
[null,"CCT",null,{"$f":"HLOOKUP($B$5,'Dados Gerais'!$D$5:$BJ$20,15)","v":0},"DATA-BASE",{"$f":"HLOOKUP($B$5,'Dados Gerais'!$D$5:$BJ$20,16)","v":"00:00:00"}]
[]
[null,"MÓDULO 1 - COMPOSIÇÃO DA REMUNERAÇÃO",null,null,null,"Valor"]
{"$rows_left_out":111}
{"sheet":"5","index":7,"n_rows":118,"n_cols":8,"rows_kept":118,"cut":false,"hidden":true,"merged":[[1,1,1,5],[2,1,2,5],[4,1,4,2],[5,1,5,2],[7,1,7,3],[17,1,17,3],[106,1,106,3],[39,3,39,5],[46,1,46,3],[56,1,56,3],[68,3,68,5],[74,1,74,3],[83,1,83,3]]}
[]
[null,"PLANILHA DE ESTIMATIVA DE CUSTOS"]
[null,"Padrão IN 05/2017 e IN 07/2018 - MPDG"]
[]
[null,5,null,{"$f":"HLOOKUP($B$5,'Dados Gerais'!$D$5:$BJ$20,6)","v":0},"QUANTIDADE",{"$f":"HLOOKUP($B$5,'Dados Gerais'!$D$5:$BJ$20,10)","v":0}]
[null,"CCT",null,{"$f":"HLOOKUP($B$5,'Dados Gerais'!$D$5:$BJ$20,15)","v":0},"DATA-BASE",{"$f":"HLOOKUP($B$5,'Dados Gerais'!$D$5:$BJ$20,16)","v":"00:00:00"}]
[]
[null,"MÓDULO 1 - COMPOSIÇÃO DA REMUNERAÇÃO",null,null,null,"Valor"]
{"$rows_left_out":111}
{"sheet":"6","index":8,"n_rows":118,"n_cols":8,"rows_kept":118,"cut":false,"hidden":true,"merged":[[17,1,17,3],[1,1,1,5],[2,1,2,5],[4,1,4,2],[5,1,5,2],[7,1,7,3],[106,1,106,3],[39,3,39,5],[46,1,46,3],[56,1,56,3],[68,3,68,5],[74,1,74,3],[83,1,83,3]]}
[]
[null,"PLANILHA DE ESTIMATIVA DE CUSTOS"]
[null,"Padrão IN 05/2017 e IN 07/2018 - MPDG"]
[]
[null,6,null,{"$f":"HLOOKUP($B$5,'Dados Gerais'!$D$5:$BJ$20,6)","v":0},"QUANTIDADE",{"$f":"HLOOKUP($B$5,'Dados Gerais'!$D$5:$BJ$20,10)","v":0}]
[null,"CCT",null,{"$f":"HLOOKUP($B$5,'Dados Gerais'!$D$5:$BJ$20,15)","v":0},"DATA-BASE",{"$f":"HLOOKUP($B$5,'Dados Gerais'!$D$5:$BJ$20,16)","v":"00:00:00"}]
[]
[null,"MÓDULO 1 - COMPOSIÇÃO DA REMUNERAÇÃO",null,null,null,"Valor"]
{"$rows_left_out":111}
{"sheet":"Dados Gerais","index":9,"n_rows":124,"n_cols":62,"rows_kept":124,"cut":false,"hidden":false,"merged":[[2,1,2,2]]}
[]
[]
[null,"INFORMAÇÕES DE ENTRADA"]
[]
[null,null,null,1,3,4,5,6,7,8,9,10,11,12,13,14,15,16,17,18,19,20,21,22,23,24,25,26,27,28,29,30,31,32,33,34,35,36,37,38,39,40,41,42,43,44,45,46,47,48,49,50,51,52,53,54,55,56,57,58,59,60]
[null,"",null,"CARGO 1","CARGO 3","CARGO 4","CARGO 5","CARGO 6","CARGO 7","CARGO 8","CARGO 9","CARGO 10","CARGO 11","CARGO 12","CARGO 13","CARGO 14","CARGO 15","CARGO 16","CARGO 17","CARGO 18","CARGO 19","CARGO 20","CARGO 21","CARGO 22","CARGO 23","CARGO 24","CARGO 25","CARGO 26","CARGO 27","CARGO 28","CARGO 29","CARGO 30","CARGO 31","CARGO 32","CARGO 33","CARGO 34","CARGO 35","CARGO 36","CARGO 37","CARGO 38","CARGO 39","CARGO 40","CARGO 41","CARGO 42","CARGO 43","CARGO 44","CARGO 45","CARGO 46","CARGO 47","CARGO 48","CARGO 49","CARGO 50","CARGO 51","CARGO 52","CARGO 53","CARGO 54","CARGO 55","CARGO 56","CARGO 57","CARGO 58","CARGO 59","CARGO 60"]
[null,"INFORMAÇÕES BÁSICAS"]
[]
{"$rows_left_out":117}
{"sheet":"Encargos Sociais (APRENDIZ)","index":10,"n_rows":46,"n_cols":7,"rows_kept":46,"cut":false,"hidden":false,"merged":[[2,1,2,3],[3,1,3,4]]}
[]
[]
[]
[null,"ENCARGOS SOCIAIS SOBRE A MÃO DE OBRA"]
[null,null,null,"ADOLESCENTE APRENDIZ","Percentuais"]
[]
[null,"Referência:"]
[null,null,"SINAPI OUT/2018"]
{"$rows_left_out":39}
{"sheet":"BDI","index":11,"n_rows":26,"n_cols":7,"rows_kept":26,"cut":false,"hidden":false,"merged":[[1,1,1,3],[2,1,2,4]]}
[]
[]
[null,"COMPOSIÇÃO DA TAXA DE CUSTOS INDIRETOS, TRIBUTOS E LUCRO - BDI"]
[null,"APLICAÇÃO: MÃO DE OBRA, 13º, MATERIAIS, EPC E EQUIPAMENTO DE REGISTRO DE FREQUÊNCIA",null,null,"Percentuais"]
[]
[null,"Custos Indiretos da Contratada",null,null,{"$f":"SUM(E7:E8)","v":3.5000000000000003E-2}]
[null,null,"A","Administração Central",3.5000000000000003E-2,null,"* Nota 1 - O Somatório da Administração Central com o Lucro deve ser inferior a 12%"]
[null,null,"B","Seguros, Garantias e Riscos",0,null,"* Nota 2 - O risco previsto para o porte do contrato majorado em mais 0,20% devido ao não pagamento dos insumos componentes do custo do posto quando da ausência do mesmo."]
{"$rows_left_out":19}
{"sheet":"Uniformes","index":12,"n_rows":53,"n_cols":130,"rows_kept":53,"cut":false,"hidden":false,"merged":[[2,1,2,3],[3,1,3,7]]}
[]
[]
[]
[null,"UNIFORMES - AQUISIÇÃO",null,null,null,null,null,null,null,null,1,null,{"$f":"K4+1","v":2},null,{"$f":"M4+1","v":3},null,{"$f":"O4+1","v":4},null,{"$f":"Q4+1","v":5},null,{"$f":"S4+1","v":6},null,{"$f":"U4+1","v":7},null,{"$f":"W4+1","v":8},null,{"$f":"Y4+1","v":9},null,{"$f":"AA4+1","v":10},null,{"$f":"AC4+1","v":11},null,{"$f":"AE4+1","v":12},null,{"$f":"AG4+1","v":13},null,{"$f":"AI4+1","v":14},null,{"$f":"AK4+1","v":15},null,{"$f":"AM4+1","v":16},null,{"$f":"AO4+1","v":17},null,{"$f":"AQ4+1","v":18},null,{"$f":"AS4+1","v":19},null,{"$f":"AU4+1","v":20},null,{"$f":"AW4+1","v":21},null,{"$f":"AY4+1","v":22},null,{"$f":"BA4+1","v":23},null,{"$f":"BC4+1","v":24},null,{"$f":"BE4+1","v":25},null,{"$f":"BG4+1","v":26},null,{"$f":"BI4+1","v":27},null,{"$f":"BK4+1","v":28},null,{"$f":"BM4+1","v":29},null,{"$f":"BO4+1","v":30},null,{"$f":"BQ4+1","v":31},null,{"$f":"BS4+1","v":32},null,{"$f":"BU4+1","v":33},null,{"$f":"BW4+1","v":34},null,{"$f":"BY4+1","v":35},null,{"$f":"CA4+1","v":36},null,{"$f":"CC4+1","v":37},null,{"$f":"CE4+1","v":38},null,{"$f":"CG4+1","v":39},null,{"$f":"CI4+1","v":40},null,{"$f":"CK4+1","v":41},null,{"$f":"CM4+1","v":42},null,{"$f":"CO4+1","v":43},null,{"$f":"CQ4+1","v":44},null,{"$f":"CS4+1","v":45},null,{"$f":"CU4+1","v":46},null,{"$f":"CW4+1","v":47},null,{"$f":"CY4+1","v":48},null,{"$f":"DA4+1","v":49},null,{"$f":"DC4+1","v":50},null,{"$f":"DE4+1","v":51},null,{"$f":"DG4+1","v":52},null,{"$f":"DI4+1","v":53},null,{"$f":"DK4+1","v":54},null,{"$f":"DM4+1","v":55},null,{"$f":"DO4+1","v":56},null,{"$f":"DQ4+1","v":57},null,{"$f":"DS4+1","v":58},null,{"$f":"DU4+1","v":59},null,{"$f":"DW4+1","v":60}]
[]
[null,null,null,null,null,null,null,null,null,null,{"$f":"ROUND(SUM(L5:L68),2)","v":103.88},null,{"$f":"ROUND(SUM(N5:N68),2)","v":0},null,{"$f":"ROUND(SUM(P5:P68),2)","v":0},null,{"$f":"ROUND(SUM(R5:R68),2)","v":0},null,{"$f":"ROUND(SUM(T5:T68),2)","v":0},null,{"$f":"ROUND(SUM(V5:V68),2)","v":0},null,{"$f":"ROUND(SUM(X5:X68),2)","v":0},null,{"$f":"ROUND(SUM(Z5:Z68),2)","v":0},null,{"$f":"ROUND(SUM(AB5:AB68),2)","v":0},null,{"$f":"ROUND(SUM(AD5:AD68),2)","v":0},null,{"$f":"ROUND(SUM(AF5:AF68),2)","v":0},null,{"$f":"ROUND(SUM(AH5:AH68),2)","v":0},null,{"$f":"ROUND(SUM(AJ5:AJ68),2)","v":0},null,{"$f":"ROUND(SUM(AL5:AL68),2)","v":0},null,{"$f":"ROUND(SUM(AN5:AN68),2)","v":0},null,{"$f":"ROUND(SUM(AP5:AP68),2)","v":0},null,{"$f":"ROUND(SUM(AR5:AR68),2)","v":0},null,{"$f":"ROUND(SUM(AT5:AT68),2)","v":0},null,{"$f":"ROUND(SUM(AV5:AV68),2)","v":0},null,{"$f":"ROUND(SUM(AX5:AX68),2)","v":0},null,{"$f":"ROUND(SUM(AZ5:AZ68),2)","v":0},null,{"$f":"ROUND(SUM(BB5:BB68),2)","v":0},null,{"$f":"ROUND(SUM(BD5:BD68),2)","v":0},null,{"$f":"ROUND(SUM(BF5:BF68),2)","v":0},null,{"$f":"ROUND(SUM(BH5:BH68),2)","v":0},null,{"$f":"ROUND(SUM(BJ5:BJ68),2)","v":0},null,{"$f":"ROUND(SUM(BL5:BL68),2)","v":0},null,{"$f":"ROUND(SUM(BN5:BN68),2)","v":0},null,{"$f":"ROUND(SUM(BP5:BP68),2)","v":0},null,{"$f":"ROUND(SUM(BR5:BR68),2)","v":0},null,{"$f":"ROUND(SUM(BT5:BT68),2)","v":0},null,{"$f":"ROUND(SUM(BV5:BV68),2)","v":0},null,{"$f":"ROUND(SUM(BX5:BX68),2)","v":0},null,{"$f":"ROUND(SUM(BZ5:BZ68),2)","v":0},null,{"$f":"ROUND(SUM(CB5:CB68),2)","v":0},null,{"$f":"ROUND(SUM(CD5:CD68),2)","v":0},null,{"$f":"ROUND(SUM(CF5:CF68),2)","v":0},null,{"$f":"ROUND(SUM(CH5:CH68),2)","v":0},null,{"$f":"ROUND(SUM(CJ5:CJ68),2)","v":0},null,{"$f":"ROUND(SUM(CL5:CL68),2)","v":0},null,{"$f":"ROUND(SUM(CN5:CN68),2)","v":0},null,{"$f":"ROUND(SUM(CP5:CP68),2)","v":0},null,{"$f":"ROUND(SUM(CR5:CR68),2)","v":0},null,{"$f":"ROUND(SUM(CT5:CT68),2)","v":0},null,{"$f":"ROUND(SUM(CV5:CV68),2)","v":0},null,{"$f":"ROUND(SUM(CX5:CX68),2)","v":0},null,{"$f":"ROUND(SUM(CZ5:CZ68),2)","v":0},null,{"$f":"ROUND(SUM(DB5:DB68),2)","v":0},null,{"$f":"ROUND(SUM(DD5:DD68),2)","v":0},null,{"$f":"ROUND(SUM(DF5:DF68),2)","v":0},null,{"$f":"ROUND(SUM(DH5:DH68),2)","v":0},null,{"$f":"ROUND(SUM(DJ5:DJ68),2)","v":0},null,{"$f":"ROUND(SUM(DL5:DL68),2)","v":0},null,{"$f":"ROUND(SUM(DN5:DN68),2)","v":0},null,{"$f":"ROUND(SUM(DP5:DP68),2)","v":0},null,{"$f":"ROUND(SUM(DR5:DR68),2)","v":0},null,{"$f":"ROUND(SUM(DT5:DT68),2)","v":0},null,{"$f":"ROUND(SUM(DV5:DV68),2)","v":0},null,{"$f":"ROUND(SUM(DX5:DX68),2)","v":0},null,{"$f":"ROUND(SUM(DZ5:DZ68),2)","v":0}]
[null,null,"CATEGORIAS",null,null,null,null,"QUANTIDADE"]
[null,null,null,null,null,null,null,null,null,null,{"$f":"IF($C8=K$4,1,0)","v":0}]
{"$rows_left_out":46}
{"sheet":"EPI","index":13,"n_rows":42,"n_cols":128,"rows_kept":42,"cut":false,"hidden":true,"merged":[[2,1,2,3],[3,1,3,5]]}
[]
[]
[]
[null,"EQUIPAMENTOS DE PROTEÇÃO INDIVIDUAL - AQUISIÇÃO",null,null,null,null,null,null,1,null,{"$f":"I4+1","v":2},null,{"$f":"K4+1","v":3},null,{"$f":"M4+1","v":4},null,{"$f":"O4+1","v":5},null,{"$f":"Q4+1","v":6},null,{"$f":"S4+1","v":7},null,{"$f":"U4+1","v":8},null,{"$f":"W4+1","v":9},null,{"$f":"Y4+1","v":10},null,{"$f":"AA4+1","v":11},null,{"$f":"AC4+1","v":12},null,{"$f":"AE4+1","v":13},null,{"$f":"AG4+1","v":14},null,{"$f":"AI4+1","v":15},null,{"$f":"AK4+1","v":16},null,{"$f":"AM4+1","v":17},null,{"$f":"AO4+1","v":18},null,{"$f":"AQ4+1","v":19},null,{"$f":"AS4+1","v":20},null,{"$f":"AU4+1","v":21},null,{"$f":"AW4+1","v":22},null,{"$f":"AY4+1","v":23},null,{"$f":"BA4+1","v":24},null,{"$f":"BC4+1","v":25},null,{"$f":"BE4+1","v":26},null,{"$f":"BG4+1","v":27},null,{"$f":"BI4+1","v":28},null,{"$f":"BK4+1","v":29},null,{"$f":"BM4+1","v":30},null,{"$f":"BO4+1","v":31},null,{"$f":"BQ4+1","v":32},null,{"$f":"BS4+1","v":33},null,{"$f":"BU4+1","v":34},null,{"$f":"BW4+1","v":35},null,{"$f":"BY4+1","v":36},null,{"$f":"CA4+1","v":37},null,{"$f":"CC4+1","v":38},null,{"$f":"CE4+1","v":39},null,{"$f":"CG4+1","v":40},null,{"$f":"CI4+1","v":41},null,{"$f":"CK4+1","v":42},null,{"$f":"CM4+1","v":43},null,{"$f":"CO4+1","v":44},null,{"$f":"CQ4+1","v":45},null,{"$f":"CS4+1","v":46},null,{"$f":"CU4+1","v":47},null,{"$f":"CW4+1","v":48},null,{"$f":"CY4+1","v":49},null,{"$f":"DA4+1","v":50},null,{"$f":"DC4+1","v":51},null,{"$f":"DE4+1","v":52},null,{"$f":"DG4+1","v":53},null,{"$f":"DI4+1","v":54},null,{"$f":"DK4+1","v":55},null,{"$f":"DM4+1","v":56},null,{"$f":"DO4+1","v":57},null,{"$f":"DQ4+1","v":58},null,{"$f":"DS4+1","v":59},null,{"$f":"DU4+1","v":60}]
[]
[null,null,null,null,null,null,null,null,{"$f":"ROUND(SUM(J5:J76),2)","v":0},null,{"$f":"ROUND(SUM(L5:L76),2)","v":0},null,{"$f":"ROUND(SUM(N5:N76),2)","v":0},null,{"$f":"ROUND(SUM(P5:P76),2)","v":0},null,{"$f":"ROUND(SUM(R5:R76),2)","v":0},null,{"$f":"ROUND(SUM(T5:T76),2)","v":0},null,{"$f":"ROUND(SUM(V5:V76),2)","v":0},null,{"$f":"ROUND(SUM(X5:X76),2)","v":0},null,{"$f":"ROUND(SUM(Z5:Z76),2)","v":0},null,{"$f":"ROUND(SUM(AB5:AB76),2)","v":0},null,{"$f":"ROUND(SUM(AD5:AD76),2)","v":0},null,{"$f":"ROUND(SUM(AF5:AF76),2)","v":0},null,{"$f":"ROUND(SUM(AH5:AH76),2)","v":0},null,{"$f":"ROUND(SUM(AJ5:AJ76),2)","v":0},null,{"$f":"ROUND(SUM(AL5:AL76),2)","v":0},null,{"$f":"ROUND(SUM(AN5:AN76),2)","v":0},null,{"$f":"ROUND(SUM(AP5:AP76),2)","v":0},null,{"$f":"ROUND(SUM(AR5:AR76),2)","v":0},null,{"$f":"ROUND(SUM(AT5:AT76),2)","v":0},null,{"$f":"ROUND(SUM(AV5:AV76),2)","v":0},null,{"$f":"ROUND(SUM(AX5:AX76),2)","v":0},null,{"$f":"ROUND(SUM(AZ5:AZ76),2)","v":0},null,{"$f":"ROUND(SUM(BB5:BB76),2)","v":0},null,{"$f":"ROUND(SUM(BD5:BD76),2)","v":0},null,{"$f":"ROUND(SUM(BF5:BF76),2)","v":0},null,{"$f":"ROUND(SUM(BH5:BH76),2)","v":0},null,{"$f":"ROUND(SUM(BJ5:BJ76),2)","v":0},null,{"$f":"ROUND(SUM(BL5:BL76),2)","v":0},null,{"$f":"ROUND(SUM(BN5:BN76),2)","v":0},null,{"$f":"ROUND(SUM(BP5:BP76),2)","v":0},null,{"$f":"ROUND(SUM(BR5:BR76),2)","v":0},null,{"$f":"ROUND(SUM(BT5:BT76),2)","v":0},null,{"$f":"ROUND(SUM(BV5:BV76),2)","v":0},null,{"$f":"ROUND(SUM(BX5:BX76),2)","v":0},null,{"$f":"ROUND(SUM(BZ5:BZ76),2)","v":0},null,{"$f":"ROUND(SUM(CB5:CB76),2)","v":0},null,{"$f":"ROUND(SUM(CD5:CD76),2)","v":0},null,{"$f":"ROUND(SUM(CF5:CF76),2)","v":0},null,{"$f":"ROUND(SUM(CH5:CH76),2)","v":0},null,{"$f":"ROUND(SUM(CJ5:CJ76),2)","v":0},null,{"$f":"ROUND(SUM(CL5:CL76),2)","v":0},null,{"$f":"ROUND(SUM(CN5:CN76),2)","v":0},null,{"$f":"ROUND(SUM(CP5:CP76),2)","v":0},null,{"$f":"ROUND(SUM(CR5:CR76),2)","v":0},null,{"$f":"ROUND(SUM(CT5:CT76),2)","v":0},null,{"$f":"ROUND(SUM(CV5:CV76),2)","v":0},null,{"$f":"ROUND(SUM(CX5:CX76),2)","v":0},null,{"$f":"ROUND(SUM(CZ5:CZ76),2)","v":0},null,{"$f":"ROUND(SUM(DB5:DB76),2)","v":0},null,{"$f":"ROUND(SUM(DD5:DD76),2)","v":0},null,{"$f":"ROUND(SUM(DF5:DF76),2)","v":0},null,{"$f":"ROUND(SUM(DH5:DH76),2)","v":0},null,{"$f":"ROUND(SUM(DJ5:DJ76),2)","v":0},null,{"$f":"ROUND(SUM(DL5:DL76),2)","v":0},null,{"$f":"ROUND(SUM(DN5:DN76),2)","v":0},null,{"$f":"ROUND(SUM(DP5:DP76),2)","v":0},null,{"$f":"ROUND(SUM(DR5:DR76),2)","v":0},null,{"$f":"ROUND(SUM(DT5:DT76),2)","v":0},null,{"$f":"ROUND(SUM(DV5:DV76),2)","v":0},null,{"$f":"ROUND(SUM(DX5:DX76),2)","v":0}]
[null,null,"CATEGORIAS",null,null,"QUANTIDADE"]
[null,null,null,null,null,null,null,null,{"$f":"IF($C8=I$4,1,0)","v":0}]
{"$rows_left_out":35}
{"sheet":"SREP","index":14,"n_rows":75,"n_cols":15,"rows_kept":75,"cut":false,"hidden":true,"merged":[[2,1,2,3],[3,1,3,14]]}
[]
[]
[]
[null,"SISTEMA DE REGISTRO ELETRÔNICO DE PRESENÇA - SREP"]
[]
[]
[null,null,"PAGAMENTO DA DEPRECIAÇÃO"]
[null,null,"ITEM","DESCRIÇÃO","QUANT ANUAL","CONTA SIAFI","VALOR DE AQ.","% RESIDUAL","VIDA ÚTIL","DEP. MENSAL","CUSTO TOTAL","BDI (%)","PREÇO TOTAL","FONTE","REFERÊNCIA"]
{"$rows_left_out":68}
{"sheet":"Não Rel - EPI","index":15,"n_rows":32,"n_cols":15,"rows_kept":32,"cut":false,"hidden":true,"merged":[[2,1,2,4],[3,1,3,11]]}
[]
[]
[]
[null,"EPIS NÃO RELACIONADOS DIRETAMENTE A UM POSTO DE TRABALHO - AQUISIÇÃO"]
[]
[]
[null,null,null,"ITEM","DESCRIÇÃO","QUANT ANUAL","UNIDADE","CUSTO UNITÁRIO","CUSTO ANUAL","BDI (%)","PREÇO TOTAL","FONTE"]
[]
{"$rows_left_out":25}
{"sheet":"Equip Rel","index":16,"n_rows":80,"n_cols":136,"rows_kept":80,"cut":false,"hidden":true,"merged":[[9,1,9,3],[10,1,10,14]]}
[null,null,"CÂMARA DOS DEPUTADOS"]
[null,null,"DEPARTAMENTO TÉCNICO"]
[null,null,"Coordenação de Planejamento e Gestão"]
[]
[null,null,"Data:",{"$f":"'Dados Gerais'!#REF!","v":{"$error":"#REF!"}}]
[null,null,"Processo:",{"$f":"'Dados Gerais'!#REF!","v":{"$error":"#REF!"}}]
[null,null,"Objeto:",{"$f":"'Dados Gerais'!#REF!","v":{"$error":"#REF!"}}]
[]
{"$rows_left_out":73}
{"sheet":"Não Rel - Depr","index":17,"n_rows":95,"n_cols":15,"rows_kept":95,"cut":false,"hidden":true,"merged":[[2,1,2,3],[3,1,3,14]]}
[]
[]
[]
[null,"EQUIPAMENTOS NÃO RELACIONADOS DIRETAMENTE A UM POSTO DE TRABALHO - PAGAMENTO DA DEPRECIAÇÃO / MANUTENÇÃO"]
[]
[]
[null,null,"PAGAMENTO DA DEPRECIAÇÃO"]
[null,null,"ITEM","DESCRIÇÃO","QUANT ANUAL","CONTA SIAFI","VALOR DE AQ.","% RESIDUAL","VIDA ÚTIL","DEP. MENSAL","CUSTO TOTAL","BDI (%)","PREÇO TOTAL","FONTE","REFERÊNCIA"]
{"$rows_left_out":88}
{"sheet":"Não Rel - Mat Consumo","index":18,"n_rows":50,"n_cols":14,"rows_kept":50,"cut":false,"hidden":true,"merged":[[2,1,2,4],[3,1,3,13]]}
[]
[]
[]
[null,"MATERIAIS NÃO RELACIONADOS DIRETAMENTE A UM POSTO DE TRABALHO - AQUISIÇÃO SOB DEMANDA"]
[]
[]
[null,null,"ITEM","CÓDIGO","DESCRIÇÃO","QUANT MENSAL","QUANT ANUAL","UNIDADE","CUSTO UNITÁRIO","CUSTO TOTAL","BDI (%)","PREÇO TOTAL","FONTE","REFERÊNCIA"]
[]
{"$rows_left_out":43}
{"sheet":"Não Rel - Mat Cons Durável","index":19,"n_rows":36,"n_cols":14,"rows_kept":36,"cut":false,"hidden":true,"merged":[[2,1,2,4],[3,1,3,13]]}
[]
[]
[]
[null,"MATERIAIS DE CONSUMO PERMANENTE NÃO RELACIONADOS DIRETAMENTE A UM POSTO DE TRABALHO - AQUISIÇÃO SOB DEMANDA"]
[]
[]
[null,null,"ITEM","CÓDIGO","DESCRIÇÃO","ESTOQUE INICIAL","QUANT ANUAL","UNIDADE","CUSTO UNITÁRIO","CUSTO TOTAL","BDI (%)","PREÇO TOTAL","FONTE","REFERÊNCIA"]
[]
{"$rows_left_out":29}
{"sheet":"Não Rel - Serviços","index":20,"n_rows":11,"n_cols":13,"rows_kept":11,"cut":false,"hidden":true,"merged":[[1,1,1,4],[2,1,2,12]]}
[]
[]
[null,"SERVIÇOS NÃO RELACIONADOS DIRETAMENTE A UM POSTO DE TRABALHO - AQUISIÇÃO SOB DEMANDA"]
[]
[]
[null,null,"ITEM","CÓDIGO","DESCRIÇÃO","QUANT ANUAL","UNIDADE","CUSTO UNITÁRIO","CUSTO TOTAL","BDI (%)","PREÇO TOTAL","FONTE","REFERÊNCIA"]
[]
[null,null,1,null,null,null,null,null,{"$f":"H8*F8","v":0},{"$f":"BDI!E17","v":0},{"$f":"ROUND(I8*(1+J8),2)","v":0},"Cotação"]
{"$rows_left_out":4}
{"sheet":"Not. Demanda","index":21,"n_rows":59,"n_cols":8,"rows_kept":59,"cut":false,"hidden":true,"merged":[[9,1,9,3],[10,1,10,7]]}
[null,null,"CÂMARA DOS DEPUTADOS"]
[null,null,"DEPARTAMENTO TÉCNICO"]
[null,null,"Coordenação de Planejamento e Gestão"]
[]
[null,null,"Data:",{"$f":"'Dados Gerais'!#REF!","v":{"$error":"#REF!"}}]
[null,null,"Processo:",{"$f":"'Dados Gerais'!#REF!","v":{"$error":"#REF!"}}]
[null,null,"Objeto:",{"$f":"'Dados Gerais'!#REF!","v":{"$error":"#REF!"}}]
[]
{"$rows_left_out":52}
{"sheet":"Mat Cons","index":22,"n_rows":28,"n_cols":128,"rows_kept":28,"cut":false,"hidden":true,"merged":[[9,1,9,3],[10,1,10,5]]}
[null,null,"CÂMARA DOS DEPUTADOS"]
[null,null,"DEPARTAMENTO TÉCNICO"]
[null,null,"Coordenação de Planejamento e Gestão"]
[]
[null,null,"Data:",{"$f":"'Dados Gerais'!#REF!","v":{"$error":"#REF!"}}]
[null,null,"Processo:",{"$f":"'Dados Gerais'!#REF!","v":{"$error":"#REF!"}}]
[null,null,"Objeto:",{"$f":"'Dados Gerais'!#REF!","v":{"$error":"#REF!"}}]
[]
{"$rows_left_out":21}
{"sheet":"Mat Perm","index":23,"n_rows":113,"n_cols":136,"rows_kept":113,"cut":false,"hidden":true,"merged":[[9,1,9,3],[10,1,10,14]]}
[null,null,"CÂMARA DOS DEPUTADOS"]
[null,null,"DEPARTAMENTO TÉCNICO"]
[null,null,"Coordenação de Planejamento e Gestão"]
[]
[null,null,"Data:",{"$f":"'Dados Gerais'!#REF!","v":{"$error":"#REF!"}}]
[null,null,"Processo:",{"$f":"'Dados Gerais'!#REF!","v":{"$error":"#REF!"}}]
[null,null,"Objeto:",{"$f":"'Dados Gerais'!#REF!","v":{"$error":"#REF!"}}]
[]
{"$rows_left_out":105}