{"text_format":"1","workbook":"xlsx","n_sheets":24,"sheets":["GUIA PARA PREENCHIMENTO","MODELO PROPOSTA","Remunerações","Resumo","1","3","4","5","6","Dados Gerais","Encargos Sociais (APRENDIZ)","BDI","Uniformes","EPI","SREP","Não Rel - EPI","Equip Rel","Não Rel - Depr","Não Rel - Mat Consumo","Não Rel - Mat Cons Durável","Não Rel - Serviços","Not. Demanda","Mat Cons","Mat Perm"],"not_rendered":{"charts":0,"images":8,"macros":1,"external_links":0,"defined_names":29,"comments":1,"pivot_tables":0},"unopened":[],"bounds":{"document_bytes":16777216,"sheet_cells":100000,"rows_first":2000,"rows_last":500,"rows_between":2000,"halvings":0,"cell_chars":16384,"cell_head_chars":4096},"cells_cut":0,"cells_raw":0,"read":"whole","date_system":"1900"}

{"sheet":"GUIA PARA PREENCHIMENTO","index":0,"n_rows":5,"n_cols":1,"rows_kept":5,"cut":false,"hidden":false,"merged":[]}
["GUIA PARA PREENCHIMENTO"]
[]
["1 - Preencher apenas as guias azuis:"]
[]
["2 - Recomendamos preencher somente as células com fundo azul claro. As demais possuem fórmulas e sugerimos não alterá-las."]

{"sheet":"MODELO PROPOSTA","index":1,"n_rows":57,"n_cols":2,"rows_kept":57,"cut":false,"hidden":false,"merged":[[9,1,9,9],[1,1,1,9],[4,1,4,9],[6,1,6,9],[7,1,7,9],[8,1,8,9],[27,1,27,4],[27,5,27,9],[10,1,10,9],[11,1,11,9],[12,1,12,9],[16,1,16,9],[17,1,17,9],[18,1,18,2],[19,1,20,9],[21,1,21,9],[23,1,23,9],[24,1,24,9],[25,1,25,9],[28,1,28,4],[28,5,28,9],[29,1,29,4],[29,5,29,9],[30,1,30,4],[30,5,30,9],[31,1,31,4],[31,5,31,9],[32,1,32,4],[32,5,32,9],[34,1,34,9],[35,6,35,10],[36,1,36,9],[37,1,37,9],[38,1,38,9],[39,1,39,9],[47,1,47,4],[47,5,47,9],[44,1,44,9],[45,1,45,4],[45,5,45,9],[46,1,46,4],[46,5,46,9],[48,1,48,9],[51,1,51,9],[52,1,52,9],[53,1,53,9],[56,1,56,9]]}
[]
[null,"MODELO DA PROPOSTA COMPLETA"]
[]
[null,"."]
[null,"I – FORMALIZAÇÃO"]
[]
[null,"PREGÃO ELETRÔNICO N.    138/2023"]
[null,"OBJETO: Prestação de serviços de formação técnico-profissional metódica de adolescentes aprendizes, por entidade sem fins lucrativos (ESFL), com atividades teóricas a serem realizadas em local(is) a ser(em) disponibilizado(s) pela Contratada e atividades práticas a serem realizadas nas dependências da Contratante, pelo período de 24 (vinte e quatro) meses."]
[null,"LICITANTE: _____________________________________________________"]
[null,"CNPJ: ________________________________________________________"]
[null,"ENDEREÇO COMPLETO: _________________________________________"]
[null,"TELEFONE:_____________________________________________________"]
[null,"E-MAIL: ________________________________________________________"]
[]
[]
[]
[null,"Apresentamos nossa proposta para o item único da presente licitação, de acordo com as disposições do Edital."]
[null,"Decorre do conteúdo da presente proposta a explicitação do seguinte PREÇO DE JULGAMENTO (GLOBAL PARA O PERÍODO DE 24 (VINTE E QUATRO) MESES) PARA O ITEM:"]
[null,"R$:"]
[]
[]
[null,"(por extenso)"]
[]
[null,"No valor proposto estão incluídos todos os custos e todas as despesas, diretas e indiretas, para a execução dos serviços objeto da licitação, em conformidade com as especificações e demais condições e exigências constantes do Edital."]
[]
[null,"O prazo de validade da presente proposta é de ______ (por extenso) dias. (observado o disposto no Título 10 do Edital)."]
[]
[null,"Convenção coletiva de trabalho ou a norma coletiva a que estamos obrigados:"]
[null,"Data-Base:"]
[null,"Número do Registro no SRT:"]
[null,"Regime de tributação da empresa:"]
[null,"Empresa adere ao PAT (Programa de Alimentação do Trabalhador)?"]
[null,"(Se adere ao PAT): Os valores apresentados na presente proposta consideram eventuais descontos aos empregados?"]
[]
[null,"DECLARAÇÕES"]
[]
[]
[null,"Declaramos que:"]
[null,"a)   o item único constante desta proposta corresponde exatamente às especificações descritas no Anexo n. 1 e às condições de execução dos serviços descritas no Anexo n. 5 do Edital, às quais aderimos formalmente;"]
[null,"b)   disponibilizaremos instalações, equipamentos e pessoal técnico adequados para realização do objeto da presente licitação."]
[]
[]
[]
[]
[null,"DADOS PARA ASSINATURA DO CONTRATO"]
[null,"Nome do signatário"]
[null,"Cargo"]
[null,"Qualificação\n(CPF, naturalidade e domicílio)"]
[null,"OBS.: O signatário deve possuir poderes de administração estabelecidos em contrato social e/ou possuir procuração com poderes para assinar contratos em nome da empresa. \nA documentação comprobatória deverá ser encaminhada quando da assinatura do contrato."]
[]
[]
[null,"Brasília,     de                     de 2023."]
[]
[null,"Assinatura do representante legal da empresa"]
[]
[]
[null,"Nome do representante legal da empresa"]

{"sheet":"Remunerações","index":2,"n_rows":12,"n_cols":11,"rows_kept":12,"cut":false,"hidden":false,"merged":[[0,1,0,10]]}
[null,"QUADRO DE REMUNERAÇÕES"]
[]
[null,null,"ITEM","CATEGORIA","QUANTIDADE","SALÁRIO","ADICIONAL DE PERICULOSIDADE","ADICIONAL DE INSALUBRIDADE","ADICIONAL NOTURNO","OUTROS","SALÁRIO COM ADICIONAIS"]
[]
[null,null,1,{"$f":"HLOOKUP($C5,'Dados Gerais'!$D$5:$G$68,6)","v":"ADOLESCENTE APRENDIZ"},{"$f":"HLOOKUP($C5,'Dados Gerais'!$D$5:$G$68,10)","v":180},{"$f":"HLOOKUP($C5,'Dados Gerais'!$D$5:$G$68,8)","v":1320},{"$f":"HLOOKUP($C5,'Dados Gerais'!$D$5:$G$68,26)","v":0},{"$f":"HLOOKUP($C5,'Dados Gerais'!$D$5:$G$68,32)","v":0},{"$f":"HLOOKUP($C5,'Dados Gerais'!$D$5:$G$68,47)","v":0},{"$f":"HLOOKUP($C5,'Dados Gerais'!$D$5:$G$68,34)","v":0},{"$f":"SUM(F5:J5)","v":1320}]
[]
[null,null,3,{"$f":"HLOOKUP($C7,'Dados Gerais'!$D$5:$G$68,6)","v":0},{"$f":"HLOOKUP($C7,'Dados Gerais'!$D$5:$G$68,10)","v":0},{"$f":"HLOOKUP($C7,'Dados Gerais'!$D$5:$G$68,8)","v":0},{"$f":"HLOOKUP($C7,'Dados Gerais'!$D$5:$G$68,26)","v":0},{"$f":"HLOOKUP($C7,'Dados Gerais'!$D$5:$G$68,32)","v":0},{"$f":"HLOOKUP($C7,'Dados Gerais'!$D$5:$G$68,47)","v":0},{"$f":"HLOOKUP($C7,'Dados Gerais'!$D$5:$G$68,34)","v":0},{"$f":"SUM(F7:J7)","v":0}]
[null,null,4,{"$f":"HLOOKUP($C8,'Dados Gerais'!$D$5:$G$68,6)","v":0},{"$f":"HLOOKUP($C8,'Dados Gerais'!$D$5:$G$68,10)","v":0},{"$f":"HLOOKUP($C8,'Dados Gerais'!$D$5:$G$68,8)","v":0},{"$f":"HLOOKUP($C8,'Dados Gerais'!$D$5:$G$68,26)","v":0},{"$f":"HLOOKUP($C8,'Dados Gerais'!$D$5:$G$68,32)","v":0},{"$f":"HLOOKUP($C8,'Dados Gerais'!$D$5:$G$68,47)","v":0},{"$f":"HLOOKUP($C8,'Dados Gerais'!$D$5:$G$68,34)","v":0},0]
[null,null,5,{"$f":"HLOOKUP($C9,'Dados Gerais'!$D$5:$G$68,6)","v":0},{"$f":"HLOOKUP($C9,'Dados Gerais'!$D$5:$G$68,10)","v":0},{"$f":"HLOOKUP($C9,'Dados Gerais'!$D$5:$G$68,8)","v":0},{"$f":"HLOOKUP($C9,'Dados Gerais'!$D$5:$G$68,26)","v":0},{"$f":"HLOOKUP($C9,'Dados Gerais'!$D$5:$G$68,32)","v":0},{"$f":"HLOOKUP($C9,'Dados Gerais'!$D$5:$G$68,47)","v":0},{"$f":"HLOOKUP($C9,'Dados Gerais'!$D$5:$G$68,34)","v":0},0]
[null,null,6,{"$f":"HLOOKUP($C10,'Dados Gerais'!$D$5:$H$68,6)","v":0},{"$f":"HLOOKUP($C10,'Dados Gerais'!$D$5:$H$68,10)","v":0},{"$f":"HLOOKUP($C10,'Dados Gerais'!$D$5:$H$68,8)","v":0},{"$f":"HLOOKUP($C10,'Dados Gerais'!$D$5:$G$68,26)","v":0},{"$f":"HLOOKUP($C10,'Dados Gerais'!$D$5:$G$68,32)","v":0},{"$f":"HLOOKUP($C10,'Dados Gerais'!$D$5:$G$68,47)","v":0},{"$f":"HLOOKUP($C10,'Dados Gerais'!$D$5:$G$68,34)","v":0},0]
[]
[null,null,null,"TOTAL DE POSTOS",{"$f":"SUM(E5:E11)","v":180}]

{"sheet":"Resumo","index":3,"n_rows":74,"n_cols":12,"rows_kept":74,"cut":false,"hidden":false,"merged":[[71,3,71,7],[41,3,41,7],[57,3,57,7],[63,3,63,7],[2,1,2,8],[20,1,20,8],[11,1,11,8],[53,3,53,7],[67,3,67,7]]}
[]
[]
[null,"RESUMO - TOTAIS MENSAIS - FATURA ORDINÁRIA (SEM O 13º E SEM OS ITENS SOB DEMANDA)"]
[]
[]
[null,null,"ITEM","POSTO DE TRABALHO","QUANTIDADE","PREÇO UNIT       (SEM O 13º)","DESTAQUE DO 13º","PREÇO POR EMPREGADO","PREÇO TOTAL (MENSAL)"]
[null,null,1,{"$f":"HLOOKUP(C7,'Dados Gerais'!$D$5:$BJ$10,6)","v":"ADOLESCENTE APRENDIZ"},{"$f":"HLOOKUP(C7,'Dados Gerais'!$D$5:$BJ$14,10)","v":180},{"$f":"'1'!$E$116","v":2734.1840750000001},0,{"$f":"G7+F7","v":2734.1840750000001},{"$f":"H7*E7","v":492153.1335}]
[]
[null,null,null,"TOTAL MENSAL - SALÁRIOS",null,null,null,null,{"$f":"SUM(I7:I8)","v":492153.1335}]
[]
[]
[null,"RESUMO - TOTAIS MENSAIS - DESTAQUE DO 13º SALÁRIO"]
[]
[]
[null,null,"ITEM","POSTO DE TRABALHO","QUANTIDADE","PREÇO UNIT       (SEM O 13º)","DESTAQUE DO 13º","PREÇO POR EMPREGADO","PREÇO TOTAL (MENSAL)"]
[null,null,1,{"$f":"HLOOKUP(C16,'Dados Gerais'!$D$5:$BJ$10,6)","v":"ADOLESCENTE APRENDIZ"},{"$f":"HLOOKUP(C16,'Dados Gerais'!$D$5:$BJ$14,10)","v":180},0,{"$f":"G25","v":117.89},{"$f":"G16+F16","v":117.89},{"$f":"H16*E16","v":21220.2}]
[]
[null,null,null,"TOTAL MENSAL - DESTAQUE DO 13º",null,null,null,null,{"$f":"SUM(I16:I17)","v":21220.2}]
[]
[]
[null,"RESUMO - TOTAIS MENSAIS - FATURA ORDINÁRIA TOTAL"]
[]
[]
[null,null,"ITEM","POSTO DE TRABALHO","QUANTIDADE","PREÇO UNIT       (SEM O 13º)","DESTAQUE DO 13º","PREÇO POR EMPREGADO","PREÇO TOTAL (MENSAL)"]
[null,null,1,{"$f":"HLOOKUP(C25,'Dados Gerais'!$D$5:$BJ$10,6)","v":"ADOLESCENTE APRENDIZ"},{"$f":"HLOOKUP(C25,'Dados Gerais'!$D$5:$BJ$14,10)","v":180},{"$f":"'1'!$E$116","v":2734.1840750000001},{"$f":"'1'!$E$117","v":117.89},{"$f":"G25+F25","v":2852.074075},{"$f":"H25*E25","v":513373.33350000001},null,{"$f":"I25/$I$27","v":1},{"$f":"$I$40*K25","v":0}]
[null,null,null,null,null,null,null,null,null,null,{"$f":"I26/$I$27","v":0},{"$f":"#REF!*K26","v":{"$error":"#REF!"}}]
[null,null,null,"TOTAL MENSAL - SALÁRIOS",null,null,null,null,{"$f":"SUM(I25:I26)","v":513373.33350000001}]
[]
[null,null,"ITEM","DESCRIÇÃO",null,null,null,null,"PREÇO TOTAL (MENSAL)"]
[null,null,"EQUIP","EQUIPAMENTOS NÃO RELACIONADOS DIRETAMENTE A UM POSTO DE TRABALHO",null,null,null,null,{"$f":"'Não Rel - Depr'!M65","v":0}]
[null,null,"HEXTRA","HORAS EXTRAS",null,null,null,null,{"$f":"'Não Rel - Depr'!M65","v":0}]
[null,null,"HNOT","ADICIONAL DE HORAS NOTURNAS (SOB DEMANDA)"]
[null,null,"SREP","SISTEMA DE REGISTRO ELETRÔNICO DE PRESENÇA - SREP"]
[null,null,"EPI - N.REL","EQUIPAMENTOS DE PROTEÇÃO INDIVIDUAL NÃO RELACIONADOS DIRETAMENTE A UM POSTO DE TRABALHO"]
[null,null,"EQUIP - N.REL","EQUIPAMENTOS NÃO RELACIONADAS DIRETAMENTE A UM POSTO DE TRABALHO"]
[null,null,"MAT ","MATERIAIS NÃO RELACIONADOS DIRETAMENTE A UM POSTO DE TRABALHO"]
[null,null,"MAT CONS DURAVEL","MATERIAIS DE CONSUMO DURÁVEL NÃO RELACIONADOS DIRETAMENTE A UM POSTO DE TRABALHO"]
[null,null,"EQ SOB DEMANDA","SERVIÇOS NÃO RELACIONADOS DIRETAMENTE A UM POSTO DE TRABALHO - AQUISIÇÃO SOB DEMANDA"]
[]
[null,null,null,"TOTAL MENSAL",null,null,null,null,{"$f":"SUM(I30:I39)","v":0},null,{"$f":"(I40+I27)*12","v":6160480.0020000003}]
[]
[null,null,null,"TOTAL MENSAL - ITENS ORDINÁRIOS"]
[null,null,null,"DESCRIÇÃO",null,null,null,"VALOR"]
[null,null,null,"Postos de Trabalho - Inclusive 13º Salário",null,null,null,{"$f":"I27","v":513373.33350000001}]
[null,null,null,"Adicional de Horas Noturnas",null,null,null,{"$f":"I32","v":0}]
[null,null,null,"Sistema de Registro Eletrônico de Presença - SREP",null,null,null,{"$f":"I33","v":0}]
[null,null,null,"Equipamentos de Proteção Individual não relacionados diretamente a um posto de trabalho",null,null,null,{"$f":"I34","v":0}]
[null,null,null,"Equipamentos não relacionadas diretamente a um posto de trabalho",null,null,null,{"$f":"I35","v":0}]
[null,null,null,"Materiais de consumo não relacionados diretamente a um posto de trabalho",null,null,null,{"$f":"$I$36","v":0}]
[null,null,null,"Materiais de consumo duráveis não relacionados diretamente a um posto de trabalho",null,null,null,{"$f":"$I$37","v":0}]
[]
[null,null,null,null,null,null,"TOTAL MENSAL DA CONTRATAÇÃO",{"$f":"SUM(H44:H51)","v":513373.33350000001},null,null,{"$f":"Extenso_Valor(H52)","v":"quinhentos e treze mil, trezentos e setenta e três reais e trinta e três centavos"}]
[]
[null,null,null,"TOTAL ANUAL - ITENS ORDINÁRIOS"]
[]
[null,null,null,null,null,null,"12 x TOTAL MENSAL",{"$f":"H52*12","v":6160480.0020000003},null,null,{"$f":"Extenso_Valor(H56)","v":"seis milhões, cento e sessenta mil, quatrocentos e oitenta reais"}]
[]
[null,null,null,"TOTAL MENSAL - ITENS SOB DEMANDA"]
[null,null,null,"DESCRIÇÃO",null,null,null,"VALOR"]
[null,null,null,"Serviços não relacionados diretamente a um posto de trabalho - AQUISIÇÃO SOB DEMANDA",null,null,null,{"$f":"I38","v":0}]
[]
[null,null,null,null,null,null,"TOTAL MENSAL DA CONTRATAÇÃO",{"$f":"SUM(H60:H61)","v":0}]
[]
[null,null,null,"TOTAL ANUAL - ITENS SOB DEMANDA"]
[]
[null,null,null,null,null,null,"12 x TOTAL MENSAL",{"$f":"H62*12","v":0}]
[]
[null,null,null,"TOTAL ANUAL DA CONTRATAÇÃO"]
[]
[]
[]
[null,null,null,"TOTAL GLOBAL DA CONTRATAÇÃO (24 MESES)"]
[]
[null,null,null,null,null,null,null,{"$f":"H52*24","v":12320960.004000001}]

{"sheet":"1","index":4,"n_rows":119,"n_cols":8,"rows_kept":119,"cut":false,"hidden":false,"merged":[[107,1,107,3],[1,1,1,5],[2,1,2,5],[7,1,7,3],[17,1,17,3],[4,1,4,2],[46,1,46,3],[56,1,56,3],[74,1,74,3],[84,1,84,3],[5,1,5,2],[39,3,39,5],[68,3,68,5]]}
[]
[null,"PLANILHA DE ESTIMATIVA DE CUSTOS"]
[null,"Padrão IN 05/2017 e IN 07/2018 - MPDG"]
[]
[null,1,null,{"$f":"HLOOKUP($B$5,'Dados Gerais'!$D$5:$BJ$20,6)","v":"ADOLESCENTE APRENDIZ"},"QUANTIDADE",{"$f":"HLOOKUP($B$5,'Dados Gerais'!$D$5:$BJ$20,10)","v":180}]
[null,"CCT",null,{"$f":"HLOOKUP($B$5,'Dados Gerais'!$D$5:$BJ$20,15)","v":"-"},"DATA-BASE",{"$f":"HLOOKUP($B$5,'Dados Gerais'!$D$5:$BJ$20,16)","v":"-"}]
[]
[null,"MÓDULO 1 - COMPOSIÇÃO DA REMUNERAÇÃO",null,null,null,"Valor"]
[null,null,"A","Salário-Base",null,{"$f":"HLOOKUP($B$5,'Dados Gerais'!$D$5:$BJ$20,8)","v":1320}]
[null,null,"B","Adicional de Periculosidade",null,{"$f":"HLOOKUP($B$5,'Dados Gerais'!$D$5:$BJ$37,25)","v":0}]
[null,null,"C","Adicional de Insalubridade",null,{"$f":"HLOOKUP($B$5,'Dados Gerais'!$D$5:$BJ$37,31)","v":0}]
[null,null,"D","Adicional Noturno",null,{"$f":"HLOOKUP($B$5,'Dados Gerais'!$D$5:$BJ$50,46)","v":0},null,"* Nota 1 - O Módulo 1 refere-se ao valor mensal devido ao empregado pela prestação do serviço no período de 12 meses."]
[null,null,"E","Adicional de Hora Extra",null,{"$f":"HLOOKUP($B$5,'Dados Gerais'!$D$5:$BJ$67,63)","v":0},null,"* Nota 2 - O adicional de hora extra no feriado trabalhado foi suprimido pela Lei 13.467/17"]
[null,null,"F","Outros (especificar)",null,{"$f":"HLOOKUP($B$5,'Dados Gerais'!$D$5:$BJ$59,33)","v":0},null,"* Nota 3 - ART. 7º, § 2º, DA LEI Nº 605/49.Sendo mensalista o obreiro, o adicional noturno pago de forma fixa já é considerado integrado para os efeitos do pagamento do repouso semanal remunerado, nos termos do art. 7º, § 2º, da Lei nº 605/49."]
[]
[null,null,null,"TOTAL DA REMUNERAÇÃO",null,{"$f":"SUM(F9:F14)","v":1320}]
[]
[null,"MÓDULO 2 - ENCARGOS E BENEFÍCIOS ANUAIS, MENSAIS E DIÁRIOS",null,null,"Percentuais","Valor"]
[null,"Submódulo 2.1 - 13º Salário, Férias e Adicional de Férias"]
[null,null,"A","13º Salário - Calculado no Módulo 7 - Destacado",0,{"$f":"ROUND(E20*F$16,2)","v":0}]
[null,null,"B","Férias e Adicional de Férias",{"$f":"'Encargos Sociais (APRENDIZ)'!E31+'Encargos Sociais (APRENDIZ)'!E25","v":0.1111111111111111},{"$f":"ROUND(E21*F$16,2)","v":146.66999999999999},null,"* Nota 1 - Provisiona-se, mensalmente, o proporcional a 1/12 dos valores referentes a gratificação natalina, férias e adicional de férias."]
[null,null,null,null,null,null,null,"* Nota 2 - O adicional de férias contido no Submódulo 2.1 corresponde a 1/3 da remuneração que, por sua vez, é dividida por 12 contome Nota 1."]
[null,"Submódulo 2.2 - Encargos Previdenciários (GPS), Fundo de Garantia por Tempo de Serviço (FGTS) e Outras Contribuições"]
[null,null,"A","INSS (art. 22, inciso I, Lei nº 8.212/91)",{"$f":"'Encargos Sociais (APRENDIZ)'!E14","v":0},{"$f":"ROUND(E24*($F$16+$F$41+$F$73),2)","v":0}]
[null,null,"B","Salário Educação (art. 3º, inciso I, Decreto nº 87.043/82)",{"$f":"'Encargos Sociais (APRENDIZ)'!E15","v":0},{"$f":"ROUND(E25*($F$16+$F$41+$F$73),2)","v":0}]
[null,null,"C","SAT/RAT (art. 22, II, Lei 8.212/91 e Anexo V, Decreto 6.042/07) - Enquadramento 8211-3/00",{"$f":"'Encargos Sociais (APRENDIZ)'!E16","v":0},0]
[null,null,"D","SESC ou SESI (art. 30, Lei nº 8.036/90 e art. 1º, Lei 8.154/90)",{"$f":"'Encargos Sociais (APRENDIZ)'!E17","v":0},0]
[null,null,"E","SENAI ou SENAC (Decreto nº 2.318/86)",{"$f":"'Encargos Sociais (APRENDIZ)'!E18","v":0},0]
[null,null,"F","SEBRAE (§ 3º, art. 8º, Lei 8.029/90, alterada pela Lei nº 8.154/90)",{"$f":"'Encargos Sociais (APRENDIZ)'!E19","v":0},0]
[null,null,"G","INCRA (art. 1º, I, Decreto Lei 1.146/70 e Lei 7.787, de 30/06/89)",{"$f":"'Encargos Sociais (APRENDIZ)'!E20","v":0},0,null,"* Nota 1 - Os percentuais dos encargos previdenciários, do FGTS e demais contribuições são estabelecidos por legislação vigente."]
[null,null,"H","FGTS (Lei Complementar nº 110/01 e art. 30, Lei nº 8.036/90)",{"$f":"'Encargos Sociais (APRENDIZ)'!E21","v":0.02},29.33,null,"* Nota 2 - O SAT, a depender do grau de risco do serviço, irá variar entre 1%, para risco leve, de 2%, para risco médio, e de 3% para risco grave."]
[null,null,"I","SECONCI (Convenções Coletivas de Trabalho da construção)",{"$f":"'Encargos Sociais (APRENDIZ)'!E22","v":0},0,null,"* Nota 3 - Os percentuais do Submódulo 2.2 incidem sobre o Módulo 1 e o Submódulo 2.1."]
[]
[null,"Submódulo 2.3 - Benefícios Mensais e Diários"]
[null,null,"A","Auxílio Transporte",null,{"$f":"HLOOKUP($B$5,'Dados Gerais'!$D$5:$BJ$93,82)","v":162.80000000000001}]
[null,null,"B","Auxílio Alimentação",null,{"$f":"HLOOKUP($B$5,'Dados Gerais'!$D$5:$BJ$93,89)","v":770}]
[null,null,"C","Assistência Médica e Familiar",null,{"$f":"HLOOKUP($B$5,'Dados Gerais'!$D$5:$BJ$101,97)","v":0}]
[null,null,"D","Outros (Seguro de vida e auxílio funeral e auxílio odontológico)",null,{"$f":"'Dados Gerais'!D118","v":9.9},null,"* Nota 1 - O valor informado deverá ser o custo real do benefício (descontado o valor eventualmente pago pelo empregado)."]
[null,null,null,null,null,null,null,"* Nota 2 - Observar a previsão dos benefícios contidos em Acordos, Convenções e Dissídios Coletivos de Trabalho e o disposto no art. 6º da IN 5/2017"]
[null,null,null,"QUADRO-RESUMO DO MÓDULO 2"]
[null,null,null,"2.1 - 13º Salário, Férias e Adicional de Férias - 13º Destacado - Calculado no Módulo 7 ",{"$f":"SUM(E20:E21)","v":0.1111111111111111},{"$f":"F20+F21","v":146.66999999999999}]
[null,null,null,"2.2 - Encargos Previdenciários (GPS), Fundo de Garantia por Tempo de Serviço (FGTS) e Contribuições",{"$f":"SUM(E24:E32)","v":0.02},{"$f":"SUM(F24:F32)","v":29.33}]
[null,null,null,"2.3 - Benefícios Mensais e Diários",null,{"$f":"SUM(F35:F38)","v":942.69999999999993}]
[]
[null,null,null,"TOTAL DOS ENCARGOS E BENEFÍCIOS",null,{"$f":"SUM(F41:F43)","v":1118.6999999999998}]
[]
[null,"MÓDULO 3 - PREVISÃO PARA RESCISÃO",null,null,"Percentuais","Valor"]
[null,null,"A","Aviso Prévio Indenizado (Art. 7º, inciso XXI, da CF/1988 e arts. 477, 487, §1º, e 491 da CLT)",{"$f":"'Encargos Sociais (APRENDIZ)'!E36","v":0},{"$f":"ROUND(E48*$F$16,2)","v":0}]
[null,null,"B","Incidência do FGTS sobre o Aviso Prévio Indenizado (Súmula 305 TST)",{"$f":"'Encargos Sociais (APRENDIZ)'!E37","v":0},0,null,"* Nota 1 - Adotou-se os parâmetros do estudo do STF (http://www.stf.jus.br/arquivo/cms/sobrestfestudosci/anexo/encargos_sociais_03102007.pdf), onde 5% do pessoal é demitido pelo empregador no decurso do contrato (para estes, considerou-se o aviso prévio indenizado). Desprezou-se as demissões por justa causa e os pedidos de demissão."]
[null,null,"C","Multa do FGTS e Contribuição Social sobre o Aviso Prévio Indenizado (Art. 18, §1º, da Lei 8.036/1990 e art. 1º da LC nº 110/2001)",{"$f":"'Encargos Sociais (APRENDIZ)'!E38","v":0},0,null,"* Nota 2 - No cálculo do percentual, considerou-se 36 dias, correspondendo à metade da duração média dos contratos (2 anos)"]
[null,null,"D","Aviso Prévio Trabalhado (Art. 488, parágrafo único, CLT)",{"$f":"'Encargos Sociais (APRENDIZ)'!E39","v":0},0,null,"* Nota 3 - Incide sobre a Remuneração + 13º salário (1/12) + Férias (1/12) + Adicional de Férias (1/36) x 50% multa (40% para o empregado e 10% de contribuição social) x 8% FGTS"]
[null,null,"E","Incidência de GPS, FGTS e outras contribuições sobre o Aviso Prévio Trabalhado",{"$f":"'Encargos Sociais (APRENDIZ)'!E40","v":0},0,null,"* Nota 4 - Os 95% restantes do cálculo, a um prazo médio de contrato de 4 anos. Assim, calcula-se 7 dias para o 1º ano de contrato e mais 3 dias para os 3 anos seguintes."]
[null,null,"F","Multa do FGTS e Contribuição Social sobre o Aviso Prévio Trabalhado",{"$f":"'Encargos Sociais (APRENDIZ)'!E41","v":0},0]
[]
[null,null,null,"TOTAL DE PREVISÃO PARA RESCISÃO",null,{"$f":"SUM(F48:F53)","v":0}]
[]
[null,"MÓDULO 4 - CUSTO DE SUBSTUIÇÃO DO PROFISSIONAL AUSENTE",null,null,"Percentuais","Valor"]
[null,"Submódulo 4.1 - Ausências Legais"]
[null,null,"A","Férias (Arts. 129 e 130, inc. I, da CLT) - do Substituto",0,{"$f":"ROUND(E59*$F$16,2)","v":0},null,"* Nota 1 - As alíneas “A” a “F” referem-se somente ao custo que será pago ao repositor pelos dias \ntrabalhados quando da necessidade de substituir a mão de obra alocada na prestação do serviço."]
[null,null,"B","Ausências Legais (Arts. 131 e 473 da CLT)",{"$f":"'Encargos Sociais (APRENDIZ)'!E26","v":0},0,null,"* Nota 2 - Adotou-se a estimativa do SINAPI de 2 dias por ano."]
[null,null,"C","Licença-Paternidade (Art. 7º, XIX, e art. 10, §1º, do ADCT, CF/1988 e Art. 1º, II, da Lei 11.770/2008)",{"$f":"'Encargos Sociais (APRENDIZ)'!E27","v":0},0,null,"* Nota 3 - Utilizada a proporção de 50% para homens, 5 dias de afastamento, e a probabilidade de um trabalhador requerer a Licença Paternidade em 5,22%, conforme SINAPI (citando dados da PNAD 2015)"]
[null,null,"D","Ausência por Acidente de Trabalho (Art. 131, III, da CLT)",{"$f":"'Encargos Sociais (APRENDIZ)'!E28","v":0},0,null,"* Nota 4 - Utilzada a estatística de 1,96% dos contribuintes beneficiados com a emissão do auxílio, conforme Anuário Estatístico da Previdência Social. Afastamento de 15 dias a cargo da empresa."]
[null,null,"E","Afastamento Maternidade (Art. 71 da Lei nº 8.213/1991)",{"$f":"'Encargos Sociais (APRENDIZ)'!E29","v":0},0,null,"* Nota 5 - Utilizada a proporção de 50% para mulheres, 180 dias de afastamento, e a probabilidade de uma trabalhadora requerer a Licença Maternidade em 4,91%, conforme SINAPI (citando dados do IBGE 2016)"]
[null,null,"F","Auxílio Enfermidade - Doença (Art. 59 da Lei nº 8.213/1991)",{"$f":"'Encargos Sociais (APRENDIZ)'!E30","v":0},0,null,"* Nota 6 - Utilizada a estatística de 3,37% dos contribuintes beneficiados com o auxílio, conforme Anuário Estatístico da Previdência Social de 2015 (acrescidos de 2 dias ao ano, para os quais o trabalhador nem requer o benefício da Previdência - conforme SINAPI)"]
[]
[null,"Submódulo 4.2 - Intrajornada"]
[null,null,"A","Intervalo para repouso ou alimentação",{"$f":"'Encargos Sociais (APRENDIZ)'!E33","v":0},{"$f":"ROUND(E67*$F$16,2)","v":0}]
[]
[null,null,null,"QUADRO-RESUMO DO MÓDULO 4",null,"Valor"]
[null,null,null,"4.1 - Ausências Legais",{"$f":"SUM(E59:E64)","v":0},{"$f":"ROUND(E70*$F$16,2)","v":0}]
[null,null,null,"4.2 - Intrajornada",{"$f":"E67","v":0},{"$f":"ROUND(E71*$F$16,2)","v":0}]
[]
[null,null,null,"TOTAL DE PREVISÃO PARA RESCISÃO E INTERVALO INTRAJORNADA",null,{"$f":"SUM(F70:F71)","v":0}]
[]
[null,"MÓDULO 5 - INSUMOS DIVERSOS",null,null,null,"Valor"]
[null,null,"A","Uniformes - aquisição",null,{"$f":"ROUND(HLOOKUP($B$5,Uniformes!K4:DZ49,3)/12,2)","v":8.66}]
[null,null,"B","Materiais de consumo relacionados ao posto - aquisição",null,{"$f":"ROUND(HLOOKUP(B5,'Mat Cons'!I11:DX13,3)/12,2)","v":0}]
[null,null,"C","Materiais permanentes relacionados ao posto - remuneração da sua depreciação / manutenção",null,{"$f":"HLOOKUP(B5,'Mat Perm'!Q11:EF13,3)","v":0}]
[null,null,"D","Equipamentos relacionados ao posto - remuneração da sua depreciação / manutenção",null,{"$f":"HLOOKUP(B5,'Equip Rel'!Q11:EF13,3)","v":0}]
[null,null,"E","Equipamentos de Proteção Individual - EPI - aquisição",null,{"$f":"ROUND(HLOOKUP(B5,EPI!I4:DX6,3)/12,2)","v":0}]
[null,null,"F","Programa de Aprendizagem",null,{"$f":"'Dados Gerais'!D124","v":154.89000000000001}]
[]
[null,null,null,"TOTAL DE INSUMOS DIVERSOS",null,{"$f":"SUM(F76:F82)","v":163.55000000000001},null,"* Nota - Valores mensais por empregado"]
[]
[null,"MÓDULO 6 - CUSTOS INDIRETOS, TRIBUTOS E LUCRO - BDI",null,null,"Percentuais","Valor"]
[null,null,"A","Custos Indiretos",{"$f":"BDI!E6","v":3.5000000000000003E-2}]
[null,null,"A.1","Administração Central",{"$f":"BDI!E7","v":3.5000000000000003E-2}]
[null,null,"A.2","Seguros, Garantias e Riscos",{"$f":"BDI!E8","v":0}]
[null,null,"B","Lucro",{"$f":"BDI!E10","v":0}]
[null,null,"C","Tributos",{"$f":"SUM(E91:E92)","v":0.01}]
[null,null,"C.1","Tributos Federais (COFINS, PIS e CPRB)",{"$f":"BDI!E18","v":0.01}]
[null,null,"C.2","Tributos Distritais (ISS)",{"$f":"BDI!E23","v":0},null,null,"* Nota - Utilizou-se o indicado pelo Sindicato da Arquitetura e da Engenharia (Sinaenco, 2008, p. 22), que adota um percentual redutor de 20% no cálculo dos custos tributários relativos às contribuições PIS e COFINS"]
[null,null,"D","Despesas Financeiras",{"$f":"BDI!E13","v":5.0569567433733642E-3}]
[]
[null,null,null,"TOTAL DE BDI",{"$f":"BDI!E26","v":5.0700000000000002E-2},{"$f":"E95*E103","v":131.93407500000001}]
[]
[null,null,null,"QUADRO-RESUMO DO CUSTO MENSAL POR EMPREGADO - SEM O 13º","Valor"]
[null,null,null,"Módulo 1 - Composição da Remuneração",{"$f":"F16","v":1320}]
[null,null,null,"Módulo 2 - Encargos e Benefícios Anuais, Mensais e Diários",{"$f":"F45","v":1118.6999999999998}]
[null,null,null,"Módulo 3 - Provisão para Rescisão",{"$f":"F55","v":0}]
[null,null,null,"Módulo 4 - Custo de Reposição do Profissional Ausente",{"$f":"F73","v":0}]
[null,null,null,"Módulo 5 - Insumos Diversos",{"$f":"F83","v":163.55000000000001}]
[null,null,null,"SUBTOTAL (A+B+C+D+E)",{"$f":"SUM(E98:E102)","v":2602.25}]
[null,null,null,"Módulo 6 - Custos Indiretos, Tributos e Lucro",{"$f":"F95","v":131.93407500000001}]
[]
[null,null,null,"TOTAL DO POSTO",{"$f":"SUM(E103:E104)","v":2734.1840750000001}]
[]
[null,"MÓDULO 7 - DESTAQUE DO MÓDULO 2 - 13º SALÁRIO",null,null,"Percentuais","Valor"]
[null,null,"A","13º Salário",{"$f":"'Encargos Sociais (APRENDIZ)'!E32","v":8.3333333333333329E-2},{"$f":"ROUND(E109*F$16,2)","v":110}]
[null,null,"B","Encargos Sociais sobre o 13º Salário - Taxa calculada no SUBMÓDULO 2.2",{"$f":"SUM($E$24:$E$32)","v":0.02},{"$f":"ROUND(E110*$F$109,2)","v":2.2000000000000002},null,"* Nota 1 - Provisiona-se, mensalmente, o proporcional a 1/12 dos valores referentes a gratificação natalina e adicional de férias."]
[null,null,"C","BDI sobre o 13º Salário - Taxa calculada no MÓDULO 6",{"$f":"E95","v":5.0700000000000002E-2},{"$f":"ROUND(E111*($F$109+$F$110),2)","v":5.69}]
[]
[null,null,null,"TOTAL DO DESTAQUE DO 13º SALÁRIO",null,{"$f":"SUM(F109:F111)","v":117.89}]
[]
[null,null,null,"QUADRO-RESUMO DO CUSTO MENSAL POR EMPREGADO","Valor"]
[null,null,null,"Custo total - sem o 13º Salário",{"$f":"E106","v":2734.1840750000001}]
[null,null,null,"Destaque do 13º Salário (valor mensal)",{"$f":"F113","v":117.89}]
[]
[null,null,null,"TOTAL DO POSTO",{"$f":"E116+E117","v":2852.074075}]

{"sheet":"3","index":5,"n_rows":118,"n_cols":8,"rows_kept":118,"cut":false,"hidden":true,"merged":[[1,1,1,5],[2,1,2,5],[4,1,4,2],[5,1,5,2],[7,1,7,3],[17,1,17,3],[106,1,106,3],[39,3,39,5],[46,1,46,3],[56,1,56,3],[68,3,68,5],[74,1,74,3],[83,1,83,3]]}
[]
[null,"PLANILHA DE ESTIMATIVA DE CUSTOS"]
[null,"Padrão IN 05/2017 e IN 07/2018 - MPDG"]
[]
[null,3,null,{"$f":"HLOOKUP($B$5,'Dados Gerais'!$D$5:$BJ$20,6)","v":0},"QUANTIDADE",{"$f":"HLOOKUP($B$5,'Dados Gerais'!$D$5:$BJ$20,10)","v":0}]
[null,"CCT",null,{"$f":"HLOOKUP($B$5,'Dados Gerais'!$D$5:$BJ$20,15)","v":0},"DATA-BASE",{"$f":"HLOOKUP($B$5,'Dados Gerais'!$D$5:$BJ$20,16)","v":"00:00:00"}]
[]
[null,"MÓDULO 1 - COMPOSIÇÃO DA REMUNERAÇÃO",null,null,null,"Valor"]
[null,null,"A","Salário-Base",null,{"$f":"HLOOKUP($B$5,'Dados Gerais'!$D$5:$BJ$20,8)","v":0}]
[null,null,"B","Adicional de Periculosidade",null,{"$f":"HLOOKUP($B$5,'Dados Gerais'!$D$5:$BJ$37,25)","v":0}]
[null,null,"C","Adicional de Insalubridade",null,{"$f":"HLOOKUP($B$5,'Dados Gerais'!$D$5:$BJ$37,31)","v":0}]
[null,null,"D","Adicional Noturno",null,{"$f":"HLOOKUP($B$5,'Dados Gerais'!$D$5:$BJ$50,46)","v":0},null,"* Nota 1 - O Módulo 1 refere-se ao valor mensal devido ao empregado pela prestação do serviço no período de 12 meses."]
[null,null,"E","Adicional de Hora Extra",null,{"$f":"HLOOKUP($B$5,'Dados Gerais'!$D$5:$BJ$67,63)","v":0},null,"* Nota 2 - O adicional de hora extra no feriado trabalhado foi suprimido pela Lei 13.467/17"]
[null,null,"F","Outros (especificar)",null,{"$f":"HLOOKUP($B$5,'Dados Gerais'!$D$5:$BJ$59,33)","v":0},null,"* Nota 3 - ART. 7º, § 2º, DA LEI Nº 605/49.Sendo mensalista o obreiro, o adicional noturno pago de forma fixa já é considerado integrado para os efeitos do pagamento do repouso semanal remunerado, nos termos do art. 7º, § 2º, da Lei nº 605/49."]
[]
[null,null,null,"TOTAL DA REMUNERAÇÃO",null,{"$f":"SUM(F9:F14)","v":0}]
[]
[null,"MÓDULO 2 - ENCARGOS E BENEFÍCIOS ANUAIS, MENSAIS E DIÁRIOS",null,null,"Percentuais","Valor"]
[null,"Submódulo 2.1 - 13º Salário, Férias e Adicional de Férias"]
[null,null,"A","13º Salário - Calculado no Módulo 7 - Destacado",0,{"$f":"ROUND(E20*F$16,2)","v":0}]
[null,null,"B","Férias e Adicional de Férias",{"$f":"'Encargos Sociais (APRENDIZ)'!E31","v":2.7777777777777776E-2},{"$f":"ROUND(E21*F$16,2)","v":0},null,"* Nota 1 - Provisiona-se, mensalmente, o proporcional a 1/12 dos valores referentes a gratificação natalina, férias e adicional de férias."]
[null,null,null,null,null,null,null,"* Nota 2 - O adicional de férias contido no Submódulo 2.1 corresponde a 1/3 da remuneração que, por sua vez, é dividida por 12 contome Nota 1."]
[null,"Submódulo 2.2 - Encargos Previdenciários (GPS), Fundo de Garantia por Tempo de Serviço (FGTS) e Outras Contribuições"]
[null,null,"A","INSS (art. 22, inciso I, Lei nº 8.212/91)",{"$f":"'Encargos Sociais (APRENDIZ)'!E14","v":0},{"$f":"ROUND(E24*($F$16+$F$41+$F$73),2)","v":0}]
[null,null,"B","Salário Educação (art. 3º, inciso I, Decreto nº 87.043/82)",{"$f":"'Encargos Sociais (APRENDIZ)'!E15","v":0},{"$f":"ROUND(E25*($F$16+$F$41+$F$73),2)","v":0}]
[null,null,"C","SAT/RAT (art. 22, II, Lei 8.212/91 e Anexo V, Decreto 6.042/07) - Enquadramento 8211-3/00",{"$f":"'Encargos Sociais (APRENDIZ)'!E16","v":0},0]
[null,null,"D","SESC ou SESI (art. 30, Lei nº 8.036/90 e art. 1º, Lei 8.154/90)",{"$f":"'Encargos Sociais (APRENDIZ)'!E17","v":0},0]
[null,null,"E","SENAI ou SENAC (Decreto nº 2.318/86)",{"$f":"'Encargos Sociais (APRENDIZ)'!E18","v":0},0]
[null,null,"F","SEBRAE (§ 3º, art. 8º, Lei 8.029/90, alterada pela Lei nº 8.154/90)",{"$f":"'Encargos Sociais (APRENDIZ)'!E19","v":0},0]
[null,null,"G","INCRA (art. 1º, I, Decreto Lei 1.146/70 e Lei 7.787, de 30/06/89)",{"$f":"'Encargos Sociais (APRENDIZ)'!E20","v":0},0,null,"* Nota 1 - Os percentuais dos encargos previdenciários, do FGTS e demais contribuições são estabelecidos por legislação vigente."]
[null,null,"H","FGTS (Lei Complementar nº 110/01 e art. 30, Lei nº 8.036/90)",{"$f":"'Encargos Sociais (APRENDIZ)'!E21","v":0.02},0,null,"* Nota 2 - O SAT, a depender do grau de risco do serviço, irá variar entre 1%, para risco leve, de 2%, para risco médio, e de 3% para risco grave."]
[null,null,"I","SECONCI (Convenções Coletivas de Trabalho da construção)",{"$f":"'Encargos Sociais (APRENDIZ)'!E22","v":0},0,null,"* Nota 3 - Os percentuais do Submódulo 2.2 incidem sobre o Módulo 1 e o Submódulo 2.1."]
[]
[null,"Submódulo 2.3 - Benefícios Mensais e Diários"]
[null,null,"A","Auxílio Transporte",null,{"$f":"HLOOKUP($B$5,'Dados Gerais'!$D$5:$BJ$93,82)","v":0}]
[null,null,"B","Auxílio Alimentação",null,{"$f":"HLOOKUP($B$5,'Dados Gerais'!$D$5:$BJ$93,89)","v":0}]
[null,null,"C","Assistência Médica e Familiar",null,{"$f":"HLOOKUP($B$5,'Dados Gerais'!$D$5:$BJ$101,97)","v":0}]
[null,null,"D","Outros (Seguro de vida e auxílio funeral e auxílio odontológico)",null,{"$f":"HLOOKUP($B$5,'Dados Gerais'!$D$5:$BJ$125,114)","v":0},null,"* Nota 1 - O valor informado deverá ser o custo real do benefício (descontado o valor eventualmente pago pelo empregado)."]
[null,null,null,null,null,null,null,"* Nota 2 - Observar a previsão dos benefícios contidos em Acordos, Convenções e Dissídios Coletivos de Trabalho e o disposto no art. 6º da IN 5/2017"]
[null,null,null,"QUADRO-RESUMO DO MÓDULO 2"]
[null,null,null,"2.1 - 13º Salário, Férias e Adicional de Férias - 13º Destacado - Calculado no Módulo 7 ",{"$f":"SUM(E20:E21)","v":2.7777777777777776E-2},{"$f":"F20+F21","v":0}]
[null,null,null,"2.2 - Encargos Previdenciários (GPS), Fundo de Garantia por Tempo de Serviço (FGTS) e Contribuições",{"$f":"SUM(E24:E32)","v":0.02},{"$f":"SUM(F24:F32)","v":0}]
[null,null,null,"2.3 - Benefícios Mensais e Diários",null,{"$f":"SUM(F35:F38)","v":0}]
[]
[null,null,null,"TOTAL DOS ENCARGOS E BENEFÍCIOS",null,{"$f":"SUM(F41:F43)","v":0}]
[]
[null,"MÓDULO 3 - PREVISÃO PARA RESCISÃO",null,null,"Percentuais","Valor"]
[null,null,"A","Aviso Prévio Indenizado (Art. 7º, inciso XXI, da CF/1988 e arts. 477, 487, §1º, e 491 da CLT)",{"$f":"'Encargos Sociais (APRENDIZ)'!E36","v":0},{"$f":"ROUND(E48*$F$16,2)","v":0}]
[null,null,"B","Incidência do FGTS sobre o Aviso Prévio Indenizado (Súmula 305 TST)",{"$f":"'Encargos Sociais (APRENDIZ)'!E37","v":0},0,null,"* Nota 1 - Adotou-se os parâmetros do estudo do STF (http://www.stf.jus.br/arquivo/cms/sobrestfestudosci/anexo/encargos_sociais_03102007.pdf), onde 5% do pessoal é demitido pelo empregador no decurso do contrato (para estes, considerou-se o aviso prévio indenizado). Desprezou-se as demissões por justa causa e os pedidos de demissão."]
[null,null,"C","Multa do FGTS e Contribuição Social sobre o Aviso Prévio Indenizado (Art. 18, §1º, da Lei 8.036/1990 e art. 1º da LC nº 110/2001)",{"$f":"'Encargos Sociais (APRENDIZ)'!E38","v":0},0,null,"* Nota 2 - No cálculo do percentual, considerou-se 36 dias, correspondendo à metade da duração média dos contratos (2 anos)"]
[null,null,"D","Aviso Prévio Trabalhado (Art. 488, parágrafo único, CLT)",{"$f":"'Encargos Sociais (APRENDIZ)'!E39","v":0},0,null,"* Nota 3 - Incide sobre a Remuneração + 13º salário (1/12) + Férias (1/12) + Adicional de Férias (1/36) x 50% multa (40% para o empregado e 10% de contribuição social) x 8% FGTS"]
[null,null,"E","Incidência de GPS, FGTS e outras contribuições sobre o Aviso Prévio Trabalhado",{"$f":"'Encargos Sociais (APRENDIZ)'!E40","v":0},0,null,"* Nota 4 - Os 95% restantes do cálculo, a um prazo médio de contrato de 4 anos. Assim, calcula-se 7 dias para o 1º ano de contrato e mais 3 dias para os 3 anos seguintes."]
[null,null,"F","Multa do FGTS e Contribuição Social sobre o Aviso Prévio Trabalhado",{"$f":"'Encargos Sociais (APRENDIZ)'!E41","v":0},0]
[]
[null,null,null,"TOTAL DE PREVISÃO PARA RESCISÃO",null,{"$f":"SUM(F48:F53)","v":0}]
[]
[null,"MÓDULO 4 - CUSTO DO PROFISSIONAL AUSENTE",null,null,"Percentuais","Valor"]
[null,"Submódulo 4.1 - Ausências Legais"]
[null,null,"A","Férias (Arts. 129 e 130, inc. I, da CLT)",{"$f":"'Encargos Sociais (APRENDIZ)'!E25","v":8.3333333333333329E-2},{"$f":"ROUND(E59*$F$16,2)","v":0},null,"* Nota 1 - As alíneas “A” a “F” referem-se somente ao custo que será pago ao repositor pelos dias \ntrabalhados quando da necessidade de substituir a mão de obra alocada na prestação do serviço."]
[null,null,"B","Ausências Legais (Arts. 131 e 473 da CLT)",{"$f":"'Encargos Sociais (APRENDIZ)'!E26","v":0},0,null,"* Nota 2 - Adotou-se a estimativa do SINAPI de 2 dias por ano."]
[null,null,"C","Licença-Paternidade (Art. 7º, XIX, e art. 10, §1º, do ADCT, CF/1988 e Art. 1º, II, da Lei 11.770/2008)",{"$f":"'Encargos Sociais (APRENDIZ)'!E27","v":0},0,null,"* Nota 3 - Utilizada a proporção de 50% para homens, 5 dias de afastamento, e a probabilidade de um trabalhador requerer a Licença Paternidade em 5,22%, conforme SINAPI (citando dados da PNAD 2015)"]
[null,null,"D","Ausência por Acidente de Trabalho (Art. 131, III, da CLT)",{"$f":"'Encargos Sociais (APRENDIZ)'!E28","v":0},0,null,"* Nota 4 - Utilzada a estatística de 1,96% dos contribuintes beneficiados com a emissão do auxílio, conforme Anuário Estatístico da Previdência Social. Afastamento de 15 dias a cargo da empresa."]
[null,null,"E","Afastamento Maternidade (Art. 71 da Lei nº 8.213/1991)",{"$f":"'Encargos Sociais (APRENDIZ)'!E29","v":0},0,null,"* Nota 5 - Utilizada a proporção de 50% para mulheres, 180 dias de afastamento, e a probabilidade de uma trabalhadora requerer a Licença Maternidade em 4,91%, conforme SINAPI (citando dados do IBGE 2016)"]
[null,null,"F","Auxílio Enfermidade - Doença (Art. 59 da Lei nº 8.213/1991)",{"$f":"'Encargos Sociais (APRENDIZ)'!E30","v":0},0,null,"* Nota 6 - Utilizada a estatística de 3,37% dos contribuintes beneficiados com o auxílio, conforme Anuário Estatístico da Previdência Social de 2015 (acrescidos de 2 dias ao ano, para os quais o trabalhador nem requer o benefício da Previdência - conforme SINAPI)"]
[]
[null,"Submódulo 4.2 - Intrajornada"]
[null,null,"A","Intervalo para repouso ou alimentação",{"$f":"'Encargos Sociais (APRENDIZ)'!E33","v":0},{"$f":"ROUND(E67*$F$16,2)","v":0}]
[]
[null,null,null,"QUADRO-RESUMO DO MÓDULO 4",null,"Valor"]
[null,null,null,"4.1 - Ausências Legais",{"$f":"SUM(E59:E64)","v":8.3333333333333329E-2},{"$f":"ROUND(E70*$F$16,2)","v":0}]
[null,null,null,"4.2 - Intrajornada",{"$f":"E67","v":0},{"$f":"ROUND(E71*$F$16,2)","v":0}]
[]
[null,null,null,"TOTAL DE PREVISÃO PARA RESCISÃO E INTERVALO INTRAJORNADA",null,{"$f":"SUM(F70:F71)","v":0}]
[]
[null,"MÓDULO 5 - INSUMOS DIVERSOS",null,null,null,"Valor"]
[null,null,"A","Uniformes - aquisição",null,{"$f":"ROUND(HLOOKUP($B$5,Uniformes!K4:DZ6,3)/12,2)","v":0}]
[null,null,"B","Materiais de consumo relacionados ao posto - aquisição",null,{"$f":"ROUND(HLOOKUP(B5,'Mat Cons'!I11:DX13,3)/12,2)","v":0}]
[null,null,"C","Materiais permanentes relacionados ao posto - remuneração da sua depreciação / manutenção",null,{"$f":"HLOOKUP(B5,'Mat Perm'!Q11:EF13,3)","v":0}]
[null,null,"D","Equipamentos relacionados ao posto - remuneração da sua depreciação / manutenção",null,{"$f":"HLOOKUP(B5,'Equip Rel'!Q11:EF13,3)","v":0}]
[null,null,"E","Equipamentos de Proteção Individual - EPI - aquisição",null,{"$f":"ROUND(HLOOKUP(B5,EPI!I4:DX6,3)/12,2)","v":0}]
[]
[null,null,null,"TOTAL DE INSUMOS DIVERSOS",null,{"$f":"SUM(F76:F81)","v":0},null,"* Nota - Valores mensais por empregado"]
[]
[null,"MÓDULO 6 - CUSTOS INDIRETOS, TRIBUTOS E LUCRO - BDI",null,null,"Percentuais","Valor"]
[null,null,"A","Custos Indiretos",{"$f":"BDI!E6","v":3.5000000000000003E-2}]
[null,null,"A.1","Administração Central",{"$f":"BDI!E7","v":3.5000000000000003E-2}]
[null,null,"A.2","Seguros, Garantias e Riscos",{"$f":"BDI!E8","v":0}]
[null,null,"B","Lucro",{"$f":"BDI!E10","v":0}]
[null,null,"C","Tributos",{"$f":"SUM(E90:E91)","v":0.01}]
[null,null,"C.1","Tributos Federais (COFINS, PIS e CPRB)",{"$f":"BDI!E18","v":0.01}]
[null,null,"C.2","Tributos Distritais (ISS)",{"$f":"BDI!E23","v":0},null,null,"* Nota - Utilizou-se o indicado pelo Sindicato da Arquitetura e da Engenharia (Sinaenco, 2008, p. 22), que adota um percentual redutor de 20% no cálculo dos custos tributários relativos às contribuições PIS e COFINS"]
[null,null,"D","Despesas Financeiras",{"$f":"BDI!E13","v":5.0569567433733642E-3}]
[]
[null,null,null,"TOTAL DE BDI",{"$f":"BDI!E26","v":5.0700000000000002E-2},{"$f":"E94*E102","v":0}]
[]
[null,null,null,"QUADRO-RESUMO DO CUSTO MENSAL POR EMPREGADO - SEM O 13º","Valor"]
[null,null,null,"Módulo 1 - Composição da Remuneração",{"$f":"F16","v":0}]
[null,null,null,"Módulo 2 - Encargos e Benefícios Anuais, Mensais e Diários",{"$f":"F45","v":0}]
[null,null,null,"Módulo 3 - Provisão para Rescisão",{"$f":"F55","v":0}]
[null,null,null,"Módulo 4 - Custo de Reposição do Profissional Ausente",{"$f":"F73","v":0}]
[null,null,null,"Módulo 5 - Insumos Diversos",{"$f":"F82","v":0}]
[null,null,null,"SUBTOTAL (A+B+C+D+E)",{"$f":"SUM(E97:E101)","v":0}]
[null,null,null,"Módulo 6 - Custos Indiretos, Tributos e Lucro",{"$f":"F94","v":0}]
[]
[null,null,null,"TOTAL DO POSTO",{"$f":"SUM(E102:E103)","v":0}]
[]
[null,"MÓDULO 7 - DESTAQUE DO MÓDULO 2 - 13º SALÁRIO",null,null,"Percentuais","Valor"]
[null,null,"A","13º Salário",{"$f":"'Encargos Sociais (APRENDIZ)'!E32","v":8.3333333333333329E-2},{"$f":"ROUND(E108*F$16,2)","v":0}]
[null,null,"B","Encargos Sociais sobre o 13º Salário - Taxa calculada no SUBMÓDULO 2.2",{"$f":"SUM($E$24:$E$32)","v":0.02},{"$f":"ROUND(E109*$F$108,2)","v":0},null,"* Nota 1 - Provisiona-se, mensalmente, o proporcional a 1/12 dos valores referentes a gratificação natalina e adicional de férias."]
[null,null,"C","BDI sobre o 13º Salário - Taxa calculada no MÓDULO 6",{"$f":"E94","v":5.0700000000000002E-2},{"$f":"ROUND(E110*($F$108+$F$109),2)","v":0}]
[]
[null,null,null,"TOTAL DO DESTAQUE DO 13º SALÁRIO",null,{"$f":"SUM(F108:F110)","v":0}]
[]
[null,null,null,"QUADRO-RESUMO DO CUSTO MENSAL POR EMPREGADO","Valor"]
[null,null,null,"Custo total - sem o 13º Salário",{"$f":"E105","v":0}]
[null,null,null,"Destaque do 13º Salário (valor mensal)",{"$f":"F112","v":0}]
[]
[null,null,null,"TOTAL DO POSTO",{"$f":"E115+E116","v":0}]

{"sheet":"4","index":6,"n_rows":118,"n_cols":8,"rows_kept":118,"cut":false,"hidden":true,"merged":[[1,1,1,5],[2,1,2,5],[4,1,4,2],[5,1,5,2],[7,1,7,3],[17,1,17,3],[106,1,106,3],[39,3,39,5],[46,1,46,3],[56,1,56,3],[68,3,68,5],[74,1,74,3],[83,1,83,3]]}
[]
[null,"PLANILHA DE ESTIMATIVA DE CUSTOS"]
[null,"Padrão IN 05/2017 e IN 07/2018 - MPDG"]
[]
[null,4,null,{"$f":"HLOOKUP($B$5,'Dados Gerais'!$D$5:$BJ$20,6)","v":0},"QUANTIDADE",{"$f":"HLOOKUP($B$5,'Dados Gerais'!$D$5:$BJ$20,10)","v":0}]
[null,"CCT",null,{"$f":"HLOOKUP($B$5,'Dados Gerais'!$D$5:$BJ$20,15)","v":0},"DATA-BASE",{"$f":"HLOOKUP($B$5,'Dados Gerais'!$D$5:$BJ$20,16)","v":"00:00:00"}]
[]
[null,"MÓDULO 1 - COMPOSIÇÃO DA REMUNERAÇÃO",null,null,null,"Valor"]
[null,null,"A","Salário-Base",null,{"$f":"HLOOKUP($B$5,'Dados Gerais'!$D$5:$BJ$20,8)","v":0}]
[null,null,"B","Adicional de Periculosidade",null,{"$f":"HLOOKUP($B$5,'Dados Gerais'!$D$5:$BJ$37,25)","v":0}]
[null,null,"C","Adicional de Insalubridade",null,{"$f":"HLOOKUP($B$5,'Dados Gerais'!$D$5:$BJ$37,31)","v":0}]
[null,null,"D","Adicional Noturno",null,{"$f":"HLOOKUP($B$5,'Dados Gerais'!$D$5:$BJ$50,46)","v":0},null,"* Nota 1 - O Módulo 1 refere-se ao valor mensal devido ao empregado pela prestação do serviço no período de 12 meses."]
[null,null,"E","Adicional de Hora Extra",null,{"$f":"HLOOKUP($B$5,'Dados Gerais'!$D$5:$BJ$67,63)","v":0},null,"* Nota 2 - O adicional de hora extra no feriado trabalhado foi suprimido pela Lei 13.467/17"]
[null,null,"F","Outros (especificar)",null,{"$f":"HLOOKUP($B$5,'Dados Gerais'!$D$5:$BJ$59,33)","v":0},null,"* Nota 3 - ART. 7º, § 2º, DA LEI Nº 605/49.Sendo mensalista o obreiro, o adicional noturno pago de forma fixa já é considerado integrado para os efeitos do pagamento do repouso semanal remunerado, nos termos do art. 7º, § 2º, da Lei nº 605/49."]
[]
[null,null,null,"TOTAL DA REMUNERAÇÃO",null,{"$f":"SUM(F9:F14)","v":0}]
[]
[null,"MÓDULO 2 - ENCARGOS E BENEFÍCIOS ANUAIS, MENSAIS E DIÁRIOS",null,null,"Percentuais","Valor"]
[null,"Submódulo 2.1 - 13º Salário, Férias e Adicional de Férias"]
[null,null,"A","13º Salário - Calculado no Módulo 7 - Destacado",0,{"$f":"ROUND(E20*F$16,2)","v":0}]
[null,null,"B","Férias e Adicional de Férias",{"$f":"'Encargos Sociais (APRENDIZ)'!E31","v":2.7777777777777776E-2},{"$f":"ROUND(E21*F$16,2)","v":0},null,"* Nota 1 - Provisiona-se, mensalmente, o proporcional a 1/12 dos valores referentes a gratificação natalina, férias e adicional de férias."]
[null,null,null,null,null,null,null,"* Nota 2 - O adicional de férias contido no Submódulo 2.1 corresponde a 1/3 da remuneração que, por sua vez, é dividida por 12 contome Nota 1."]
[null,"Submódulo 2.2 - Encargos Previdenciários (GPS), Fundo de Garantia por Tempo de Serviço (FGTS) e Outras Contribuições"]
[null,null,"A","INSS (art. 22, inciso I, Lei nº 8.212/91)",{"$f":"'Encargos Sociais (APRENDIZ)'!E14","v":0},{"$f":"ROUND(E24*($F$16+$F$41+$F$73),2)","v":0}]
[null,null,"B","Salário Educação (art. 3º, inciso I, Decreto nº 87.043/82)",{"$f":"'Encargos Sociais (APRENDIZ)'!E15","v":0},{"$f":"ROUND(E25*($F$16+$F$41+$F$73),2)","v":0}]
[null,null,"C","SAT/RAT (art. 22, II, Lei 8.212/91 e Anexo V, Decreto 6.042/07) - Enquadramento 8211-3/00",{"$f":"'Encargos Sociais (APRENDIZ)'!E16","v":0},0]
[null,null,"D","SESC ou SESI (art. 30, Lei nº 8.036/90 e art. 1º, Lei 8.154/90)",{"$f":"'Encargos Sociais (APRENDIZ)'!E17","v":0},0]
[null,null,"E","SENAI ou SENAC (Decreto nº 2.318/86)",{"$f":"'Encargos Sociais (APRENDIZ)'!E18","v":0},0]
[null,null,"F","SEBRAE (§ 3º, art. 8º, Lei 8.029/90, alterada pela Lei nº 8.154/90)",{"$f":"'Encargos Sociais (APRENDIZ)'!E19","v":0},0]
[null,null,"G","INCRA (art. 1º, I, Decreto Lei 1.146/70 e Lei 7.787, de 30/06/89)",{"$f":"'Encargos Sociais (APRENDIZ)'!E20","v":0},0,null,"* Nota 1 - Os percentuais dos encargos previdenciários, do FGTS e demais contribuições são estabelecidos por legislação vigente."]
[null,null,"H","FGTS (Lei Complementar nº 110/01 e art. 30, Lei nº 8.036/90)",{"$f":"'Encargos Sociais (APRENDIZ)'!E21","v":0.02},0,null,"* Nota 2 - O SAT, a depender do grau de risco do serviço, irá variar entre 1%, para risco leve, de 2%, para risco médio, e de 3% para risco grave."]
[null,null,"I","SECONCI (Convenções Coletivas de Trabalho da construção)",{"$f":"'Encargos Sociais (APRENDIZ)'!E22","v":0},0,null,"* Nota 3 - Os percentuais do Submódulo 2.2 incidem sobre o Módulo 1 e o Submódulo 2.1."]
[]
[null,"Submódulo 2.3 - Benefícios Mensais e Diários"]
[null,null,"A","Auxílio Transporte",null,{"$f":"HLOOKUP($B$5,'Dados Gerais'!$D$5:$BJ$93,82)","v":0}]
[null,null,"B","Auxílio Alimentação",null,{"$f":"HLOOKUP($B$5,'Dados Gerais'!$D$5:$BJ$93,89)","v":0}]
[null,null,"C","Assistência Médica e Familiar",null,{"$f":"HLOOKUP($B$5,'Dados Gerais'!$D$5:$BJ$101,97)","v":0}]
[null,null,"D","Outros (Seguro de vida e auxílio funeral e auxílio odontológico)",null,{"$f":"HLOOKUP($B$5,'Dados Gerais'!$D$5:$BJ$125,114)","v":0},null,"* Nota 1 - O valor informado deverá ser o custo real do benefício (descontado o valor eventualmente pago pelo empregado)."]
[null,null,null,null,null,null,null,"* Nota 2 - Observar a previsão dos benefícios contidos em Acordos, Convenções e Dissídios Coletivos de Trabalho e o disposto no art. 6º da IN 5/2017"]
[null,null,null,"QUADRO-RESUMO DO MÓDULO 2"]
[null,null,null,"2.1 - 13º Salário, Férias e Adicional de Férias - 13º Destacado - Calculado no Módulo 7 ",{"$f":"SUM(E20:E21)","v":2.7777777777777776E-2},{"$f":"F20+F21","v":0}]
[null,null,null,"2.2 - Encargos Previdenciários (GPS), Fundo de Garantia por Tempo de Serviço (FGTS) e Contribuições",{"$f":"SUM(E24:E32)","v":0.02},{"$f":"SUM(F24:F32)","v":0}]
[null,null,null,"2.3 - Benefícios Mensais e Diários",null,{"$f":"SUM(F35:F38)","v":0}]
[]
[null,null,null,"TOTAL DOS ENCARGOS E BENEFÍCIOS",null,{"$f":"SUM(F41:F43)","v":0}]
[]
[null,"MÓDULO 3 - PREVISÃO PARA RESCISÃO",null,null,"Percentuais","Valor"]
[null,null,"A","Aviso Prévio Indenizado (Art. 7º, inciso XXI, da CF/1988 e arts. 477, 487, §1º, e 491 da CLT)",{"$f":"'Encargos Sociais (APRENDIZ)'!E36","v":0},{"$f":"ROUND(E48*$F$16,2)","v":0}]
[null,null,"B","Incidência do FGTS sobre o Aviso Prévio Indenizado (Súmula 305 TST)",{"$f":"'Encargos Sociais (APRENDIZ)'!E37","v":0},0,null,"* Nota 1 - Adotou-se os parâmetros do estudo do STF (http://www.stf.jus.br/arquivo/cms/sobrestfestudosci/anexo/encargos_sociais_03102007.pdf), onde 5% do pessoal é demitido pelo empregador no decurso do contrato (para estes, considerou-se o aviso prévio indenizado). Desprezou-se as demissões por justa causa e os pedidos de demissão."]
[null,null,"C","Multa do FGTS e Contribuição Social sobre o Aviso Prévio Indenizado (Art. 18, §1º, da Lei 8.036/1990 e art. 1º da LC nº 110/2001)",{"$f":"'Encargos Sociais (APRENDIZ)'!E38","v":0},0,null,"* Nota 2 - No cálculo do percentual, considerou-se 36 dias, correspondendo à metade da duração média dos contratos (2 anos)"]
[null,null,"D","Aviso Prévio Trabalhado (Art. 488, parágrafo único, CLT)",{"$f":"'Encargos Sociais (APRENDIZ)'!E39","v":0},0,null,"* Nota 3 - Incide sobre a Remuneração + 13º salário (1/12) + Férias (1/12) + Adicional de Férias (1/36) x 50% multa (40% para o empregado e 10% de contribuição social) x 8% FGTS"]
[null,null,"E","Incidência de GPS, FGTS e outras contribuições sobre o Aviso Prévio Trabalhado",{"$f":"'Encargos Sociais (APRENDIZ)'!E40","v":0},0,null,"* Nota 4 - Os 95% restantes do cálculo, a um prazo médio de contrato de 4 anos. Assim, calcula-se 7 dias para o 1º ano de contrato e mais 3 dias para os 3 anos seguintes."]
[null,null,"F","Multa do FGTS e Contribuição Social sobre o Aviso Prévio Trabalhado",{"$f":"'Encargos Sociais (APRENDIZ)'!E41","v":0},0]
[]
[null,null,null,"TOTAL DE PREVISÃO PARA RESCISÃO",null,{"$f":"SUM(F48:F53)","v":0}]
[]
[null,"MÓDULO 4 - CUSTO DO PROFISSIONAL AUSENTE",null,null,"Percentuais","Valor"]
[null,"Submódulo 4.1 - Ausências Legais"]
[null,null,"A","Férias (Arts. 129 e 130, inc. I, da CLT)",{"$f":"'Encargos Sociais (APRENDIZ)'!E25","v":8.3333333333333329E-2},{"$f":"ROUND(E59*$F$16,2)","v":0},null,"* Nota 1 - As alíneas “A” a “F” referem-se somente ao custo que será pago ao repositor pelos dias \ntrabalhados quando da necessidade de substituir a mão de obra alocada na prestação do serviço."]
[null,null,"B","Ausências Legais (Arts. 131 e 473 da CLT)",{"$f":"'Encargos Sociais (APRENDIZ)'!E26","v":0},0,null,"* Nota 2 - Adotou-se a estimativa do SINAPI de 2 dias por ano."]
[null,null,"C","Licença-Paternidade (Art. 7º, XIX, e art. 10, §1º, do ADCT, CF/1988 e Art. 1º, II, da Lei 11.770/2008)",{"$f":"'Encargos Sociais (APRENDIZ)'!E27","v":0},0,null,"* Nota 3 - Utilizada a proporção de 50% para homens, 5 dias de afastamento, e a probabilidade de um trabalhador requerer a Licença Paternidade em 5,22%, conforme SINAPI (citando dados da PNAD 2015)"]
[null,null,"D","Ausência por Acidente de Trabalho (Art. 131, III, da CLT)",{"$f":"'Encargos Sociais (APRENDIZ)'!E28","v":0},0,null,"* Nota 4 - Utilzada a estatística de 1,96% dos contribuintes beneficiados com a emissão do auxílio, conforme Anuário Estatístico da Previdência Social. Afastamento de 15 dias a cargo da empresa."]
[null,null,"E","Afastamento Maternidade (Art. 71 da Lei nº 8.213/1991)",{"$f":"'Encargos Sociais (APRENDIZ)'!E29","v":0},0,null,"* Nota 5 - Utilizada a proporção de 50% para mulheres, 180 dias de afastamento, e a probabilidade de uma trabalhadora requerer a Licença Maternidade em 4,91%, conforme SINAPI (citando dados do IBGE 2016)"]
[null,null,"F","Auxílio Enfermidade - Doença (Art. 59 da Lei nº 8.213/1991)",{"$f":"'Encargos Sociais (APRENDIZ)'!E30","v":0},0,null,"* Nota 6 - Utilizada a estatística de 3,37% dos contribuintes beneficiados com o auxílio, conforme Anuário Estatístico da Previdência Social de 2015 (acrescidos de 2 dias ao ano, para os quais o trabalhador nem requer o benefício da Previdência - conforme SINAPI)"]
[]
[null,"Submódulo 4.2 - Intrajornada"]
[null,null,"A","Intervalo para repouso ou alimentação",{"$f":"'Encargos Sociais (APRENDIZ)'!E33","v":0},{"$f":"ROUND(E67*$F$16,2)","v":0}]
[]
[null,null,null,"QUADRO-RESUMO DO MÓDULO 4",null,"Valor"]
[null,null,null,"4.1 - Ausências Legais",{"$f":"SUM(E59:E64)","v":8.3333333333333329E-2},{"$f":"ROUND(E70*$F$16,2)","v":0}]
[null,null,null,"4.2 - Intrajornada",{"$f":"E67","v":0},{"$f":"ROUND(E71*$F$16,2)","v":0}]
[]
[null,null,null,"TOTAL DE PREVISÃO PARA RESCISÃO E INTERVALO INTRAJORNADA",null,{"$f":"SUM(F70:F71)","v":0}]
[]
[null,"MÓDULO 5 - INSUMOS DIVERSOS",null,null,null,"Valor"]
[null,null,"A","Uniformes - aquisição",null,{"$f":"ROUND(HLOOKUP($B$5,Uniformes!K4:DZ6,3)/12,2)","v":0}]
[null,null,"B","Materiais de consumo relacionados ao posto - aquisição",null,{"$f":"ROUND(HLOOKUP(B5,'Mat Cons'!I11:DX13,3)/12,2)","v":0}]
[null,null,"C","Materiais permanentes relacionados ao posto - remuneração da sua depreciação / manutenção",null,{"$f":"HLOOKUP(B5,'Mat Perm'!Q11:EF13,3)","v":0}]
[null,null,"D","Equipamentos relacionados ao posto - remuneração da sua depreciação / manutenção",null,{"$f":"HLOOKUP(B5,'Equip Rel'!Q11:EF13,3)","v":0}]
[null,null,"E","Equipamentos de Proteção Individual - EPI - aquisição",null,{"$f":"ROUND(HLOOKUP(B5,EPI!I4:DX6,3)/12,2)","v":0}]
[]
[null,null,null,"TOTAL DE INSUMOS DIVERSOS",null,{"$f":"SUM(F76:F81)","v":0},null,"* Nota - Valores mensais por empregado"]
[]
[null,"MÓDULO 6 - CUSTOS INDIRETOS, TRIBUTOS E LUCRO - BDI",null,null,"Percentuais","Valor"]
[null,null,"A","Custos Indiretos",{"$f":"BDI!E6","v":3.5000000000000003E-2}]
[null,null,"A.1","Administração Central",{"$f":"BDI!E7","v":3.5000000000000003E-2}]
[null,null,"A.2","Seguros, Garantias e Riscos",{"$f":"BDI!E8","v":0}]
[null,null,"B","Lucro",{"$f":"BDI!E10","v":0}]
[null,null,"C","Tributos",{"$f":"SUM(E90:E91)","v":0.01}]
[null,null,"C.1","Tributos Federais (COFINS, PIS e CPRB)",{"$f":"BDI!E18","v":0.01}]
[null,null,"C.2","Tributos Distritais (ISS)",{"$f":"BDI!E23","v":0},null,null,"* Nota - Utilizou-se o indicado pelo Sindicato da Arquitetura e da Engenharia (Sinaenco, 2008, p. 22), que adota um percentual redutor de 20% no cálculo dos custos tributários relativos às contribuições PIS e COFINS"]
[null,null,"D","Despesas Financeiras",{"$f":"BDI!E13","v":5.0569567433733642E-3}]
[]
[null,null,null,"TOTAL DE BDI",{"$f":"BDI!E26","v":5.0700000000000002E-2},{"$f":"E94*E102","v":0}]
[]
[null,null,null,"QUADRO-RESUMO DO CUSTO MENSAL POR EMPREGADO - SEM O 13º","Valor"]
[null,null,null,"Módulo 1 - Composição da Remuneração",{"$f":"F16","v":0}]
[null,null,null,"Módulo 2 - Encargos e Benefícios Anuais, Mensais e Diários",{"$f":"F45","v":0}]
[null,null,null,"Módulo 3 - Provisão para Rescisão",{"$f":"F55","v":0}]
[null,null,null,"Módulo 4 - Custo de Reposição do Profissional Ausente",{"$f":"F73","v":0}]
[null,null,null,"Módulo 5 - Insumos Diversos",{"$f":"F82","v":0}]
[null,null,null,"SUBTOTAL (A+B+C+D+E)",{"$f":"SUM(E97:E101)","v":0}]
[null,null,null,"Módulo 6 - Custos Indiretos, Tributos e Lucro",{"$f":"F94","v":0}]
[]
[null,null,null,"TOTAL DO POSTO",{"$f":"SUM(E102:E103)","v":0}]
[]
[null,"MÓDULO 7 - DESTAQUE DO MÓDULO 2 - 13º SALÁRIO",null,null,"Percentuais","Valor"]
[null,null,"A","13º Salário",{"$f":"'Encargos Sociais (APRENDIZ)'!E32","v":8.3333333333333329E-2},{"$f":"ROUND(E108*F$16,2)","v":0}]
[null,null,"B","Encargos Sociais sobre o 13º Salário - Taxa calculada no SUBMÓDULO 2.2",{"$f":"SUM($E$24:$E$32)","v":0.02},{"$f":"ROUND(E109*$F$108,2)","v":0},null,"* Nota 1 - Provisiona-se, mensalmente, o proporcional a 1/12 dos valores referentes a gratificação natalina e adicional de férias."]
[null,null,"C","BDI sobre o 13º Salário - Taxa calculada no MÓDULO 6",{"$f":"E94","v":5.0700000000000002E-2},{"$f":"ROUND(E110*($F$108+$F$109),2)","v":0}]
[]
[null,null,null,"TOTAL DO DESTAQUE DO 13º SALÁRIO",null,{"$f":"SUM(F108:F110)","v":0}]
[]
[null,null,null,"QUADRO-RESUMO DO CUSTO MENSAL POR EMPREGADO","Valor"]
[null,null,null,"Custo total - sem o 13º Salário",{"$f":"E105","v":0}]
[null,null,null,"Destaque do 13º Salário (valor mensal)",{"$f":"F112","v":0}]
[]
[null,null,null,"TOTAL DO POSTO",{"$f":"E115+E116","v":0}]

{"sheet":"5","index":7,"n_rows":118,"n_cols":8,"rows_kept":118,"cut":false,"hidden":true,"merged":[[1,1,1,5],[2,1,2,5],[4,1,4,2],[5,1,5,2],[7,1,7,3],[17,1,17,3],[106,1,106,3],[39,3,39,5],[46,1,46,3],[56,1,56,3],[68,3,68,5],[74,1,74,3],[83,1,83,3]]}
[]
[null,"PLANILHA DE ESTIMATIVA DE CUSTOS"]
[null,"Padrão IN 05/2017 e IN 07/2018 - MPDG"]
[]
[null,5,null,{"$f":"HLOOKUP($B$5,'Dados Gerais'!$D$5:$BJ$20,6)","v":0},"QUANTIDADE",{"$f":"HLOOKUP($B$5,'Dados Gerais'!$D$5:$BJ$20,10)","v":0}]
[null,"CCT",null,{"$f":"HLOOKUP($B$5,'Dados Gerais'!$D$5:$BJ$20,15)","v":0},"DATA-BASE",{"$f":"HLOOKUP($B$5,'Dados Gerais'!$D$5:$BJ$20,16)","v":"00:00:00"}]
[]
[null,"MÓDULO 1 - COMPOSIÇÃO DA REMUNERAÇÃO",null,null,null,"Valor"]
[null,null,"A","Salário-Base",null,{"$f":"HLOOKUP($B$5,'Dados Gerais'!$D$5:$BJ$20,8)","v":0}]
[null,null,"B","Adicional de Periculosidade",null,{"$f":"HLOOKUP($B$5,'Dados Gerais'!$D$5:$BJ$37,25)","v":0}]
[null,null,"C","Adicional de Insalubridade",null,{"$f":"HLOOKUP($B$5,'Dados Gerais'!$D$5:$BJ$37,31)","v":0}]
[null,null,"D","Adicional Noturno",null,{"$f":"HLOOKUP($B$5,'Dados Gerais'!$D$5:$BJ$50,46)","v":0},null,"* Nota 1 - O Módulo 1 refere-se ao valor mensal devido ao empregado pela prestação do serviço no período de 12 meses."]
[null,null,"E","Adicional de Hora Extra",null,{"$f":"HLOOKUP($B$5,'Dados Gerais'!$D$5:$BJ$67,63)","v":0},null,"* Nota 2 - O adicional de hora extra no feriado trabalhado foi suprimido pela Lei 13.467/17"]
[null,null,"F","Outros (especificar)",null,{"$f":"HLOOKUP($B$5,'Dados Gerais'!$D$5:$BJ$59,33)","v":0},null,"* Nota 3 - ART. 7º, § 2º, DA LEI Nº 605/49.Sendo mensalista o obreiro, o adicional noturno pago de forma fixa já é considerado integrado para os efeitos do pagamento do repouso semanal remunerado, nos termos do art. 7º, § 2º, da Lei nº 605/49."]
[]
[null,null,null,"TOTAL DA REMUNERAÇÃO",null,{"$f":"SUM(F9:F14)","v":0}]
[]
[null,"MÓDULO 2 - ENCARGOS E BENEFÍCIOS ANUAIS, MENSAIS E DIÁRIOS",null,null,"Percentuais","Valor"]
[null,"Submódulo 2.1 - 13º Salário, Férias e Adicional de Férias"]
[null,null,"A","13º Salário - Calculado no Módulo 7 - Destacado",0,{"$f":"ROUND(E20*F$16,2)","v":0}]
[null,null,"B","Férias e Adicional de Férias",{"$f":"'Encargos Sociais (APRENDIZ)'!E31","v":2.7777777777777776E-2},{"$f":"ROUND(E21*F$16,2)","v":0},null,"* Nota 1 - Provisiona-se, mensalmente, o proporcional a 1/12 dos valores referentes a gratificação natalina, férias e adicional de férias."]
[null,null,null,null,null,null,null,"* Nota 2 - O adicional de férias contido no Submódulo 2.1 corresponde a 1/3 da remuneração que, por sua vez, é dividida por 12 contome Nota 1."]
[null,"Submódulo 2.2 - Encargos Previdenciários (GPS), Fundo de Garantia por Tempo de Serviço (FGTS) e Outras Contribuições"]
[null,null,"A","INSS (art. 22, inciso I, Lei nº 8.212/91)",{"$f":"'Encargos Sociais (APRENDIZ)'!E14","v":0},{"$f":"ROUND(E24*($F$16+$F$41+$F$73),2)","v":0}]
[null,null,"B","Salário Educação (art. 3º, inciso I, Decreto nº 87.043/82)",{"$f":"'Encargos Sociais (APRENDIZ)'!E15","v":0},{"$f":"ROUND(E25*($F$16+$F$41+$F$73),2)","v":0}]
[null,null,"C","SAT/RAT (art. 22, II, Lei 8.212/91 e Anexo V, Decreto 6.042/07) - Enquadramento 8211-3/00",{"$f":"'Encargos Sociais (APRENDIZ)'!E16","v":0},0]
[null,null,"D","SESC ou SESI (art. 30, Lei nº 8.036/90 e art. 1º, Lei 8.154/90)",{"$f":"'Encargos Sociais (APRENDIZ)'!E17","v":0},0]
[null,null,"E","SENAI ou SENAC (Decreto nº 2.318/86)",{"$f":"'Encargos Sociais (APRENDIZ)'!E18","v":0},0]
[null,null,"F","SEBRAE (§ 3º, art. 8º, Lei 8.029/90, alterada pela Lei nº 8.154/90)",{"$f":"'Encargos Sociais (APRENDIZ)'!E19","v":0},0]
[null,null,"G","INCRA (art. 1º, I, Decreto Lei 1.146/70 e Lei 7.787, de 30/06/89)",{"$f":"'Encargos Sociais (APRENDIZ)'!E20","v":0},0,null,"* Nota 1 - Os percentuais dos encargos previdenciários, do FGTS e demais contribuições são estabelecidos por legislação vigente."]
[null,null,"H","FGTS (Lei Complementar nº 110/01 e art. 30, Lei nº 8.036/90)",{"$f":"'Encargos Sociais (APRENDIZ)'!E21","v":0.02},0,null,"* Nota 2 - O SAT, a depender do grau de risco do serviço, irá variar entre 1%, para risco leve, de 2%, para risco médio, e de 3% para risco grave."]
[null,null,"I","SECONCI (Convenções Coletivas de Trabalho da construção)",{"$f":"'Encargos Sociais (APRENDIZ)'!E22","v":0},0,null,"* Nota 3 - Os percentuais do Submódulo 2.2 incidem sobre o Módulo 1 e o Submódulo 2.1."]
[]
[null,"Submódulo 2.3 - Benefícios Mensais e Diários"]
[null,null,"A","Auxílio Transporte",null,{"$f":"HLOOKUP($B$5,'Dados Gerais'!$D$5:$BJ$93,82)","v":0}]
[null,null,"B","Auxílio Alimentação",null,{"$f":"HLOOKUP($B$5,'Dados Gerais'!$D$5:$BJ$93,89)","v":0}]
[null,null,"C","Assistência Médica e Familiar",null,{"$f":"HLOOKUP($B$5,'Dados Gerais'!$D$5:$BJ$101,97)","v":0}]
[null,null,"D","Outros (Seguro de vida e auxílio funeral e auxílio odontológico)",null,{"$f":"HLOOKUP($B$5,'Dados Gerais'!$D$5:$BJ$125,114)","v":0},null,"* Nota 1 - O valor informado deverá ser o custo real do benefício (descontado o valor eventualmente pago pelo empregado)."]
[null,null,null,null,null,null,null,"* Nota 2 - Observar a previsão dos benefícios contidos em Acordos, Convenções e Dissídios Coletivos de Trabalho e o disposto no art. 6º da IN 5/2017"]
[null,null,null,"QUADRO-RESUMO DO MÓDULO 2"]
[null,null,null,"2.1 - 13º Salário, Férias e Adicional de Férias - 13º Destacado - Calculado no Módulo 7 ",{"$f":"SUM(E20:E21)","v":2.7777777777777776E-2},{"$f":"F20+F21","v":0}]
[null,null,null,"2.2 - Encargos Previdenciários (GPS), Fundo de Garantia por Tempo de Serviço (FGTS) e Contribuições",{"$f":"SUM(E24:E32)","v":0.02},{"$f":"SUM(F24:F32)","v":0}]
[null,null,null,"2.3 - Benefícios Mensais e Diários",null,{"$f":"SUM(F35:F38)","v":0}]
[]
[null,null,null,"TOTAL DOS ENCARGOS E BENEFÍCIOS",null,{"$f":"SUM(F41:F43)","v":0}]
[]
[null,"MÓDULO 3 - PREVISÃO PARA RESCISÃO",null,null,"Percentuais","Valor"]
[null,null,"A","Aviso Prévio Indenizado (Art. 7º, inciso XXI, da CF/1988 e arts. 477, 487, §1º, e 491 da CLT)",{"$f":"'Encargos Sociais (APRENDIZ)'!E36","v":0},{"$f":"ROUND(E48*$F$16,2)","v":0}]
[null,null,"B","Incidência do FGTS sobre o Aviso Prévio Indenizado (Súmula 305 TST)",{"$f":"'Encargos Sociais (APRENDIZ)'!E37","v":0},0,null,"* Nota 1 - Adotou-se os parâmetros do estudo do STF (http://www.stf.jus.br/arquivo/cms/sobrestfestudosci/anexo/encargos_sociais_03102007.pdf), onde 5% do pessoal é demitido pelo empregador no decurso do contrato (para estes, considerou-se o aviso prévio indenizado). Desprezou-se as demissões por justa causa e os pedidos de demissão."]
[null,null,"C","Multa do FGTS e Contribuição Social sobre o Aviso Prévio Indenizado (Art. 18, §1º, da Lei 8.036/1990 e art. 1º da LC nº 110/2001)",{"$f":"'Encargos Sociais (APRENDIZ)'!E38","v":0},0,null,"* Nota 2 - No cálculo do percentual, considerou-se 36 dias, correspondendo à metade da duração média dos contratos (2 anos)"]
[null,null,"D","Aviso Prévio Trabalhado (Art. 488, parágrafo único, CLT)",{"$f":"'Encargos Sociais (APRENDIZ)'!E39","v":0},0,null,"* Nota 3 - Incide sobre a Remuneração + 13º salário (1/12) + Férias (1/12) + Adicional de Férias (1/36) x 50% multa (40% para o empregado e 10% de contribuição social) x 8% FGTS"]
[null,null,"E","Incidência de GPS, FGTS e outras contribuições sobre o Aviso Prévio Trabalhado",{"$f":"'Encargos Sociais (APRENDIZ)'!E40","v":0},0,null,"* Nota 4 - Os 95% restantes do cálculo, a um prazo médio de contrato de 4 anos. Assim, calcula-se 7 dias para o 1º ano de contrato e mais 3 dias para os 3 anos seguintes."]
[null,null,"F","Multa do FGTS e Contribuição Social sobre o Aviso Prévio Trabalhado",{"$f":"'Encargos Sociais (APRENDIZ)'!E41","v":0},0]
[]
[null,null,null,"TOTAL DE PREVISÃO PARA RESCISÃO",null,{"$f":"SUM(F48:F53)","v":0}]
[]
[null,"MÓDULO 4 - CUSTO DO PROFISSIONAL AUSENTE",null,null,"Percentuais","Valor"]
[null,"Submódulo 4.1 - Ausências Legais"]
[null,null,"A","Férias (Arts. 129 e 130, inc. I, da CLT)",{"$f":"'Encargos Sociais (APRENDIZ)'!E25","v":8.3333333333333329E-2},{"$f":"ROUND(E59*$F$16,2)","v":0},null,"* Nota 1 - As alíneas “A” a “F” referem-se somente ao custo que será pago ao repositor pelos dias \ntrabalhados quando da necessidade de substituir a mão de obra alocada na prestação do serviço."]
[null,null,"B","Ausências Legais (Arts. 131 e 473 da CLT)",{"$f":"'Encargos Sociais (APRENDIZ)'!E26","v":0},0,null,"* Nota 2 - Adotou-se a estimativa do SINAPI de 2 dias por ano."]
[null,null,"C","Licença-Paternidade (Art. 7º, XIX, e art. 10, §1º, do ADCT, CF/1988 e Art. 1º, II, da Lei 11.770/2008)",{"$f":"'Encargos Sociais (APRENDIZ)'!E27","v":0},0,null,"* Nota 3 - Utilizada a proporção de 50% para homens, 5 dias de afastamento, e a probabilidade de um trabalhador requerer a Licença Paternidade em 5,22%, conforme SINAPI (citando dados da PNAD 2015)"]
[null,null,"D","Ausência por Acidente de Trabalho (Art. 131, III, da CLT)",{"$f":"'Encargos Sociais (APRENDIZ)'!E28","v":0},0,null,"* Nota 4 - Utilzada a estatística de 1,96% dos contribuintes beneficiados com a emissão do auxílio, conforme Anuário Estatístico da Previdência Social. Afastamento de 15 dias a cargo da empresa."]
[null,null,"E","Afastamento Maternidade (Art. 71 da Lei nº 8.213/1991)",{"$f":"'Encargos Sociais (APRENDIZ)'!E29","v":0},0,null,"* Nota 5 - Utilizada a proporção de 50% para mulheres, 180 dias de afastamento, e a probabilidade de uma trabalhadora requerer a Licença Maternidade em 4,91%, conforme SINAPI (citando dados do IBGE 2016)"]
[null,null,"F","Auxílio Enfermidade - Doença (Art. 59 da Lei nº 8.213/1991)",{"$f":"'Encargos Sociais (APRENDIZ)'!E30","v":0},0,null,"* Nota 6 - Utilizada a estatística de 3,37% dos contribuintes beneficiados com o auxílio, conforme Anuário Estatístico da Previdência Social de 2015 (acrescidos de 2 dias ao ano, para os quais o trabalhador nem requer o benefício da Previdência - conforme SINAPI)"]
[]
[null,"Submódulo 4.2 - Intrajornada"]
[null,null,"A","Intervalo para repouso ou alimentação",{"$f":"'Encargos Sociais (APRENDIZ)'!E33","v":0},{"$f":"ROUND(E67*$F$16,2)","v":0}]
[]
[null,null,null,"QUADRO-RESUMO DO MÓDULO 4",null,"Valor"]
[null,null,null,"4.1 - Ausências Legais",{"$f":"SUM(E59:E64)","v":8.3333333333333329E-2},{"$f":"ROUND(E70*$F$16,2)","v":0}]
[null,null,null,"4.2 - Intrajornada",{"$f":"E67","v":0},{"$f":"ROUND(E71*$F$16,2)","v":0}]
[]
[null,null,null,"TOTAL DE PREVISÃO PARA RESCISÃO E INTERVALO INTRAJORNADA",null,{"$f":"SUM(F70:F71)","v":0}]
[]
[null,"MÓDULO 5 - INSUMOS DIVERSOS",null,null,null,"Valor"]
[null,null,"A","Uniformes - aquisição",null,{"$f":"ROUND(HLOOKUP($B$5,Uniformes!K4:DZ6,3)/12,2)","v":0}]
[null,null,"B","Materiais de consumo relacionados ao posto - aquisição",null,{"$f":"ROUND(HLOOKUP(B5,'Mat Cons'!I11:DX13,3)/12,2)","v":0}]
[null,null,"C","Materiais permanentes relacionados ao posto - remuneração da sua depreciação / manutenção",null,{"$f":"HLOOKUP(B5,'Mat Perm'!Q11:EF13,3)","v":0}]
[null,null,"D","Equipamentos relacionados ao posto - remuneração da sua depreciação / manutenção",null,{"$f":"HLOOKUP(B5,'Equip Rel'!Q11:EF13,3)","v":0}]
[null,null,"E","Equipamentos de Proteção Individual - EPI - aquisição",null,{"$f":"ROUND(HLOOKUP(B5,EPI!I4:DX6,3)/12,2)","v":0}]
[]
[null,null,null,"TOTAL DE INSUMOS DIVERSOS",null,{"$f":"SUM(F76:F81)","v":0},null,"* Nota - Valores mensais por empregado"]
[]
[null,"MÓDULO 6 - CUSTOS INDIRETOS, TRIBUTOS E LUCRO - BDI",null,null,"Percentuais","Valor"]
[null,null,"A","Custos Indiretos",{"$f":"BDI!E6","v":3.5000000000000003E-2}]
[null,null,"A.1","Administração Central",{"$f":"BDI!E7","v":3.5000000000000003E-2}]
[null,null,"A.2","Seguros, Garantias e Riscos",{"$f":"BDI!E8","v":0}]
[null,null,"B","Lucro",{"$f":"BDI!E10","v":0}]
[null,null,"C","Tributos",{"$f":"SUM(E90:E91)","v":0.01}]
[null,null,"C.1","Tributos Federais (COFINS, PIS e CPRB)",{"$f":"BDI!E18","v":0.01}]
[null,null,"C.2","Tributos Distritais (ISS)",{"$f":"BDI!E23","v":0},null,null,"* Nota - Utilizou-se o indicado pelo Sindicato da Arquitetura e da Engenharia (Sinaenco, 2008, p. 22), que adota um percentual redutor de 20% no cálculo dos custos tributários relativos às contribuições PIS e COFINS"]
[null,null,"D","Despesas Financeiras",{"$f":"BDI!E13","v":5.0569567433733642E-3}]
[]
[null,null,null,"TOTAL DE BDI",{"$f":"BDI!E26","v":5.0700000000000002E-2},{"$f":"E94*E102","v":0}]
[]
[null,null,null,"QUADRO-RESUMO DO CUSTO MENSAL POR EMPREGADO - SEM O 13º","Valor"]
[null,null,null,"Módulo 1 - Composição da Remuneração",{"$f":"F16","v":0}]
[null,null,null,"Módulo 2 - Encargos e Benefícios Anuais, Mensais e Diários",{"$f":"F45","v":0}]
[null,null,null,"Módulo 3 - Provisão para Rescisão",{"$f":"F55","v":0}]
[null,null,null,"Módulo 4 - Custo de Reposição do Profissional Ausente",{"$f":"F73","v":0}]
[null,null,null,"Módulo 5 - Insumos Diversos",{"$f":"F82","v":0}]
[null,null,null,"SUBTOTAL (A+B+C+D+E)",{"$f":"SUM(E97:E101)","v":0}]
[null,null,null,"Módulo 6 - Custos Indiretos, Tributos e Lucro",{"$f":"F94","v":0}]
[]
[null,null,null,"TOTAL DO POSTO",{"$f":"SUM(E102:E103)","v":0}]
[]
[null,"MÓDULO 7 - DESTAQUE DO MÓDULO 2 - 13º SALÁRIO",null,null,"Percentuais","Valor"]
[null,null,"A","13º Salário",{"$f":"'Encargos Sociais (APRENDIZ)'!E32","v":8.3333333333333329E-2},{"$f":"ROUND(E108*F$16,2)","v":0}]
[null,null,"B","Encargos Sociais sobre o 13º Salário - Taxa calculada no SUBMÓDULO 2.2",{"$f":"SUM($E$24:$E$32)","v":0.02},{"$f":"ROUND(E109*$F$108,2)","v":0},null,"* Nota 1 - Provisiona-se, mensalmente, o proporcional a 1/12 dos valores referentes a gratificação natalina e adicional de férias."]
[null,null,"C","BDI sobre o 13º Salário - Taxa calculada no MÓDULO 6",{"$f":"E94","v":5.0700000000000002E-2},{"$f":"ROUND(E110*($F$108+$F$109),2)","v":0}]
[]
[null,null,null,"TOTAL DO DESTAQUE DO 13º SALÁRIO",null,{"$f":"SUM(F108:F110)","v":0}]
[]
[null,null,null,"QUADRO-RESUMO DO CUSTO MENSAL POR EMPREGADO","Valor"]
[null,null,null,"Custo total - sem o 13º Salário",{"$f":"E105","v":0}]
[null,null,null,"Destaque do 13º Salário (valor mensal)",{"$f":"F112","v":0}]
[]
[null,null,null,"TOTAL DO POSTO",{"$f":"E115+E116","v":0}]

{"sheet":"6","index":8,"n_rows":118,"n_cols":8,"rows_kept":118,"cut":false,"hidden":true,"merged":[[17,1,17,3],[1,1,1,5],[2,1,2,5],[4,1,4,2],[5,1,5,2],[7,1,7,3],[106,1,106,3],[39,3,39,5],[46,1,46,3],[56,1,56,3],[68,3,68,5],[74,1,74,3],[83,1,83,3]]}
[]
[null,"PLANILHA DE ESTIMATIVA DE CUSTOS"]
[null,"Padrão IN 05/2017 e IN 07/2018 - MPDG"]
[]
[null,6,null,{"$f":"HLOOKUP($B$5,'Dados Gerais'!$D$5:$BJ$20,6)","v":0},"QUANTIDADE",{"$f":"HLOOKUP($B$5,'Dados Gerais'!$D$5:$BJ$20,10)","v":0}]
[null,"CCT",null,{"$f":"HLOOKUP($B$5,'Dados Gerais'!$D$5:$BJ$20,15)","v":0},"DATA-BASE",{"$f":"HLOOKUP($B$5,'Dados Gerais'!$D$5:$BJ$20,16)","v":"00:00:00"}]
[]
[null,"MÓDULO 1 - COMPOSIÇÃO DA REMUNERAÇÃO",null,null,null,"Valor"]
[null,null,"A","Salário-Base",null,{"$f":"HLOOKUP($B$5,'Dados Gerais'!$D$5:$BJ$20,8)","v":0}]
[null,null,"B","Adicional de Periculosidade",null,{"$f":"HLOOKUP($B$5,'Dados Gerais'!$D$5:$BJ$37,25)","v":0}]
[null,null,"C","Adicional de Insalubridade",null,{"$f":"HLOOKUP($B$5,'Dados Gerais'!$D$5:$BJ$37,31)","v":0}]
[null,null,"D","Adicional Noturno",null,{"$f":"HLOOKUP($B$5,'Dados Gerais'!$D$5:$BJ$50,46)","v":0},null,"* Nota 1 - O Módulo 1 refere-se ao valor mensal devido ao empregado pela prestação do serviço no período de 12 meses."]
[null,null,"E","Adicional de Hora Extra",null,{"$f":"HLOOKUP($B$5,'Dados Gerais'!$D$5:$BJ$67,63)","v":0},null,"* Nota 2 - O adicional de hora extra no feriado trabalhado foi suprimido pela Lei 13.467/17"]
[null,null,"F","Outros (especificar)",null,{"$f":"HLOOKUP($B$5,'Dados Gerais'!$D$5:$BJ$59,33)","v":0},null,"* Nota 3 - ART. 7º, § 2º, DA LEI Nº 605/49.Sendo mensalista o obreiro, o adicional noturno pago de forma fixa já é considerado integrado para os efeitos do pagamento do repouso semanal remunerado, nos termos do art. 7º, § 2º, da Lei nº 605/49."]
[]
[null,null,null,"TOTAL DA REMUNERAÇÃO",null,{"$f":"SUM(F9:F14)","v":0}]
[]
[null,"MÓDULO 2 - ENCARGOS E BENEFÍCIOS ANUAIS, MENSAIS E DIÁRIOS",null,null,"Percentuais","Valor"]
[null,"Submódulo 2.1 - 13º Salário, Férias e Adicional de Férias"]
[null,null,"A","13º Salário - Calculado no Módulo 7 - Destacado",0,{"$f":"ROUND(E20*F$16,2)","v":0}]
[null,null,"B","Férias e Adicional de Férias",{"$f":"'Encargos Sociais (APRENDIZ)'!E31","v":2.7777777777777776E-2},{"$f":"ROUND(E21*F$16,2)","v":0},null,"* Nota 1 - Provisiona-se, mensalmente, o proporcional a 1/12 dos valores referentes a gratificação natalina, férias e adicional de férias."]
[null,null,null,null,null,null,null,"* Nota 2 - O adicional de férias contido no Submódulo 2.1 corresponde a 1/3 da remuneração que, por sua vez, é dividida por 12 contome Nota 1."]
[null,"Submódulo 2.2 - Encargos Previdenciários (GPS), Fundo de Garantia por Tempo de Serviço (FGTS) e Outras Contribuições"]
[null,null,"A","INSS (art. 22, inciso I, Lei nº 8.212/91)",{"$f":"'Encargos Sociais (APRENDIZ)'!E14","v":0},{"$f":"ROUND(E24*($F$16+$F$41+$F$73),2)","v":0}]
[null,null,"B","Salário Educação (art. 3º, inciso I, Decreto nº 87.043/82)",{"$f":"'Encargos Sociais (APRENDIZ)'!E15","v":0},{"$f":"ROUND(E25*($F$16+$F$41+$F$73),2)","v":0}]
[null,null,"C","SAT/RAT (art. 22, II, Lei 8.212/91 e Anexo V, Decreto 6.042/07) - Enquadramento 8211-3/00",{"$f":"'Encargos Sociais (APRENDIZ)'!E16","v":0},0]
[null,null,"D","SESC ou SESI (art. 30, Lei nº 8.036/90 e art. 1º, Lei 8.154/90)",{"$f":"'Encargos Sociais (APRENDIZ)'!E17","v":0},0]
[null,null,"E","SENAI ou SENAC (Decreto nº 2.318/86)",{"$f":"'Encargos Sociais (APRENDIZ)'!E18","v":0},0]
[null,null,"F","SEBRAE (§ 3º, art. 8º, Lei 8.029/90, alterada pela Lei nº 8.154/90)",{"$f":"'Encargos Sociais (APRENDIZ)'!E19","v":0},0]
[null,null,"G","INCRA (art. 1º, I, Decreto Lei 1.146/70 e Lei 7.787, de 30/06/89)",{"$f":"'Encargos Sociais (APRENDIZ)'!E20","v":0},0,null,"* Nota 1 - Os percentuais dos encargos previdenciários, do FGTS e demais contribuições são estabelecidos por legislação vigente."]
[null,null,"H","FGTS (Lei Complementar nº 110/01 e art. 30, Lei nº 8.036/90)",{"$f":"'Encargos Sociais (APRENDIZ)'!E21","v":0.02},0,null,"* Nota 2 - O SAT, a depender do grau de risco do serviço, irá variar entre 1%, para risco leve, de 2%, para risco médio, e de 3% para risco grave."]
[null,null,"I","SECONCI (Convenções Coletivas de Trabalho da construção)",{"$f":"'Encargos Sociais (APRENDIZ)'!E22","v":0},0,null,"* Nota 3 - Os percentuais do Submódulo 2.2 incidem sobre o Módulo 1 e o Submódulo 2.1."]
[]
[null,"Submódulo 2.3 - Benefícios Mensais e Diários"]
[null,null,"A","Auxílio Transporte",null,{"$f":"HLOOKUP($B$5,'Dados Gerais'!$D$5:$BJ$93,82)","v":0}]
[null,null,"B","Auxílio Alimentação",null,{"$f":"HLOOKUP($B$5,'Dados Gerais'!$D$5:$BJ$93,89)","v":0}]
[null,null,"C","Assistência Médica e Familiar",null,{"$f":"HLOOKUP($B$5,'Dados Gerais'!$D$5:$BJ$101,97)","v":0}]
[null,null,"D","Outros (Seguro de vida e auxílio funeral e auxílio odontológico)",null,{"$f":"HLOOKUP($B$5,'Dados Gerais'!$D$5:$BJ$125,114)","v":0},null,"* Nota 1 - O valor informado deverá ser o custo real do benefício (descontado o valor eventualmente pago pelo empregado)."]
[null,null,null,null,null,null,null,"* Nota 2 - Observar a previsão dos benefícios contidos em Acordos, Convenções e Dissídios Coletivos de Trabalho e o disposto no art. 6º da IN 5/2017"]
[null,null,null,"QUADRO-RESUMO DO MÓDULO 2"]
[null,null,null,"2.1 - 13º Salário, Férias e Adicional de Férias - 13º Destacado - Calculado no Módulo 7 ",{"$f":"SUM(E20:E21)","v":2.7777777777777776E-2},{"$f":"F20+F21","v":0}]
[null,null,null,"2.2 - Encargos Previdenciários (GPS), Fundo de Garantia por Tempo de Serviço (FGTS) e Contribuições",{"$f":"SUM(E24:E32)","v":0.02},{"$f":"SUM(F24:F32)","v":0}]
[null,null,null,"2.3 - Benefícios Mensais e Diários",null,{"$f":"SUM(F35:F38)","v":0}]
[]
[null,null,null,"TOTAL DOS ENCARGOS E BENEFÍCIOS",null,{"$f":"SUM(F41:F43)","v":0}]
[]
[null,"MÓDULO 3 - PREVISÃO PARA RESCISÃO",null,null,"Percentuais","Valor"]
[null,null,"A","Aviso Prévio Indenizado (Art. 7º, inciso XXI, da CF/1988 e arts. 477, 487, §1º, e 491 da CLT)",{"$f":"'Encargos Sociais (APRENDIZ)'!E36","v":0},{"$f":"ROUND(E48*$F$16,2)","v":0}]
[null,null,"B","Incidência do FGTS sobre o Aviso Prévio Indenizado (Súmula 305 TST)",{"$f":"'Encargos Sociais (APRENDIZ)'!E37","v":0},0,null,"* Nota 1 - Adotou-se os parâmetros do estudo do STF (http://www.stf.jus.br/arquivo/cms/sobrestfestudosci/anexo/encargos_sociais_03102007.pdf), onde 5% do pessoal é demitido pelo empregador no decurso do contrato (para estes, considerou-se o aviso prévio indenizado). Desprezou-se as demissões por justa causa e os pedidos de demissão."]
[null,null,"C","Multa do FGTS e Contribuição Social sobre o Aviso Prévio Indenizado (Art. 18, §1º, da Lei 8.036/1990 e art. 1º da LC nº 110/2001)",{"$f":"'Encargos Sociais (APRENDIZ)'!E38","v":0},0,null,"* Nota 2 - No cálculo do percentual, considerou-se 36 dias, correspondendo à metade da duração média dos contratos (2 anos)"]
[null,null,"D","Aviso Prévio Trabalhado (Art. 488, parágrafo único, CLT)",{"$f":"'Encargos Sociais (APRENDIZ)'!E39","v":0},0,null,"* Nota 3 - Incide sobre a Remuneração + 13º salário (1/12) + Férias (1/12) + Adicional de Férias (1/36) x 50% multa (40% para o empregado e 10% de contribuição social) x 8% FGTS"]
[null,null,"E","Incidência de GPS, FGTS e outras contribuições sobre o Aviso Prévio Trabalhado",{"$f":"'Encargos Sociais (APRENDIZ)'!E40","v":0},0,null,"* Nota 4 - Os 95% restantes do cálculo, a um prazo médio de contrato de 4 anos. Assim, calcula-se 7 dias para o 1º ano de contrato e mais 3 dias para os 3 anos seguintes."]
[null,null,"F","Multa do FGTS e Contribuição Social sobre o Aviso Prévio Trabalhado",{"$f":"'Encargos Sociais (APRENDIZ)'!E41","v":0},0]
[]
[null,null,null,"TOTAL DE PREVISÃO PARA RESCISÃO",null,{"$f":"SUM(F48:F53)","v":0}]
[]
[null,"MÓDULO 4 - CUSTO DO PROFISSIONAL AUSENTE",null,null,"Percentuais","Valor"]
[null,"Submódulo 4.1 - Ausências Legais"]
[null,null,"A","Férias (Arts. 129 e 130, inc. I, da CLT)",{"$f":"'Encargos Sociais (APRENDIZ)'!E25","v":8.3333333333333329E-2},{"$f":"ROUND(E59*$F$16,2)","v":0},null,"* Nota 1 - As alíneas “A” a “F” referem-se somente ao custo que será pago ao repositor pelos dias \ntrabalhados quando da necessidade de substituir a mão de obra alocada na prestação do serviço."]
[null,null,"B","Ausências Legais (Arts. 131 e 473 da CLT)",{"$f":"'Encargos Sociais (APRENDIZ)'!E26","v":0},0,null,"* Nota 2 - Adotou-se a estimativa do SINAPI de 2 dias por ano."]
[null,null,"C","Licença-Paternidade (Art. 7º, XIX, e art. 10, §1º, do ADCT, CF/1988 e Art. 1º, II, da Lei 11.770/2008)",{"$f":"'Encargos Sociais (APRENDIZ)'!E27","v":0},0,null,"* Nota 3 - Utilizada a proporção de 50% para homens, 5 dias de afastamento, e a probabilidade de um trabalhador requerer a Licença Paternidade em 5,22%, conforme SINAPI (citando dados da PNAD 2015)"]
[null,null,"D","Ausência por Acidente de Trabalho (Art. 131, III, da CLT)",{"$f":"'Encargos Sociais (APRENDIZ)'!E28","v":0},0,null,"* Nota 4 - Utilzada a estatística de 1,96% dos contribuintes beneficiados com a emissão do auxílio, conforme Anuário Estatístico da Previdência Social. Afastamento de 15 dias a cargo da empresa."]
[null,null,"E","Afastamento Maternidade (Art. 71 da Lei nº 8.213/1991)",{"$f":"'Encargos Sociais (APRENDIZ)'!E29","v":0},0,null,"* Nota 5 - Utilizada a proporção de 50% para mulheres, 180 dias de afastamento, e a probabilidade de uma trabalhadora requerer a Licença Maternidade em 4,91%, conforme SINAPI (citando dados do IBGE 2016)"]
[null,null,"F","Auxílio Enfermidade - Doença (Art. 59 da Lei nº 8.213/1991)",{"$f":"'Encargos Sociais (APRENDIZ)'!E30","v":0},0,null,"* Nota 6 - Utilizada a estatística de 3,37% dos contribuintes beneficiados com o auxílio, conforme Anuário Estatístico da Previdência Social de 2015 (acrescidos de 2 dias ao ano, para os quais o trabalhador nem requer o benefício da Previdência - conforme SINAPI)"]
[]
[null,"Submódulo 4.2 - Intrajornada"]
[null,null,"A","Intervalo para repouso ou alimentação",{"$f":"'Encargos Sociais (APRENDIZ)'!E33","v":0},{"$f":"ROUND(E67*$F$16,2)","v":0}]
[]
[null,null,null,"QUADRO-RESUMO DO MÓDULO 4",null,"Valor"]
[null,null,null,"4.1 - Ausências Legais",{"$f":"SUM(E59:E64)","v":8.3333333333333329E-2},{"$f":"ROUND(E70*$F$16,2)","v":0}]
[null,null,null,"4.2 - Intrajornada",{"$f":"E67","v":0},{"$f":"ROUND(E71*$F$16,2)","v":0}]
[]
[null,null,null,"TOTAL DE PREVISÃO PARA RESCISÃO E INTERVALO INTRAJORNADA",null,{"$f":"SUM(F70:F71)","v":0}]
[]
[null,"MÓDULO 5 - INSUMOS DIVERSOS",null,null,null,"Valor"]
[null,null,"A","Uniformes - aquisição",null,{"$f":"ROUND(HLOOKUP($B$5,Uniformes!K4:DZ6,3)/12,2)","v":0}]
[null,null,"B","Materiais de consumo relacionados ao posto - aquisição",null,{"$f":"ROUND(HLOOKUP(B5,'Mat Cons'!I11:DX13,3)/12,2)","v":0}]
[null,null,"C","Materiais permanentes relacionados ao posto - remuneração da sua depreciação / manutenção",null,{"$f":"HLOOKUP(B5,'Mat Perm'!Q11:EF13,3)","v":0}]
[null,null,"D","Equipamentos relacionados ao posto - remuneração da sua depreciação / manutenção",null,{"$f":"HLOOKUP(B5,'Equip Rel'!Q11:EF13,3)","v":0}]
[null,null,"E","Equipamentos de Proteção Individual - EPI - aquisição",null,{"$f":"ROUND(HLOOKUP(B5,EPI!I4:DX6,3)/12,2)","v":0}]
[]
[null,null,null,"TOTAL DE INSUMOS DIVERSOS",null,{"$f":"SUM(F76:F81)","v":0},null,"* Nota - Valores mensais por empregado"]
[]
[null,"MÓDULO 6 - CUSTOS INDIRETOS, TRIBUTOS E LUCRO - BDI",null,null,"Percentuais","Valor"]
[null,null,"A","Custos Indiretos",{"$f":"BDI!E6","v":3.5000000000000003E-2}]
[null,null,"A.1","Administração Central",{"$f":"BDI!E7","v":3.5000000000000003E-2}]
[null,null,"A.2","Seguros, Garantias e Riscos",{"$f":"BDI!E8","v":0}]
[null,null,"B","Lucro",{"$f":"BDI!E10","v":0}]
[null,null,"C","Tributos",{"$f":"SUM(E90:E91)","v":0.01}]
[null,null,"C.1","Tributos Federais (COFINS, PIS e CPRB)",{"$f":"BDI!E18","v":0.01}]
[null,null,"C.2","Tributos Distritais (ISS)",{"$f":"BDI!E23","v":0},null,null,"* Nota - Utilizou-se o indicado pelo Sindicato da Arquitetura e da Engenharia (Sinaenco, 2008, p. 22), que adota um percentual redutor de 20% no cálculo dos custos tributários relativos às contribuições PIS e COFINS"]
[null,null,"D","Despesas Financeiras",{"$f":"BDI!E13","v":5.0569567433733642E-3}]
[]
[null,null,null,"TOTAL DE BDI",{"$f":"BDI!E26","v":5.0700000000000002E-2},{"$f":"E94*E102","v":0}]
[]
[null,null,null,"QUADRO-RESUMO DO CUSTO MENSAL POR EMPREGADO - SEM O 13º","Valor"]
[null,null,null,"Módulo 1 - Composição da Remuneração",{"$f":"F16","v":0}]
[null,null,null,"Módulo 2 - Encargos e Benefícios Anuais, Mensais e Diários",{"$f":"F45","v":0}]
[null,null,null,"Módulo 3 - Provisão para Rescisão",{"$f":"F55","v":0}]
[null,null,null,"Módulo 4 - Custo de Reposição do Profissional Ausente",{"$f":"F73","v":0}]
[null,null,null,"Módulo 5 - Insumos Diversos",{"$f":"F82","v":0}]
[null,null,null,"SUBTOTAL (A+B+C+D+E)",{"$f":"SUM(E97:E101)","v":0}]
[null,null,null,"Módulo 6 - Custos Indiretos, Tributos e Lucro",{"$f":"F94","v":0}]
[]
[null,null,null,"TOTAL DO POSTO",{"$f":"SUM(E102:E103)","v":0}]
[]
[null,"MÓDULO 7 - DESTAQUE DO MÓDULO 2 - 13º SALÁRIO",null,null,"Percentuais","Valor"]
[null,null,"A","13º Salário",{"$f":"'Encargos Sociais (APRENDIZ)'!E32","v":8.3333333333333329E-2},{"$f":"ROUND(E108*F$16,2)","v":0}]
[null,null,"B","Encargos Sociais sobre o 13º Salário - Taxa calculada no SUBMÓDULO 2.2",{"$f":"SUM($E$24:$E$32)","v":0.02},{"$f":"ROUND(E109*$F$108,2)","v":0},null,"* Nota 1 - Provisiona-se, mensalmente, o proporcional a 1/12 dos valores referentes a gratificação natalina e adicional de férias."]
[null,null,"C","BDI sobre o 13º Salário - Taxa calculada no MÓDULO 6",{"$f":"E94","v":5.0700000000000002E-2},{"$f":"ROUND(E110*($F$108+$F$109),2)","v":0}]
[]
[null,null,null,"TOTAL DO DESTAQUE DO 13º SALÁRIO",null,{"$f":"SUM(F108:F110)","v":0}]
[]
[null,null,null,"QUADRO-RESUMO DO CUSTO MENSAL POR EMPREGADO","Valor"]
[null,null,null,"Custo total - sem o 13º Salário",{"$f":"E105","v":0}]
[null,null,null,"Destaque do 13º Salário (valor mensal)",{"$f":"F112","v":0}]
[]
[null,null,null,"TOTAL DO POSTO",{"$f":"E115+E116","v":0}]

{"sheet":"Dados Gerais","index":9,"n_rows":124,"n_cols":62,"rows_kept":124,"cut":false,"hidden":false,"merged":[[2,1,2,2]]}
[]
[]
[null,"INFORMAÇÕES DE ENTRADA"]
[]
[null,null,null,1,3,4,5,6,7,8,9,10,11,12,13,14,15,16,17,18,19,20,21,22,23,24,25,26,27,28,29,30,31,32,33,34,35,36,37,38,39,40,41,42,43,44,45,46,47,48,49,50,51,52,53,54,55,56,57,58,59,60]
[null,"",null,"CARGO 1","CARGO 3","CARGO 4","CARGO 5","CARGO 6","CARGO 7","CARGO 8","CARGO 9","CARGO 10","CARGO 11","CARGO 12","CARGO 13","CARGO 14","CARGO 15","CARGO 16","CARGO 17","CARGO 18","CARGO 19","CARGO 20","CARGO 21","CARGO 22","CARGO 23","CARGO 24","CARGO 25","CARGO 26","CARGO 27","CARGO 28","CARGO 29","CARGO 30","CARGO 31","CARGO 32","CARGO 33","CARGO 34","CARGO 35","CARGO 36","CARGO 37","CARGO 38","CARGO 39","CARGO 40","CARGO 41","CARGO 42","CARGO 43","CARGO 44","CARGO 45","CARGO 46","CARGO 47","CARGO 48","CARGO 49","CARGO 50","CARGO 51","CARGO 52","CARGO 53","CARGO 54","CARGO 55","CARGO 56","CARGO 57","CARGO 58","CARGO 59","CARGO 60"]
[null,"INFORMAÇÕES BÁSICAS"]
[]
[null,"DESCRIÇÃO DOS POSTOS DE SERVIÇO"]
[null,null,null,"ADOLESCENTE APRENDIZ"]
[null,"REMUNERAÇÕES"]
[null,null,null,1320]
[null,"QUANTIDADE DE POSTOS"]
[null,null,null,180]
[null,"JORNADA"]
[null,null,"HORAS",100]
[null,null,"DIAS/MÊS",22]
[null,"CCT UTILIZADA"]
[null,null,"SINDICATOS E REFERÊNCIA","-"]
[null,null,"DATA-BASE","-"]
[]
[null,"ADICIONAIS LEGAIS E GRATIFICAÇÕES"]
[]
[null,"PERICULOSIDADE (PERCENTUAL)"]
[null,null,null,0]
[null,"BASE DE CÁLCULO DO ADICIONAL DE PERICULOSIDADE (SALÁRIO BÁSICO)"]
[null,null,null,{"$f":"D12","v":1320}]
[null,"VALOR MENSAL DO ADICIONAL DE PERICULOSIDADE"]
[null,null,null,{"$f":"ROUND(D25*D12,2)","v":0}]
[null,"INSALUBRIDADE (PERCENTUAL)"]
[null,null,null,0]
[null,"BASE DE CÁLCULO DO ADICIONAL DE INSALUBRIDADE (SALÁRIO MÍNIMO LEGAL)"]
[null,null,null,1320]
[null,"VALOR MENSAL DO ADICIONAL DE INSALUBRIDADE"]
[null,null,null,{"$f":"ROUND(D31*D12,2)","v":0}]
[null,"GRATIFICAÇÃO - VALOR MENSAL (R$)"]
[null,null,null,0]
[]
[null,"ADICIONAL NOTURNO"]
[]
[null,"INCIDÊNCIA (PERCENTUAL)"]
[null,null,null,0.2]
[null,"HORAS REAIS POR DIA"]
[null,null,null,0]
[null,"HORAS FICTAS POR DIA"]
[null,null,null,{"$f":"D44*8/7","v":0}]
[null,"BASE DE CÁLCULO DO ADICIONAL NOTURNO (INCLUINDO ADICIONAIS E GRATIFICAÇÕES)"]
[null,null,null,{"$f":"D12+D29+D35+D37","v":1320}]
[null,"VALOR MENSAL DO ADICIONAL NOTURNO (HORA NORMAL + HORA REDUZIDA) - POR POSTO"]
[null,null,null,{"$f":"ROUND(D46*D17*D42*D48/D16,2)","v":0}]
[]
[null,"ADICIONAL DE HORA EXTRA"]
[]
[null,"INCIDÊNCIA (PERCENTUAL 1)"]
[null,null,null,0.5]
[null,"HORAS EXTRAS POR MÊS (PERCENTUAL 1)"]
[null,null,null,0]
[null,"VALOR MENSAL DO ADICIONAL DE HORAS EXTRAS (PERCENTUAL 1) - POR POSTO"]
[null,null,null,{"$f":"ROUND(D57*D55*D12/D16,2)","v":0}]
[null,"INCIDÊNCIA (PERCENTUAL 2)"]
[null,null,null,1]
[null,"HORAS EXTRAS POR MÊS (PERCENTUAL 2)"]
[null,null,null,0]
[null,"VALOR MENSAL DO ADICIONAL DE HORAS EXTRAS (PERCENTUAL 2) - POR POSTO"]
[null,null,null,{"$f":"ROUND(D63*D61*D12/D16,2)","v":0}]
[null,"TOTAL MENSAL DOS ADICIONAIS DE HORAS EXTRAS - POR POSTO"]
[null,null,null,{"$f":"D65+D59","v":0}]
[]
[null,"BENEFÍCIOS COMUNS - AUXÍLIO TRANSPORTE"]
[]
[null,"DISTRIBUIÇÃO ESTIMADA DE PROCEDÊNCIA"]
[null,null,"Cidade-satélite",1]
[null,null,"Região do entorno",0]
[null,null,"Esplanada - apenas para os que vêm do entorno",0]
[null,"VALORES DOS VALES"]
[null,null,"Cidade-satélite",5.5]
[null,null,"Região do entorno",8.09]
[null,null,"Esplanada",2.75]
[null,"VALOR MENSAL BRUTO DE PAGAMENTO - POR POSTO"]
[null,null,null,{"$f":"ROUND((D72*D76+D73*D77+D74*D78)*2*D17,2)","v":242}]
[null,"PERCENTUAL DE DESCONTO"]
[null,null,null,0.06]
[null,"VALOR MENSAL DO DESCONTO - POR POSTO"]
[null,null,null,{"$f":"ROUND(D82*D12,2)","v":79.2}]
[null,"VALOR MENSAL LÍQUIDO DO VALE TRANSPORTE - POR POSTO"]
[null,null,null,{"$f":"IF(D80>D84,D80-D84,0)","v":162.80000000000001}]
[null,null,null,{"$f":"D86*D14","v":29304.000000000004}]
[null,"BENEFÍCIOS COMUNS - AUXÍLIO ALIMENTAÇÃO"]
[]
[null,null,"VALOR CCT",0]
[null,null,"VALOR CD",35]
[null,"VALOR MENSAL DO AUXÍLIO ALIMENTAÇÃO - POR POSTO"]
[null,null,null,{"$f":"ROUND(LARGE(D90:D91,1)*D17,2)","v":770}]
[null,null,null,{"$f":"D93*D14","v":138600}]
[null,"BENEFÍCIOS ESPECIAIS - ASSISTÊNCIA MÉDICA E FAMILIAR"]
[]
[null,null,"OBRIGAÇÃO DE PAGTO","NÃO"]
[null,null,"VALOR CCT",0]
[null,null,"VALOR MERCADO",0]
[null,"VALOR MENSAL DO AUXÍLIO ESPECIAL - ASSISTÊNCIA MÉDICA E FAMILIAR - POR POSTO"]
[null,null,null,{"$f":"IF(D97=\"SIM\",ROUND(SMALL(D98:D99,1),2)*D17,0)","v":0}]
[]
[null,"BENEFÍCIOS ESPECIAIS - SEGURO DE VIDA E AUXÍLIO-FUNERAL, AUX ODONT, AUX CRECHE"]
[]
[null,"SEGURO DE VIDA E AUXÍLIO FUNERAL"]
[null,null,"OBRIGAÇÃO DE PAGTO","SIM"]
[null,null,"VALOR CCT"]
[null,null,"VALOR MERCADO",9.9]
[null,"VALOR MENSAL DO AUXÍLIO ESPECIAL - SEGURO DE VIDA E AUXÍLIO FUNERAL - POR POSTO"]
[null,null,null,{"$f":"IF(D106=\"SIM\",ROUND(SMALL(D107:D108,1),2),0)","v":9.9}]
[null,"AUXÍLIO ODONTOLÓGICO"]
[null,null,"OBRIGAÇÃO DE PAGTO","NÃO"]
[null,null,"VALOR CCT",0]
[null,null,"VALOR MERCADO",0]
[null,"VALOR MENSAL DO AUXÍLIO ESPECIAL - SEGURO DE VIDA E AUX FUNERAL - POR POSTO"]
[null,null,null,{"$f":"IF(D112=\"SIM\",ROUND(SMALL(D113:D114,1),2),0)","v":0}]
[]
[null,null,null,{"$f":"D110+D116","v":9.9}]
[]
[null,"BENEFÍCIOS ESPECIAIS - SEGURO DE VIDA E AUXÍLIO-FUNERAL, AUX ODONT, AUX CRECHE"]
[]
[null,"PROGRAMA DE APRENDIZAGEM"]
[null,null,"OBRIGAÇÃO DE PAGTO","SIM"]
[null,null,"VALOR MERCADO",{"$f":"141.86+13.03","v":154.89000000000001}]

{"sheet":"Encargos Sociais (APRENDIZ)","index":10,"n_rows":46,"n_cols":7,"rows_kept":46,"cut":false,"hidden":false,"merged":[[2,1,2,3],[3,1,3,4]]}
[]
[]
[]
[null,"ENCARGOS SOCIAIS SOBRE A MÃO DE OBRA"]
[null,null,null,"ADOLESCENTE APRENDIZ","Percentuais"]
[]
[null,"Referência:"]
[null,null,"SINAPI OUT/2018"]
[]
[null,"Categorias:"]
[null,null,"TODAS"]
[]
[null,"GRUPO A: Encargos Sociais Básicos - Previdenciários (GPS), Fundo de Garantia por Tempo de Serviço (FGTS) e Outras Contribuições",null,null,{"$f":"ROUND(SUM(E14:E22),4)","v":0.02}]
[null,null,"A","INSS (art. 22, inciso I, Lei nº 8.212/91)",0]
[null,null,"B","Salário Educação (art. 3º, inciso I, Decreto nº 87.043/82)",0]
[null,null,"C","SAT/RAT (art. 22, II, Lei 8.212/91 e Anexo V, Decreto 6.042/07) - Enquadramento 8211-3/00",0]
[null,null,"D","SESC ou SESI (art. 30, Lei nº 8.036/90 e art. 1º, Lei 8.154/90)",0]
[null,null,"E","SENAI ou SENAC (Decreto nº 2.318/86)",0]
[null,null,"F","SEBRAE (§ 3º, art. 8º, Lei 8.029/90, alterada pela Lei nº 8.154/90)",0,null,"* Nota 1 - Os percentuais dos encargos previdenciários, do FGTS e demais contribuições são estabelecidos por legislação vigente."]
[null,null,"G","INCRA (art. 1º, I, Decreto Lei 1.146/70 e Lei 7.787, de 30/06/89)",0,null,"* Nota 2 - O SAT, a depender do grau de risco do serviço, irá variar entre 1%, para risco leve, de 2%, para risco médio, e de 3% para risco grave."]
[null,null,"H","FGTS (Art. 15, § 7º da Lei nº 8.036/1990 e Art. 67 do Decreto nº 9.579/2018)",0.02,null,"* Nota 3 - Os percentuais do Submódulo 2.2 incidem sobre o Módulo 1, o Submódulo 2.1, o Módulo 3, o Módulo 4 e o Módulo 6."]
[null,null,"I","SECONCI (Convenções Coletivas de Trabalho da construção)",0]
[]
[null,"GRUPO B: Encargos Sociais Relacionados ao Custo do Substituto - Ausências Legais",null,null,{"$f":"ROUND(SUM(E25:E33),4)","v":0.19439999999999999}]
[null,null,"A","Férias (Arts. 129 e 130, inc. I, da CLT)",{"$f":"1/12","v":8.3333333333333329E-2},null,"Nota 1 - As alíneas “A” a “F” referem-se  ao custo que será pago pela empresa ao profissional ausente (férias e ausências legais)"]
[null,null,"B","Ausências Legais (Arts. 131 e 473 da CLT)",0,null,"* Nota 2 - Adotou-se a estimativa do SINAPI de 2 dias por ano. Em 252 dias úteis por ano."]
[null,null,"C","Licença-Paternidade (Art. 7º, XIX, e art. 10, §1º, do ADCT, CF/1988 e Art. 1º, II, da Lei 11.770/2008)",0,null,"* Nota 3 - Utilizada a proporção de 50% para homens, 5 dias de afastamento, e a probabilidade de um trabalhador requerer a Licença Paternidade em 5,96%, conforme SINAPI (Anuário Estatístico da Previdência Social - 2017)"]
[null,null,"D","Ausência por Acidente de Trabalho (Art. 131, III, da CLT)",0,null,"* Nota 4 - Utilzada a estatística de 2,05% dos contribuintes beneficiados com a emissão do auxílio, conforme Anuário Estatístico da Previdência Social. Afastamento de 15 dias a cargo da empresa."]
[null,null,"E","Afastamento Maternidade (Art. 71 da Lei nº 8.213/1991)",0,null,"* Nota 5 - Utilizada a estimativa de 120 dias de afastamento, e a probabilidade de uma trabalhadora requerer a Licença Maternidade em 5,08%, conforme SINAPI (citando dados do IBGE 2017) - A própria previdência paga o benefício pelos 120 dias, contudo o empregador arca com o 13º e com as férias"]
[null,null,"F","Auxílio Enfermidade - Doença (Art. 59 da Lei nº 8.213/1991)",0,null,"* Nota 6 - Utilizada a estatística de 3,76% dos contribuintes beneficiados com o auxílio, conforme Anuário Estatístico da Previdência Social de 2016 (acrescidos de 2 dias ao ano, para os quais o trabalhador nem requer o benefício da Previdência - conforme SINAPI)"]
[null,null,"G","Adicional de Férias (componente do Submódulo 2.1)",{"$f":"1/3*1/12","v":2.7777777777777776E-2},null,"* Nota 7 - O adicional de férias contido no Submódulo 2.1 corresponde a 1/3 da remuneração que, por sua vez, é dividida por 11 contome Nota 1."]
[null,null,"H","13º Salário (destacado na planilha de custos)",{"$f":"1/12","v":8.3333333333333329E-2},null,"* Nota 8 - Provisiona-se, mensalmente, o proporcional a 1/12 dos valores referentes a gratificação natalina e adicional de férias."]
[null,null,"I","Intervalo para repouso ou alimentação (componente do Submódulo 4.2)",0]
[]
[null,"GRUPO C: Encargos Sociais Relacionados à Previsão para Rescisão Trabalhista",null,null,{"$f":"ROUND(SUM(E36:E41),4)","v":0}]
[null,null,"A","Aviso Prévio Indenizado (Art. 7º, inciso XXI, da CF/1988 e arts. 477, 487, §1º, e 491 da CLT)",0,null,"* Nota 1 - Considerou-se demissões de 10% por ano para substituições, a um prazo estimado de contrato de 3 anos. Aviso prévio - 1º ano 30 dias. Considerou-se os 10% demitidos sem justa causa e recebendo aviso indenizado."]
[null,null,"B","Incidência do FGTS sobre o Aviso Prévio Indenizado (Súmula 305 TST)",{"$f":"E21*E36","v":0}]
[null,null,"C","Multa do FGTS e Contribuição Social sobre o Aviso Prévio Indenizado (Art. 18, §1º, da Lei 8.036/1990 e art. 1º da LC nº 110/2001)",0,null,"* Nota 2 - Incide sobre a Remuneração + 13º salário (1/12) + Férias (1/12) + Adicional de Férias (1/36) x 40% multa para o empregador x 8% FGTS"]
[null,null,"D","Aviso Prévio Trabalhado (Art. 488, parágrafo único, CLT)",0,null,"* Nota 3 - Considerou-se demissões de 100% ao final do contrato, com um prazo médio estimado de 3 anos. Assim, calcula-se 7 dias para o 1º ano de contrato e mais 3 dias para os 2 anos seguintes. Total 13 dias."]
[null,null,"E","Incidência de GPS, FGTS e outras contribuições sobre o Aviso Prévio Trabalhado",{"$f":"E39*E13","v":0}]
[null,null,"F","Multa do FGTS e Contribuição Social sobre o Aviso Prévio Trabalhado",0,null,"* Nota 4 - Incide sobre a Remuneração + 13º salário (1/12) + Férias (1/12) + Adicional de Férias (1/36) x 40% multa para o empregador x 8% FGTS"]
[]
[null,"GRUPO D: Reincidências",null,null,{"$f":"ROUND(SUM(E44:E44),4)","v":3.8999999999999998E-3}]
[null,null,"A","Reincidência do Grupo A sobre o Grupo B",{"$f":"E13*E24","v":3.888E-3}]
[]
[null,null,null,"SOMATÓRIO - ENCARGOS SOCIAIS SOBRE A MÃO DE OBRA",{"$f":"E43+E35+E24+E13","v":0.21829999999999997}]

{"sheet":"BDI","index":11,"n_rows":26,"n_cols":7,"rows_kept":26,"cut":false,"hidden":false,"merged":[[1,1,1,3],[2,1,2,4]]}
[]
[]
[null,"COMPOSIÇÃO DA TAXA DE CUSTOS INDIRETOS, TRIBUTOS E LUCRO - BDI"]
[null,"APLICAÇÃO: MÃO DE OBRA, 13º, MATERIAIS, EPC E EQUIPAMENTO DE REGISTRO DE FREQUÊNCIA",null,null,"Percentuais"]
[]
[null,"Custos Indiretos da Contratada",null,null,{"$f":"SUM(E7:E8)","v":3.5000000000000003E-2}]
[null,null,"A","Administração Central",3.5000000000000003E-2,null,"* Nota 1 - O Somatório da Administração Central com o Lucro deve ser inferior a 12%"]
[null,null,"B","Seguros, Garantias e Riscos",0,null,"* Nota 2 - O risco previsto para o porte do contrato majorado em mais 0,20% devido ao não pagamento dos insumos componentes do custo do posto quando da ausência do mesmo."]
[]
[null,"Lucro",null,null,{"$f":"SUM(E11:E11)","v":0}]
[null,null,"A","Lucro Real sobre os Custos Administrados",0]
[]
[null,"Despesas Financeiras",null,null,{"$f":"E14","v":5.0569567433733642E-3}]
[null,null,"A","Cálculo Baseado no Prazo para a Restituição dos Desembolsos Realizados pelo Contratado e na Taxa de Retorno Arbitrada",{"$f":"(1+E16)^(E15/252)-1","v":5.0569567433733642E-3},null,"* Nota 1 - DF = [(1+TR)^(DU/252)]/100"]
[null,null,"A.1","Dias Úteis Considerados",11,null,"* Nota 2 - Diferença de dias entre o desembolso, pelo contratado, e o pagamento, pela Câmara"]
[null,null,"A.2","Taxa de Retorno",0.1225,null,"* Nota 3 - A taxa sugerida é a meta da SELIC"]
[]
[null,"Impostos - Tributos Federais",null,null,{"$f":"SUM(E19:E21)","v":0.01}]
[null,null,"A","Contribuição para o Financiamento da Seguridade Social - COFINS",0,null,"* Nota 1 - Redução de 20% considerando as deduções permitidas em Lei, conforme SENGE, citado pelo TCU - Acórdão 2622/2013"]
[null,null,"B","Programa de Integração Social - PIS",0.01,null,"* Nota 2 - Redução de 20% considerando as deduções permitidas em Lei, conforme SENGE, citado pelo TCU - Acórdão 2622/2013"]
[null,null,"C","Contribuição Previdenciária sobre a Receita Bruta - CPRB",0,null,"* Nota 3 - Lei 12.546/2011 - Verificar atualizações e setores beneficiados"]
[]
[null,"Impostos - Tributos Distritais",null,null,{"$f":"SUM(E24:E24)","v":0}]
[null,null,"A","Imposto sobre Serviço de Qualquer Natureza - ISS",0]
[]
[null,null,null,"SOMATÓRIO - ENCARGOS SOCIAIS SOBRE A MÃO DE OBRA",{"$f":"ROUND((((1+E6)*(1+E10)*(1+E13)/(1-E18-E23))-1),4)","v":5.0700000000000002E-2},null,"* Nota 1 - [(1+AC+SGR)*(1+L)*(1+DF)/(1-CONFINS-PIS-CPRB-ISS)]-1"]

{"sheet":"Uniformes","index":12,"n_rows":53,"n_cols":130,"rows_kept":53,"cut":false,"hidden":false,"merged":[[2,1,2,3],[3,1,3,7]]}
[]
[]
[]
[null,"UNIFORMES - AQUISIÇÃO",null,null,null,null,null,null,null,null,1,null,{"$f":"K4+1","v":2},null,{"$f":"M4+1","v":3},null,{"$f":"O4+1","v":4},null,{"$f":"Q4+1","v":5},null,{"$f":"S4+1","v":6},null,{"$f":"U4+1","v":7},null,{"$f":"W4+1","v":8},null,{"$f":"Y4+1","v":9},null,{"$f":"AA4+1","v":10},null,{"$f":"AC4+1","v":11},null,{"$f":"AE4+1","v":12},null,{"$f":"AG4+1","v":13},null,{"$f":"AI4+1","v":14},null,{"$f":"AK4+1","v":15},null,{"$f":"AM4+1","v":16},null,{"$f":"AO4+1","v":17},null,{"$f":"AQ4+1","v":18},null,{"$f":"AS4+1","v":19},null,{"$f":"AU4+1","v":20},null,{"$f":"AW4+1","v":21},null,{"$f":"AY4+1","v":22},null,{"$f":"BA4+1","v":23},null,{"$f":"BC4+1","v":24},null,{"$f":"BE4+1","v":25},null,{"$f":"BG4+1","v":26},null,{"$f":"BI4+1","v":27},null,{"$f":"BK4+1","v":28},null,{"$f":"BM4+1","v":29},null,{"$f":"BO4+1","v":30},null,{"$f":"BQ4+1","v":31},null,{"$f":"BS4+1","v":32},null,{"$f":"BU4+1","v":33},null,{"$f":"BW4+1","v":34},null,{"$f":"BY4+1","v":35},null,{"$f":"CA4+1","v":36},null,{"$f":"CC4+1","v":37},null,{"$f":"CE4+1","v":38},null,{"$f":"CG4+1","v":39},null,{"$f":"CI4+1","v":40},null,{"$f":"CK4+1","v":41},null,{"$f":"CM4+1","v":42},null,{"$f":"CO4+1","v":43},null,{"$f":"CQ4+1","v":44},null,{"$f":"CS4+1","v":45},null,{"$f":"CU4+1","v":46},null,{"$f":"CW4+1","v":47},null,{"$f":"CY4+1","v":48},null,{"$f":"DA4+1","v":49},null,{"$f":"DC4+1","v":50},null,{"$f":"DE4+1","v":51},null,{"$f":"DG4+1","v":52},null,{"$f":"DI4+1","v":53},null,{"$f":"DK4+1","v":54},null,{"$f":"DM4+1","v":55},null,{"$f":"DO4+1","v":56},null,{"$f":"DQ4+1","v":57},null,{"$f":"DS4+1","v":58},null,{"$f":"DU4+1","v":59},null,{"$f":"DW4+1","v":60}]
[]
[null,null,null,null,null,null,null,null,null,null,{"$f":"ROUND(SUM(L5:L68),2)","v":103.88},null,{"$f":"ROUND(SUM(N5:N68),2)","v":0},null,{"$f":"ROUND(SUM(P5:P68),2)","v":0},null,{"$f":"ROUND(SUM(R5:R68),2)","v":0},null,{"$f":"ROUND(SUM(T5:T68),2)","v":0},null,{"$f":"ROUND(SUM(V5:V68),2)","v":0},null,{"$f":"ROUND(SUM(X5:X68),2)","v":0},null,{"$f":"ROUND(SUM(Z5:Z68),2)","v":0},null,{"$f":"ROUND(SUM(AB5:AB68),2)","v":0},null,{"$f":"ROUND(SUM(AD5:AD68),2)","v":0},null,{"$f":"ROUND(SUM(AF5:AF68),2)","v":0},null,{"$f":"ROUND(SUM(AH5:AH68),2)","v":0},null,{"$f":"ROUND(SUM(AJ5:AJ68),2)","v":0},null,{"$f":"ROUND(SUM(AL5:AL68),2)","v":0},null,{"$f":"ROUND(SUM(AN5:AN68),2)","v":0},null,{"$f":"ROUND(SUM(AP5:AP68),2)","v":0},null,{"$f":"ROUND(SUM(AR5:AR68),2)","v":0},null,{"$f":"ROUND(SUM(AT5:AT68),2)","v":0},null,{"$f":"ROUND(SUM(AV5:AV68),2)","v":0},null,{"$f":"ROUND(SUM(AX5:AX68),2)","v":0},null,{"$f":"ROUND(SUM(AZ5:AZ68),2)","v":0},null,{"$f":"ROUND(SUM(BB5:BB68),2)","v":0},null,{"$f":"ROUND(SUM(BD5:BD68),2)","v":0},null,{"$f":"ROUND(SUM(BF5:BF68),2)","v":0},null,{"$f":"ROUND(SUM(BH5:BH68),2)","v":0},null,{"$f":"ROUND(SUM(BJ5:BJ68),2)","v":0},null,{"$f":"ROUND(SUM(BL5:BL68),2)","v":0},null,{"$f":"ROUND(SUM(BN5:BN68),2)","v":0},null,{"$f":"ROUND(SUM(BP5:BP68),2)","v":0},null,{"$f":"ROUND(SUM(BR5:BR68),2)","v":0},null,{"$f":"ROUND(SUM(BT5:BT68),2)","v":0},null,{"$f":"ROUND(SUM(BV5:BV68),2)","v":0},null,{"$f":"ROUND(SUM(BX5:BX68),2)","v":0},null,{"$f":"ROUND(SUM(BZ5:BZ68),2)","v":0},null,{"$f":"ROUND(SUM(CB5:CB68),2)","v":0},null,{"$f":"ROUND(SUM(CD5:CD68),2)","v":0},null,{"$f":"ROUND(SUM(CF5:CF68),2)","v":0},null,{"$f":"ROUND(SUM(CH5:CH68),2)","v":0},null,{"$f":"ROUND(SUM(CJ5:CJ68),2)","v":0},null,{"$f":"ROUND(SUM(CL5:CL68),2)","v":0},null,{"$f":"ROUND(SUM(CN5:CN68),2)","v":0},null,{"$f":"ROUND(SUM(CP5:CP68),2)","v":0},null,{"$f":"ROUND(SUM(CR5:CR68),2)","v":0},null,{"$f":"ROUND(SUM(CT5:CT68),2)","v":0},null,{"$f":"ROUND(SUM(CV5:CV68),2)","v":0},null,{"$f":"ROUND(SUM(CX5:CX68),2)","v":0},null,{"$f":"ROUND(SUM(CZ5:CZ68),2)","v":0},null,{"$f":"ROUND(SUM(DB5:DB68),2)","v":0},null,{"$f":"ROUND(SUM(DD5:DD68),2)","v":0},null,{"$f":"ROUND(SUM(DF5:DF68),2)","v":0},null,{"$f":"ROUND(SUM(DH5:DH68),2)","v":0},null,{"$f":"ROUND(SUM(DJ5:DJ68),2)","v":0},null,{"$f":"ROUND(SUM(DL5:DL68),2)","v":0},null,{"$f":"ROUND(SUM(DN5:DN68),2)","v":0},null,{"$f":"ROUND(SUM(DP5:DP68),2)","v":0},null,{"$f":"ROUND(SUM(DR5:DR68),2)","v":0},null,{"$f":"ROUND(SUM(DT5:DT68),2)","v":0},null,{"$f":"ROUND(SUM(DV5:DV68),2)","v":0},null,{"$f":"ROUND(SUM(DX5:DX68),2)","v":0},null,{"$f":"ROUND(SUM(DZ5:DZ68),2)","v":0}]
[null,null,"CATEGORIAS",null,null,null,null,"QUANTIDADE"]
[null,null,null,null,null,null,null,null,null,null,{"$f":"IF($C8=K$4,1,0)","v":0}]
[null,null,1,{"$f":"HLOOKUP($C9,'Dados Gerais'!$D$5:$BJ$10,6)","v":"ADOLESCENTE APRENDIZ"},null,null,null,{"$f":"HLOOKUP($C9,'Dados Gerais'!$D$5:$BJ$14,10)","v":180},null,null,1,null,{"$f":"IF($C9=M$4,1,0)","v":0},null,{"$f":"IF($C9=O$4,1,0)","v":0},null,{"$f":"IF($C9=Q$4,1,0)","v":0},null,{"$f":"IF($C9=S$4,1,0)","v":0},null,{"$f":"IF($C9=U$4,1,0)","v":0},null,{"$f":"IF($C9=W$4,1,0)","v":0},null,{"$f":"IF($C9=Y$4,1,0)","v":0},null,{"$f":"IF($C9=AA$4,1,0)","v":0},null,{"$f":"IF($C9=AC$4,1,0)","v":0},null,{"$f":"IF($C9=AE$4,1,0)","v":0},null,{"$f":"IF($C9=AG$4,1,0)","v":0},null,{"$f":"IF($C9=AI$4,1,0)","v":0},null,{"$f":"IF($C9=AK$4,1,0)","v":0},null,{"$f":"IF($C9=AM$4,1,0)","v":0},null,{"$f":"IF($C9=AO$4,1,0)","v":0},null,{"$f":"IF($C9=AQ$4,1,0)","v":0},null,{"$f":"IF($C9=AS$4,1,0)","v":0},null,{"$f":"IF($C9=AU$4,1,0)","v":0},null,{"$f":"IF($C9=AW$4,1,0)","v":0},null,{"$f":"IF($C9=AY$4,1,0)","v":0},null,{"$f":"IF($C9=BA$4,1,0)","v":0},null,{"$f":"IF($C9=BC$4,1,0)","v":0},null,{"$f":"IF($C9=BE$4,1,0)","v":0},null,{"$f":"IF($C9=BG$4,1,0)","v":0},null,{"$f":"IF($C9=BI$4,1,0)","v":0},null,{"$f":"IF($C9=BK$4,1,0)","v":0},null,{"$f":"IF($C9=BM$4,1,0)","v":0},null,{"$f":"IF($C9=BO$4,1,0)","v":0},null,{"$f":"IF($C9=BQ$4,1,0)","v":0},null,{"$f":"IF($C9=BS$4,1,0)","v":0},null,{"$f":"IF($C9=BU$4,1,0)","v":0},null,{"$f":"IF($C9=BW$4,1,0)","v":0},null,{"$f":"IF($C9=BY$4,1,0)","v":0},null,{"$f":"IF($C9=CA$4,1,0)","v":0},null,{"$f":"IF($C9=CC$4,1,0)","v":0},null,{"$f":"IF($C9=CE$4,1,0)","v":0},null,{"$f":"IF($C9=CG$4,1,0)","v":0},null,{"$f":"IF($C9=CI$4,1,0)","v":0},null,{"$f":"IF($C9=CK$4,1,0)","v":0},null,{"$f":"IF($C9=CM$4,1,0)","v":0},null,{"$f":"IF($C9=CO$4,1,0)","v":0},null,{"$f":"IF($C9=CQ$4,1,0)","v":0},null,{"$f":"IF($C9=CS$4,1,0)","v":0},null,{"$f":"IF($C9=CU$4,1,0)","v":0},null,{"$f":"IF($C9=CW$4,1,0)","v":0},null,{"$f":"IF($C9=CY$4,1,0)","v":0},null,{"$f":"IF($C9=DA$4,1,0)","v":0},null,{"$f":"IF($C9=DC$4,1,0)","v":0},null,{"$f":"IF($C9=DE$4,1,0)","v":0},null,{"$f":"IF($C9=DG$4,1,0)","v":0},null,{"$f":"IF($C9=DI$4,1,0)","v":0},null,{"$f":"IF($C9=DK$4,1,0)","v":0},null,{"$f":"IF($C9=DM$4,1,0)","v":0},null,{"$f":"IF($C9=DO$4,1,0)","v":0},null,{"$f":"IF($C9=DQ$4,1,0)","v":0},null,{"$f":"IF($C9=DS$4,1,0)","v":0},null,{"$f":"IF($C9=DU$4,1,0)","v":0},null,{"$f":"IF($C9=DW$4,1,0)","v":0},null,{"$f":"IF($C9=DY$4,1,0)","v":0}]
[]
[null,null,null,null,null,null,null,null,null,null,0]
[]
[null,null,"ITEM","DESCRIÇÃO","QUANT ANUAL\nPOR POSTO","Nº DE POSTOS","QUANT ANUAL\nTOTAL","VALOR"]
[null,null,null,null,null,null,null,null,null,null,null,{"$f":"IF(SUM(K$8:K$11)>0,$E14*$H14,0)","v":0},null,{"$f":"IF(SUM(M$8:M$11)>0,$E14*$H14,0)","v":0},null,{"$f":"IF(SUM(O$8:O$11)>0,$E14*$H14,0)","v":0},null,{"$f":"IF(SUM(Q$8:Q$11)>0,$E14*$H14,0)","v":0},null,{"$f":"IF(SUM(S$8:S$11)>0,$E14*$H14,0)","v":0},null,{"$f":"IF(SUM(U$8:U$11)>0,$E14*$H14,0)","v":0},null,{"$f":"IF(SUM(W$8:W$11)>0,$E14*$H14,0)","v":0},null,{"$f":"IF(SUM(Y$8:Y$11)>0,$E14*$H14,0)","v":0},null,{"$f":"IF(SUM(AA$8:AA$11)>0,$E14*$H14,0)","v":0},null,{"$f":"IF(SUM(AC$8:AC$11)>0,$E14*$H14,0)","v":0},null,{"$f":"IF(SUM(AE$8:AE$11)>0,$E14*$H14,0)","v":0},null,{"$f":"IF(SUM(AG$8:AG$11)>0,$E14*$H14,0)","v":0},null,{"$f":"IF(SUM(AI$8:AI$11)>0,$E14*$H14,0)","v":0},null,{"$f":"IF(SUM(AK$8:AK$11)>0,$E14*$H14,0)","v":0},null,{"$f":"IF(SUM(AM$8:AM$11)>0,$E14*$H14,0)","v":0},null,{"$f":"IF(SUM(AO$8:AO$11)>0,$E14*$H14,0)","v":0},null,{"$f":"IF(SUM(AQ$8:AQ$11)>0,$E14*$H14,0)","v":0},null,{"$f":"IF(SUM(AS$8:AS$11)>0,$E14*$H14,0)","v":0},null,{"$f":"IF(SUM(AU$8:AU$11)>0,$E14*$H14,0)","v":0},null,{"$f":"IF(SUM(AW$8:AW$11)>0,$E14*$H14,0)","v":0},null,{"$f":"IF(SUM(AY$8:AY$11)>0,$E14*$H14,0)","v":0},null,{"$f":"IF(SUM(BA$8:BA$11)>0,$E14*$H14,0)","v":0},null,{"$f":"IF(SUM(BC$8:BC$11)>0,$E14*$H14,0)","v":0},null,{"$f":"IF(SUM(BE$8:BE$11)>0,$E14*$H14,0)","v":0},null,{"$f":"IF(SUM(BG$8:BG$11)>0,$E14*$H14,0)","v":0},null,{"$f":"IF(SUM(BI$8:BI$11)>0,$E14*$H14,0)","v":0},null,{"$f":"IF(SUM(BK$8:BK$11)>0,$E14*$H14,0)","v":0},null,{"$f":"IF(SUM(BM$8:BM$11)>0,$E14*$H14,0)","v":0},null,{"$f":"IF(SUM(BO$8:BO$11)>0,$E14*$H14,0)","v":0},null,{"$f":"IF(SUM(BQ$8:BQ$11)>0,$E14*$H14,0)","v":0},null,{"$f":"IF(SUM(BS$8:BS$11)>0,$E14*$H14,0)","v":0},null,{"$f":"IF(SUM(BU$8:BU$11)>0,$E14*$H14,0)","v":0},null,{"$f":"IF(SUM(BW$8:BW$11)>0,$E14*$H14,0)","v":0},null,{"$f":"IF(SUM(BY$8:BY$11)>0,$E14*$H14,0)","v":0},null,{"$f":"IF(SUM(CA$8:CA$11)>0,$E14*$H14,0)","v":0},null,{"$f":"IF(SUM(CC$8:CC$11)>0,$E14*$H14,0)","v":0},null,{"$f":"IF(SUM(CE$8:CE$11)>0,$E14*$H14,0)","v":0},null,{"$f":"IF(SUM(CG$8:CG$11)>0,$E14*$H14,0)","v":0},null,{"$f":"IF(SUM(CI$8:CI$11)>0,$E14*$H14,0)","v":0},null,{"$f":"IF(SUM(CK$8:CK$11)>0,$E14*$H14,0)","v":0},null,{"$f":"IF(SUM(CM$8:CM$11)>0,$E14*$H14,0)","v":0},null,{"$f":"IF(SUM(CO$8:CO$11)>0,$E14*$H14,0)","v":0},null,{"$f":"IF(SUM(CQ$8:CQ$11)>0,$E14*$H14,0)","v":0},null,{"$f":"IF(SUM(CS$8:CS$11)>0,$E14*$H14,0)","v":0},null,{"$f":"IF(SUM(CU$8:CU$11)>0,$E14*$H14,0)","v":0},null,{"$f":"IF(SUM(CW$8:CW$11)>0,$E14*$H14,0)","v":0},null,{"$f":"IF(SUM(CY$8:CY$11)>0,$E14*$H14,0)","v":0},null,{"$f":"IF(SUM(DA$8:DA$11)>0,$E14*$H14,0)","v":0},null,{"$f":"IF(SUM(DC$8:DC$11)>0,$E14*$H14,0)","v":0},null,{"$f":"IF(SUM(DE$8:DE$11)>0,$E14*$H14,0)","v":0},null,{"$f":"IF(SUM(DG$8:DG$11)>0,$E14*$H14,0)","v":0},null,{"$f":"IF(SUM(DI$8:DI$11)>0,$E14*$H14,0)","v":0},null,{"$f":"IF(SUM(DK$8:DK$11)>0,$E14*$H14,0)","v":0},null,{"$f":"IF(SUM(DM$8:DM$11)>0,$E14*$H14,0)","v":0},null,{"$f":"IF(SUM(DO$8:DO$11)>0,$E14*$H14,0)","v":0},null,{"$f":"IF(SUM(DQ$8:DQ$11)>0,$E14*$H14,0)","v":0},null,{"$f":"IF(SUM(DS$8:DS$11)>0,$E14*$H14,0)","v":0},null,{"$f":"IF(SUM(DU$8:DU$11)>0,$E14*$H14,0)","v":0},null,{"$f":"IF(SUM(DW$8:DW$11)>0,$E14*$H14,0)","v":0},null,{"$f":"IF(SUM(DY$8:DY$11)>0,$E14*$H14,0)","v":0}]
[null,null,1,"Camiseta básica de uniforme",4,{"$f":"SUM(H9:H10)","v":180},{"$f":"F15*E15","v":720},25.97,null,null,null,103.88,null,0,null,{"$f":"IF(SUM(O$8:O$11)>0,$E15*$H15,0)","v":0},null,{"$f":"IF(SUM(Q$8:Q$11)>0,$E15*$H15,0)","v":0},null,{"$f":"IF(SUM(S$8:S$11)>0,$E15*$H15,0)","v":0},null,{"$f":"IF(SUM(U$8:U$11)>0,$E15*$H15,0)","v":0},null,{"$f":"IF(SUM(W$8:W$11)>0,$E15*$H15,0)","v":0},null,{"$f":"IF(SUM(Y$8:Y$11)>0,$E15*$H15,0)","v":0},null,{"$f":"IF(SUM(AA$8:AA$11)>0,$E15*$H15,0)","v":0},null,0,null,0,null,0,null,0,null,0,null,0,null,0,null,0,null,0,null,0,null,0,null,0,null,0,null,0,null,0,null,0,null,0,null,0,null,0,null,0,null,0,null,0,null,0,null,0,null,0,null,0,null,0,null,0,null,0,null,0,null,0,null,0,null,0,null,0,null,0,null,0,null,0,null,0,null,0,null,0,null,0,null,0,null,0,null,0,null,0,null,0,null,0,null,0,null,0,null,0,null,0]
[null,null,null,null,null,null,{"$f":"F16*E16","v":0},null,null,null,null,0,null,0,null,0,null,{"$f":"IF(SUM(Q$8:Q$11)>0,$E16*$H16,0)","v":0},null,{"$f":"IF(SUM(S$8:S$11)>0,$E16*$H16,0)","v":0},null,{"$f":"IF(SUM(U$8:U$11)>0,$E16*$H16,0)","v":0},null,{"$f":"IF(SUM(W$8:W$11)>0,$E16*$H16,0)","v":0},null,{"$f":"IF(SUM(Y$8:Y$11)>0,$E16*$H16,0)","v":0},null,{"$f":"IF(SUM(AA$8:AA$11)>0,$E16*$H16,0)","v":0},null,0,null,0,null,0,null,0,null,0,null,0,null,0,null,0,null,0,null,0,null,0,null,0,null,0,null,0,null,0,null,0,null,0,null,0,null,0,null,0,null,0,null,0,null,0,null,0,null,0,null,0,null,0,null,0,null,0,null,0,null,0,null,0,null,0,null,0,null,0,null,0,null,0,null,0,null,0,null,0,null,0,null,0,null,0,null,0,null,0,null,0,null,0,null,0,null,0,null,0,null,0]
[null,null,null,null,null,null,0,null,null,null,null,0,null,0,null,0,null,{"$f":"IF(SUM(Q$8:Q$11)>0,$E17*$H17,0)","v":0},null,{"$f":"IF(SUM(S$8:S$11)>0,$E17*$H17,0)","v":0},null,{"$f":"IF(SUM(U$8:U$11)>0,$E17*$H17,0)","v":0},null,{"$f":"IF(SUM(W$8:W$11)>0,$E17*$H17,0)","v":0},null,{"$f":"IF(SUM(Y$8:Y$11)>0,$E17*$H17,0)","v":0},null,{"$f":"IF(SUM(AA$8:AA$11)>0,$E17*$H17,0)","v":0},null,0,null,0,null,0,null,0,null,0,null,0,null,0,null,0,null,0,null,0,null,0,null,0,null,0,null,0,null,0,null,0,null,0,null,0,null,0,null,0,null,0,null,0,null,0,null,0,null,0,null,0,null,0,null,0,null,0,null,0,null,0,null,0,null,0,null,0,null,0,null,0,null,0,null,0,null,0,null,0,null,0,null,0,null,0,null,0,null,0,null,0,null,0,null,0,null,0,null,0,null,0]
[null,null,null,null,null,null,0,null,null,null,null,0,null,0,null,0,null,{"$f":"IF(SUM(Q$8:Q$11)>0,$E18*$H18,0)","v":0},null,{"$f":"IF(SUM(S$8:S$11)>0,$E18*$H18,0)","v":0},null,{"$f":"IF(SUM(U$8:U$11)>0,$E18*$H18,0)","v":0},null,{"$f":"IF(SUM(W$8:W$11)>0,$E18*$H18,0)","v":0},null,{"$f":"IF(SUM(Y$8:Y$11)>0,$E18*$H18,0)","v":0},null,{"$f":"IF(SUM(AA$8:AA$11)>0,$E18*$H18,0)","v":0},null,0,null,0,null,0,null,0,null,0,null,0,null,0,null,0,null,0,null,0,null,0,null,0,null,0,null,0,null,0,null,0,null,0,null,0,null,0,null,0,null,0,null,0,null,0,null,0,null,0,null,0,null,0,null,0,null,0,null,0,null,0,null,0,null,0,null,0,null,0,null,0,null,0,null,0,null,0,null,0,null,0,null,0,null,0,null,0,null,0,null,0,null,0,null,0,null,0,null,0,null,0]
[null,null,null,null,null,null,0,null,null,null,null,0,null,0,null,0,null,{"$f":"IF(SUM(Q$8:Q$11)>0,$E19*$H19,0)","v":0},null,{"$f":"IF(SUM(S$8:S$11)>0,$E19*$H19,0)","v":0},null,{"$f":"IF(SUM(U$8:U$11)>0,$E19*$H19,0)","v":0},null,{"$f":"IF(SUM(W$8:W$11)>0,$E19*$H19,0)","v":0},null,{"$f":"IF(SUM(Y$8:Y$11)>0,$E19*$H19,0)","v":0},null,{"$f":"IF(SUM(AA$8:AA$11)>0,$E19*$H19,0)","v":0},null,0,null,0,null,0,null,0,null,0,null,0,null,0,null,0,null,0,null,0,null,0,null,0,null,0,null,0,null,0,null,0,null,0,null,0,null,0,null,0,null,0,null,0,null,0,null,0,null,0,null,0,null,0,null,0,null,0,null,0,null,0,null,0,null,0,null,0,null,0,null,0,null,0,null,0,null,0,null,0,null,0,null,0,null,0,null,0,null,0,null,0,null,0,null,0,null,0,null,0,null,0]
[null,null,null,null,null,null,0,null,null,null,null,0,null,0,null,0,null,{"$f":"IF(SUM(Q$8:Q$11)>0,$E20*$H20,0)","v":0},null,{"$f":"IF(SUM(S$8:S$11)>0,$E20*$H20,0)","v":0},null,{"$f":"IF(SUM(U$8:U$11)>0,$E20*$H20,0)","v":0},null,{"$f":"IF(SUM(W$8:W$11)>0,$E20*$H20,0)","v":0},null,{"$f":"IF(SUM(Y$8:Y$11)>0,$E20*$H20,0)","v":0},null,{"$f":"IF(SUM(AA$8:AA$11)>0,$E20*$H20,0)","v":0},null,0,null,0,null,0,null,0,null,0,null,0,null,0,null,0,null,0,null,0,null,0,null,0,null,0,null,0,null,0,null,0,null,0,null,0,null,0,null,0,null,0,null,0,null,0,null,0,null,0,null,0,null,0,null,0,null,0,null,0,null,0,null,0,null,0,null,0,null,0,null,0,null,0,null,0,null,0,null,0,null,0,null,0,null,0,null,0,null,0,null,0,null,0,null,0,null,0,null,0,null,0]
[null,null,null,null,null,null,null,null,null,null,null,0,null,0,null,0,null,{"$f":"IF(SUM(Q$8:Q$11)>0,$E21*$H21,0)","v":0},null,{"$f":"IF(SUM(S$8:S$11)>0,$E21*$H21,0)","v":0},null,{"$f":"IF(SUM(U$8:U$11)>0,$E21*$H21,0)","v":0},null,{"$f":"IF(SUM(W$8:W$11)>0,$E21*$H21,0)","v":0},null,{"$f":"IF(SUM(Y$8:Y$11)>0,$E21*$H21,0)","v":0},null,{"$f":"IF(SUM(AA$8:AA$11)>0,$E21*$H21,0)","v":0},null,0,null,0,null,0,null,0,null,0,null,0,null,0,null,0,null,0,null,0,null,0,null,0,null,0,null,0,null,0,null,0,null,0,null,0,null,0,null,0,null,0,null,0,null,0,null,0,null,0,null,0,null,0,null,0,null,0,null,0,null,0,null,0,null,0,null,0,null,0,null,0,null,0,null,0,null,0,null,0,null,0,null,0,null,0,null,0,null,0,null,0,null,0,null,0,null,0,null,0,null,0]
[]
[null,null,"CATEGORIAS",null,null,null,null,"QUANTIDADE"]
[null,null,null,null,null,null,null,null,null,null,{"$f":"IF($C24=K$4,1,0)","v":0}]
[null,null,null,{"$f":"HLOOKUP($C25,'Dados Gerais'!$D$5:$BJ$10,6)","v":{"$error":"#N/A"}},null,null,null,{"$f":"HLOOKUP($C25,'Dados Gerais'!$D$5:$BJ$14,10)","v":{"$error":"#N/A"}},null,null,{"$f":"IF($C25=K$4,1,0)","v":0},null,{"$f":"IF($C25=M$4,1,0)","v":0},null,{"$f":"IF($C25=O$4,1,0)","v":0},null,{"$f":"IF($C25=Q$4,1,0)","v":0},null,{"$f":"IF($C25=S$4,1,0)","v":0},null,{"$f":"IF($C25=U$4,1,0)","v":0},null,{"$f":"IF($C25=W$4,1,0)","v":0},null,{"$f":"IF($C25=Y$4,1,0)","v":0},null,{"$f":"IF($C25=AA$4,1,0)","v":0},null,{"$f":"IF($C25=AC$4,1,0)","v":0},null,{"$f":"IF($C25=AE$4,1,0)","v":0},null,{"$f":"IF($C25=AG$4,1,0)","v":0},null,{"$f":"IF($C25=AI$4,1,0)","v":0},null,{"$f":"IF($C25=AK$4,1,0)","v":0},null,{"$f":"IF($C25=AM$4,1,0)","v":0},null,{"$f":"IF($C25=AO$4,1,0)","v":0},null,{"$f":"IF($C25=AQ$4,1,0)","v":0},null,{"$f":"IF($C25=AS$4,1,0)","v":0},null,{"$f":"IF($C25=AU$4,1,0)","v":0},null,{"$f":"IF($C25=AW$4,1,0)","v":0},null,{"$f":"IF($C25=AY$4,1,0)","v":0},null,{"$f":"IF($C25=BA$4,1,0)","v":0},null,{"$f":"IF($C25=BC$4,1,0)","v":0},null,{"$f":"IF($C25=BE$4,1,0)","v":0},null,{"$f":"IF($C25=BG$4,1,0)","v":0},null,{"$f":"IF($C25=BI$4,1,0)","v":0},null,{"$f":"IF($C25=BK$4,1,0)","v":0},null,{"$f":"IF($C25=BM$4,1,0)","v":0},null,{"$f":"IF($C25=BO$4,1,0)","v":0},null,{"$f":"IF($C25=BQ$4,1,0)","v":0},null,{"$f":"IF($C25=BS$4,1,0)","v":0},null,{"$f":"IF($C25=BU$4,1,0)","v":0},null,{"$f":"IF($C25=BW$4,1,0)","v":0},null,{"$f":"IF($C25=BY$4,1,0)","v":0},null,{"$f":"IF($C25=CA$4,1,0)","v":0},null,{"$f":"IF($C25=CC$4,1,0)","v":0},null,{"$f":"IF($C25=CE$4,1,0)","v":0},null,{"$f":"IF($C25=CG$4,1,0)","v":0},null,{"$f":"IF($C25=CI$4,1,0)","v":0},null,{"$f":"IF($C25=CK$4,1,0)","v":0},null,{"$f":"IF($C25=CM$4,1,0)","v":0},null,{"$f":"IF($C25=CO$4,1,0)","v":0},null,{"$f":"IF($C25=CQ$4,1,0)","v":0},null,{"$f":"IF($C25=CS$4,1,0)","v":0},null,{"$f":"IF($C25=CU$4,1,0)","v":0},null,{"$f":"IF($C25=CW$4,1,0)","v":0},null,{"$f":"IF($C25=CY$4,1,0)","v":0},null,{"$f":"IF($C25=DA$4,1,0)","v":0},null,{"$f":"IF($C25=DC$4,1,0)","v":0},null,{"$f":"IF($C25=DE$4,1,0)","v":0},null,{"$f":"IF($C25=DG$4,1,0)","v":0},null,{"$f":"IF($C25=DI$4,1,0)","v":0},null,{"$f":"IF($C25=DK$4,1,0)","v":0},null,{"$f":"IF($C25=DM$4,1,0)","v":0},null,{"$f":"IF($C25=DO$4,1,0)","v":0},null,{"$f":"IF($C25=DQ$4,1,0)","v":0},null,{"$f":"IF($C25=DS$4,1,0)","v":0},null,{"$f":"IF($C25=DU$4,1,0)","v":0},null,{"$f":"IF($C25=DW$4,1,0)","v":0},null,{"$f":"IF($C25=DY$4,1,0)","v":0}]
[null,null,null,{"$f":"HLOOKUP($C26,'Dados Gerais'!$D$5:$BJ$10,6)","v":{"$error":"#N/A"}},null,null,null,{"$f":"HLOOKUP($C26,'Dados Gerais'!$D$5:$BJ$14,10)","v":{"$error":"#N/A"}},null,null,0,null,0,null,0,null,0,null,0,null,0,null,0,null,0,null,0,null,0,null,0,null,0,null,0,null,0,null,0,null,0,null,0,null,0,null,0,null,0,null,0,null,0,null,0,null,0,null,0,null,0,null,0,null,0,null,0,null,0,null,0,null,0,null,0,null,0,null,0,null,0,null,0,null,0,null,0,null,0,null,0,null,0,null,0,null,0,null,0,null,0,null,0,null,0,null,0,null,0,null,0,null,0,null,0,null,0,null,0,null,0,null,0,null,0,null,0,null,0]
[null,null,null,null,null,null,null,null,null,null,{"$f":"IF($C27=K$4,1,0)","v":0}]
[]
[null,null,"ITEM","DESCRIÇÃO","QUANT ANUAL\nPOR POSTO","Nº DE POSTOS","QUANT ANUAL\nTOTAL","VALOR"]
[null,null,null,null,null,null,null,null,null,null,null,{"$f":"IF(SUM(K$8:K$11)>0,$E30*$H30,0)","v":0},null,{"$f":"IF(SUM(M$8:M$11)>0,$E30*$H30,0)","v":0},null,{"$f":"IF(SUM(O$8:O$11)>0,$E30*$H30,0)","v":0},null,{"$f":"IF(SUM(Q$8:Q$11)>0,$E30*$H30,0)","v":0},null,{"$f":"IF(SUM(S$8:S$11)>0,$E30*$H30,0)","v":0},null,{"$f":"IF(SUM(U$8:U$11)>0,$E30*$H30,0)","v":0},null,{"$f":"IF(SUM(W$8:W$11)>0,$E30*$H30,0)","v":0},null,{"$f":"IF(SUM(Y$8:Y$11)>0,$E30*$H30,0)","v":0},null,{"$f":"IF(SUM(AA$8:AA$11)>0,$E30*$H30,0)","v":0},null,{"$f":"IF(SUM(AC$8:AC$11)>0,$E30*$H30,0)","v":0},null,{"$f":"IF(SUM(AE$8:AE$11)>0,$E30*$H30,0)","v":0},null,{"$f":"IF(SUM(AG$8:AG$11)>0,$E30*$H30,0)","v":0},null,{"$f":"IF(SUM(AI$8:AI$11)>0,$E30*$H30,0)","v":0},null,{"$f":"IF(SUM(AK$8:AK$11)>0,$E30*$H30,0)","v":0},null,{"$f":"IF(SUM(AM$8:AM$11)>0,$E30*$H30,0)","v":0},null,{"$f":"IF(SUM(AO$8:AO$11)>0,$E30*$H30,0)","v":0},null,{"$f":"IF(SUM(AQ$8:AQ$11)>0,$E30*$H30,0)","v":0},null,{"$f":"IF(SUM(AS$8:AS$11)>0,$E30*$H30,0)","v":0},null,{"$f":"IF(SUM(AU$8:AU$11)>0,$E30*$H30,0)","v":0},null,{"$f":"IF(SUM(AW$8:AW$11)>0,$E30*$H30,0)","v":0},null,{"$f":"IF(SUM(AY$8:AY$11)>0,$E30*$H30,0)","v":0},null,{"$f":"IF(SUM(BA$8:BA$11)>0,$E30*$H30,0)","v":0},null,{"$f":"IF(SUM(BC$8:BC$11)>0,$E30*$H30,0)","v":0},null,{"$f":"IF(SUM(BE$8:BE$11)>0,$E30*$H30,0)","v":0},null,{"$f":"IF(SUM(BG$8:BG$11)>0,$E30*$H30,0)","v":0},null,{"$f":"IF(SUM(BI$8:BI$11)>0,$E30*$H30,0)","v":0},null,{"$f":"IF(SUM(BK$8:BK$11)>0,$E30*$H30,0)","v":0},null,{"$f":"IF(SUM(BM$8:BM$11)>0,$E30*$H30,0)","v":0},null,{"$f":"IF(SUM(BO$8:BO$11)>0,$E30*$H30,0)","v":0},null,{"$f":"IF(SUM(BQ$8:BQ$11)>0,$E30*$H30,0)","v":0},null,{"$f":"IF(SUM(BS$8:BS$11)>0,$E30*$H30,0)","v":0},null,{"$f":"IF(SUM(BU$8:BU$11)>0,$E30*$H30,0)","v":0},null,{"$f":"IF(SUM(BW$8:BW$11)>0,$E30*$H30,0)","v":0},null,{"$f":"IF(SUM(BY$8:BY$11)>0,$E30*$H30,0)","v":0},null,{"$f":"IF(SUM(CA$8:CA$11)>0,$E30*$H30,0)","v":0},null,{"$f":"IF(SUM(CC$8:CC$11)>0,$E30*$H30,0)","v":0},null,{"$f":"IF(SUM(CE$8:CE$11)>0,$E30*$H30,0)","v":0},null,{"$f":"IF(SUM(CG$8:CG$11)>0,$E30*$H30,0)","v":0},null,{"$f":"IF(SUM(CI$8:CI$11)>0,$E30*$H30,0)","v":0},null,{"$f":"IF(SUM(CK$8:CK$11)>0,$E30*$H30,0)","v":0},null,{"$f":"IF(SUM(CM$8:CM$11)>0,$E30*$H30,0)","v":0},null,{"$f":"IF(SUM(CO$8:CO$11)>0,$E30*$H30,0)","v":0},null,{"$f":"IF(SUM(CQ$8:CQ$11)>0,$E30*$H30,0)","v":0},null,{"$f":"IF(SUM(CS$8:CS$11)>0,$E30*$H30,0)","v":0},null,{"$f":"IF(SUM(CU$8:CU$11)>0,$E30*$H30,0)","v":0},null,{"$f":"IF(SUM(CW$8:CW$11)>0,$E30*$H30,0)","v":0},null,{"$f":"IF(SUM(CY$8:CY$11)>0,$E30*$H30,0)","v":0},null,{"$f":"IF(SUM(DA$8:DA$11)>0,$E30*$H30,0)","v":0},null,{"$f":"IF(SUM(DC$8:DC$11)>0,$E30*$H30,0)","v":0},null,{"$f":"IF(SUM(DE$8:DE$11)>0,$E30*$H30,0)","v":0},null,{"$f":"IF(SUM(DG$8:DG$11)>0,$E30*$H30,0)","v":0},null,{"$f":"IF(SUM(DI$8:DI$11)>0,$E30*$H30,0)","v":0},null,{"$f":"IF(SUM(DK$8:DK$11)>0,$E30*$H30,0)","v":0},null,{"$f":"IF(SUM(DM$8:DM$11)>0,$E30*$H30,0)","v":0},null,{"$f":"IF(SUM(DO$8:DO$11)>0,$E30*$H30,0)","v":0},null,{"$f":"IF(SUM(DQ$8:DQ$11)>0,$E30*$H30,0)","v":0},null,{"$f":"IF(SUM(DS$8:DS$11)>0,$E30*$H30,0)","v":0},null,{"$f":"IF(SUM(DU$8:DU$11)>0,$E30*$H30,0)","v":0},null,{"$f":"IF(SUM(DW$8:DW$11)>0,$E30*$H30,0)","v":0},null,{"$f":"IF(SUM(DY$8:DY$11)>0,$E30*$H30,0)","v":0}]
[null,null,null,null,null,{"$f":"H25+H26","v":{"$error":"#N/A"}},{"$f":"F31*E31","v":{"$error":"#N/A"}},null,null,null,null,{"$f":"IF(SUM(K$25:K$27)>0,$E31*$H31,0)","v":0},null,{"$f":"IF(SUM(M$25:M$27)>0,$E31*$H31,0)","v":0},null,{"$f":"IF(SUM(O$25:O$27)>0,$E31*$H31,0)","v":0},null,{"$f":"IF(SUM(Q$25:Q$27)>0,$E31*$H31,0)","v":0},null,{"$f":"IF(SUM(S$25:S$27)>0,$E31*$H31,0)","v":0},null,{"$f":"IF(SUM(U$25:U$27)>0,$E31*$H31,0)","v":0},null,{"$f":"IF(SUM(W$25:W$27)>0,$E31*$H31,0)","v":0},null,{"$f":"IF(SUM(Y$25:Y$27)>0,$E31*$H31,0)","v":0},null,{"$f":"IF(SUM(AA$25:AA$27)>0,$E31*$H31,0)","v":0},null,0,null,0,null,0,null,0,null,0,null,0,null,0,null,0,null,0,null,0,null,0,null,0,null,0,null,0,null,0,null,0,null,0,null,0,null,0,null,0,null,0,null,0,null,0,null,0,null,0,null,0,null,0,null,0,null,0,null,0,null,0,null,0,null,0,null,0,null,0,null,0,null,0,null,0,null,0,null,0,null,0,null,0,null,0,null,0,null,0,null,0,null,0,null,0,null,0,null,0,null,0]
[null,null,null,null,null,{"$f":"F31","v":{"$error":"#N/A"}},{"$error":"#N/A"},null,null,null,null,0,null,0,null,0,null,0,null,0,null,0,null,0,null,0,null,0,null,0,null,0,null,0,null,0,null,0,null,0,null,0,null,0,null,0,null,0,null,0,null,0,null,0,null,0,null,0,null,0,null,0,null,0,null,0,null,0,null,0,null,0,null,0,null,0,null,0,null,0,null,0,null,0,null,0,null,0,null,0,null,0,null,0,null,0,null,0,null,0,null,0,null,0,null,0,null,0,null,0,null,0,null,0,null,0,null,0,null,0,null,0,null,0,null,0,null,0,null,0]
[null,null,null,null,null,{"$f":"F32","v":{"$error":"#N/A"}},{"$error":"#N/A"},null,null,null,null,0,null,0,null,0,null,0,null,0,null,0,null,0,null,0,null,0,null,0,null,0,null,0,null,0,null,0,null,0,null,0,null,0,null,0,null,0,null,0,null,0,null,0,null,0,null,0,null,0,null,0,null,0,null,0,null,0,null,0,null,0,null,0,null,0,null,0,null,0,null,0,null,0,null,0,null,0,null,0,null,0,null,0,null,0,null,0,null,0,null,0,null,0,null,0,null,0,null,0,null,0,null,0,null,0,null,0,null,0,null,0,null,0,null,0,null,0,null,0]
[null,null,null,null,null,{"$error":"#N/A"},{"$error":"#N/A"},null,null,null,null,0,null,0,null,0,null,0,null,0,null,0,null,0,null,0,null,0,null,0,null,0,null,0,null,0,null,0,null,0,null,0,null,0,null,0,null,0,null,0,null,0,null,0,null,0,null,0,null,0,null,0,null,0,null,0,null,0,null,0,null,0,null,0,null,0,null,0,null,0,null,0,null,0,null,0,null,0,null,0,null,0,null,0,null,0,null,0,null,0,null,0,null,0,null,0,null,0,null,0,null,0,null,0,null,0,null,0,null,0,null,0,null,0,null,0,null,0,null,0]
[null,null,null,null,null,{"$error":"#N/A"},{"$error":"#N/A"},null,null,null,null,0,null,0,null,0,null,0,null,0,null,0,null,0,null,0,null,0,null,0,null,0,null,0,null,0,null,0,null,0,null,0,null,0,null,0,null,0,null,0,null,0,null,0,null,0,null,0,null,0,null,0,null,0,null,0,null,0,null,0,null,0,null,0,null,0,null,0,null,0,null,0,null,0,null,0,null,0,null,0,null,0,null,0,null,0,null,0,null,0,null,0,null,0,null,0,null,0,null,0,null,0,null,0,null,0,null,0,null,0,null,0,null,0,null,0,null,0,null,0]
[null,null,null,null,null,{"$error":"#N/A"},{"$error":"#N/A"},null,null,null,null,0,null,0,null,0,null,0,null,0,null,0,null,0,null,0,null,0,null,0,null,0,null,0,null,0,null,0,null,0,null,0,null,0,null,0,null,0,null,0,null,0,null,0,null,0,null,0,null,0,null,0,null,0,null,0,null,0,null,0,null,0,null,0,null,0,null,0,null,0,null,0,null,0,null,0,null,0,null,0,null,0,null,0,null,0,null,0,null,0,null,0,null,0,null,0,null,0,null,0,null,0,null,0,null,0,null,0,null,0,null,0,null,0,null,0,null,0,null,0]
[null,null,null,null,null,null,null,null,null,null,null,0,null,0,null,0,null,0,null,0,null,0,null,0,null,0,null,0,null,0,null,0,null,0,null,0,null,0,null,0,null,0,null,0,null,0,null,0,null,0,null,0,null,0,null,0,null,0,null,0,null,0,null,0,null,0,null,0,null,0,null,0,null,0,null,0,null,0,null,0,null,0,null,0,null,0,null,0,null,0,null,0,null,0,null,0,null,0,null,0,null,0,null,0,null,0,null,0,null,0,null,0,null,0,null,0,null,0,null,0,null,0,null,0,null,0,null,0,null,0]
[null,null,"CATEGORIAS",null,null,null,null,"QUANTIDADE"]
[null,null,null,null,null,null,null,null,null,null,{"$f":"IF($C39=K$4,1,0)","v":0}]
[null,null,null,{"$f":"HLOOKUP($C40,'Dados Gerais'!$D$5:$BJ$10,6)","v":{"$error":"#N/A"}},null,null,null,{"$f":"HLOOKUP($C40,'Dados Gerais'!$D$5:$BJ$14,10)","v":{"$error":"#N/A"}},null,null,{"$f":"IF($C40=K$4,1,0)","v":0},null,{"$f":"IF($C40=M$4,1,0)","v":0},null,{"$f":"IF($C40=O$4,1,0)","v":0},null,{"$f":"IF($C40=Q$4,1,0)","v":0},null,{"$f":"IF($C40=S$4,1,0)","v":0},null,{"$f":"IF($C40=U$4,1,0)","v":0},null,{"$f":"IF($C40=W$4,1,0)","v":0},null,{"$f":"IF($C40=Y$4,1,0)","v":0},null,{"$f":"IF($C40=AA$4,1,0)","v":0},null,{"$f":"IF($C40=AC$4,1,0)","v":0},null,{"$f":"IF($C40=AE$4,1,0)","v":0},null,{"$f":"IF($C40=AG$4,1,0)","v":0},null,{"$f":"IF($C40=AI$4,1,0)","v":0},null,{"$f":"IF($C40=AK$4,1,0)","v":0},null,{"$f":"IF($C40=AM$4,1,0)","v":0},null,{"$f":"IF($C40=AO$4,1,0)","v":0},null,{"$f":"IF($C40=AQ$4,1,0)","v":0},null,{"$f":"IF($C40=AS$4,1,0)","v":0},null,{"$f":"IF($C40=AU$4,1,0)","v":0},null,{"$f":"IF($C40=AW$4,1,0)","v":0},null,{"$f":"IF($C40=AY$4,1,0)","v":0},null,{"$f":"IF($C40=BA$4,1,0)","v":0},null,{"$f":"IF($C40=BC$4,1,0)","v":0},null,{"$f":"IF($C40=BE$4,1,0)","v":0},null,{"$f":"IF($C40=BG$4,1,0)","v":0},null,{"$f":"IF($C40=BI$4,1,0)","v":0},null,{"$f":"IF($C40=BK$4,1,0)","v":0},null,{"$f":"IF($C40=BM$4,1,0)","v":0},null,{"$f":"IF($C40=BO$4,1,0)","v":0},null,{"$f":"IF($C40=BQ$4,1,0)","v":0},null,{"$f":"IF($C40=BS$4,1,0)","v":0},null,{"$f":"IF($C40=BU$4,1,0)","v":0},null,{"$f":"IF($C40=BW$4,1,0)","v":0},null,{"$f":"IF($C40=BY$4,1,0)","v":0},null,{"$f":"IF($C40=CA$4,1,0)","v":0},null,{"$f":"IF($C40=CC$4,1,0)","v":0},null,{"$f":"IF($C40=CE$4,1,0)","v":0},null,{"$f":"IF($C40=CG$4,1,0)","v":0},null,{"$f":"IF($C40=CI$4,1,0)","v":0},null,{"$f":"IF($C40=CK$4,1,0)","v":0},null,{"$f":"IF($C40=CM$4,1,0)","v":0},null,{"$f":"IF($C40=CO$4,1,0)","v":0},null,{"$f":"IF($C40=CQ$4,1,0)","v":0},null,{"$f":"IF($C40=CS$4,1,0)","v":0},null,{"$f":"IF($C40=CU$4,1,0)","v":0},null,{"$f":"IF($C40=CW$4,1,0)","v":0},null,{"$f":"IF($C40=CY$4,1,0)","v":0},null,{"$f":"IF($C40=DA$4,1,0)","v":0},null,{"$f":"IF($C40=DC$4,1,0)","v":0},null,{"$f":"IF($C40=DE$4,1,0)","v":0},null,{"$f":"IF($C40=DG$4,1,0)","v":0},null,{"$f":"IF($C40=DI$4,1,0)","v":0},null,{"$f":"IF($C40=DK$4,1,0)","v":0},null,{"$f":"IF($C40=DM$4,1,0)","v":0},null,{"$f":"IF($C40=DO$4,1,0)","v":0},null,{"$f":"IF($C40=DQ$4,1,0)","v":0},null,{"$f":"IF($C40=DS$4,1,0)","v":0},null,{"$f":"IF($C40=DU$4,1,0)","v":0},null,{"$f":"IF($C40=DW$4,1,0)","v":0},null,{"$f":"IF($C40=DY$4,1,0)","v":0}]
[null,null,null,{"$f":"HLOOKUP($C41,'Dados Gerais'!$D$5:$BJ$10,6)","v":{"$error":"#N/A"}},null,null,null,{"$f":"HLOOKUP($C41,'Dados Gerais'!$D$5:$BJ$14,10)","v":{"$error":"#N/A"}},null,null,0,null,0,null,0,null,0,null,0,null,0,null,0,null,0,null,0,null,0,null,0,null,0,null,0,null,0,null,0,null,0,null,0,null,0,null,0,null,0,null,0,null,0,null,0,null,0,null,0,null,0,null,0,null,0,null,0,null,0,null,0,null,0,null,0,null,0,null,0,null,0,null,0,null,0,null,0,null,0,null,0,null,0,null,0,null,0,null,0,null,0,null,0,null,0,null,0,null,0,null,0,null,0,null,0,null,0,null,0,null,0,null,0,null,0,null,0,null,0]
[null,null,null,null,null,null,null,null,null,null,{"$f":"IF($C42=K$4,1,0)","v":0}]
[]
[null,null,"ITEM","DESCRIÇÃO","QUANT ANUAL\nPOR POSTO","Nº DE POSTOS","QUANT ANUAL\nTOTAL","VALOR"]
[null,null,null,null,null,null,null,null,null,null,null,{"$f":"IF(SUM(K$8:K$11)>0,$E45*$H45,0)","v":0},null,{"$f":"IF(SUM(M$8:M$11)>0,$E45*$H45,0)","v":0},null,{"$f":"IF(SUM(O$8:O$11)>0,$E45*$H45,0)","v":0},null,{"$f":"IF(SUM(Q$8:Q$11)>0,$E45*$H45,0)","v":0},null,{"$f":"IF(SUM(S$8:S$11)>0,$E45*$H45,0)","v":0},null,{"$f":"IF(SUM(U$8:U$11)>0,$E45*$H45,0)","v":0},null,{"$f":"IF(SUM(W$8:W$11)>0,$E45*$H45,0)","v":0},null,{"$f":"IF(SUM(Y$8:Y$11)>0,$E45*$H45,0)","v":0},null,{"$f":"IF(SUM(AA$8:AA$11)>0,$E45*$H45,0)","v":0},null,{"$f":"IF(SUM(AC$8:AC$11)>0,$E45*$H45,0)","v":0},null,{"$f":"IF(SUM(AE$8:AE$11)>0,$E45*$H45,0)","v":0},null,{"$f":"IF(SUM(AG$8:AG$11)>0,$E45*$H45,0)","v":0},null,{"$f":"IF(SUM(AI$8:AI$11)>0,$E45*$H45,0)","v":0},null,{"$f":"IF(SUM(AK$8:AK$11)>0,$E45*$H45,0)","v":0},null,{"$f":"IF(SUM(AM$8:AM$11)>0,$E45*$H45,0)","v":0},null,{"$f":"IF(SUM(AO$8:AO$11)>0,$E45*$H45,0)","v":0},null,{"$f":"IF(SUM(AQ$8:AQ$11)>0,$E45*$H45,0)","v":0},null,{"$f":"IF(SUM(AS$8:AS$11)>0,$E45*$H45,0)","v":0},null,{"$f":"IF(SUM(AU$8:AU$11)>0,$E45*$H45,0)","v":0},null,{"$f":"IF(SUM(AW$8:AW$11)>0,$E45*$H45,0)","v":0},null,{"$f":"IF(SUM(AY$8:AY$11)>0,$E45*$H45,0)","v":0},null,{"$f":"IF(SUM(BA$8:BA$11)>0,$E45*$H45,0)","v":0},null,{"$f":"IF(SUM(BC$8:BC$11)>0,$E45*$H45,0)","v":0},null,{"$f":"IF(SUM(BE$8:BE$11)>0,$E45*$H45,0)","v":0},null,{"$f":"IF(SUM(BG$8:BG$11)>0,$E45*$H45,0)","v":0},null,{"$f":"IF(SUM(BI$8:BI$11)>0,$E45*$H45,0)","v":0},null,{"$f":"IF(SUM(BK$8:BK$11)>0,$E45*$H45,0)","v":0},null,{"$f":"IF(SUM(BM$8:BM$11)>0,$E45*$H45,0)","v":0},null,{"$f":"IF(SUM(BO$8:BO$11)>0,$E45*$H45,0)","v":0},null,{"$f":"IF(SUM(BQ$8:BQ$11)>0,$E45*$H45,0)","v":0},null,{"$f":"IF(SUM(BS$8:BS$11)>0,$E45*$H45,0)","v":0},null,{"$f":"IF(SUM(BU$8:BU$11)>0,$E45*$H45,0)","v":0},null,{"$f":"IF(SUM(BW$8:BW$11)>0,$E45*$H45,0)","v":0},null,{"$f":"IF(SUM(BY$8:BY$11)>0,$E45*$H45,0)","v":0},null,{"$f":"IF(SUM(CA$8:CA$11)>0,$E45*$H45,0)","v":0},null,{"$f":"IF(SUM(CC$8:CC$11)>0,$E45*$H45,0)","v":0},null,{"$f":"IF(SUM(CE$8:CE$11)>0,$E45*$H45,0)","v":0},null,{"$f":"IF(SUM(CG$8:CG$11)>0,$E45*$H45,0)","v":0},null,{"$f":"IF(SUM(CI$8:CI$11)>0,$E45*$H45,0)","v":0},null,{"$f":"IF(SUM(CK$8:CK$11)>0,$E45*$H45,0)","v":0},null,{"$f":"IF(SUM(CM$8:CM$11)>0,$E45*$H45,0)","v":0},null,{"$f":"IF(SUM(CO$8:CO$11)>0,$E45*$H45,0)","v":0},null,{"$f":"IF(SUM(CQ$8:CQ$11)>0,$E45*$H45,0)","v":0},null,{"$f":"IF(SUM(CS$8:CS$11)>0,$E45*$H45,0)","v":0},null,{"$f":"IF(SUM(CU$8:CU$11)>0,$E45*$H45,0)","v":0},null,{"$f":"IF(SUM(CW$8:CW$11)>0,$E45*$H45,0)","v":0},null,{"$f":"IF(SUM(CY$8:CY$11)>0,$E45*$H45,0)","v":0},null,{"$f":"IF(SUM(DA$8:DA$11)>0,$E45*$H45,0)","v":0},null,{"$f":"IF(SUM(DC$8:DC$11)>0,$E45*$H45,0)","v":0},null,{"$f":"IF(SUM(DE$8:DE$11)>0,$E45*$H45,0)","v":0},null,{"$f":"IF(SUM(DG$8:DG$11)>0,$E45*$H45,0)","v":0},null,{"$f":"IF(SUM(DI$8:DI$11)>0,$E45*$H45,0)","v":0},null,{"$f":"IF(SUM(DK$8:DK$11)>0,$E45*$H45,0)","v":0},null,{"$f":"IF(SUM(DM$8:DM$11)>0,$E45*$H45,0)","v":0},null,{"$f":"IF(SUM(DO$8:DO$11)>0,$E45*$H45,0)","v":0},null,{"$f":"IF(SUM(DQ$8:DQ$11)>0,$E45*$H45,0)","v":0},null,{"$f":"IF(SUM(DS$8:DS$11)>0,$E45*$H45,0)","v":0},null,{"$f":"IF(SUM(DU$8:DU$11)>0,$E45*$H45,0)","v":0},null,{"$f":"IF(SUM(DW$8:DW$11)>0,$E45*$H45,0)","v":0},null,{"$f":"IF(SUM(DY$8:DY$11)>0,$E45*$H45,0)","v":0}]
[null,null,null,null,null,{"$f":"H40+H41","v":{"$error":"#N/A"}},{"$f":"F46*E46","v":{"$error":"#N/A"}},null,null,null,null,{"$f":"IF(SUM(K$39:K$42)>0,$E46*$H46,0)","v":0},null,{"$f":"IF(SUM(M$39:M$42)>0,$E46*$H46,0)","v":0},null,{"$f":"IF(SUM(O$39:O$42)>0,$E46*$H46,0)","v":0},null,{"$f":"IF(SUM(Q$39:Q$42)>0,$E46*$H46,0)","v":0},null,{"$f":"IF(SUM(S$39:S$42)>0,$E46*$H46,0)","v":0},null,{"$f":"IF(SUM(U$39:U$42)>0,$E46*$H46,0)","v":0},null,{"$f":"IF(SUM(W$39:W$42)>0,$E46*$H46,0)","v":0},null,{"$f":"IF(SUM(Y$39:Y$42)>0,$E46*$H46,0)","v":0},null,{"$f":"IF(SUM(AA$39:AA$42)>0,$E46*$H46,0)","v":0},null,{"$f":"IF(SUM(AC$8:AC$11)>0,$E46*$H46,0)","v":0},null,{"$f":"IF(SUM(AE$8:AE$11)>0,$E46*$H46,0)","v":0},null,{"$f":"IF(SUM(AG$8:AG$11)>0,$E46*$H46,0)","v":0},null,{"$f":"IF(SUM(AI$8:AI$11)>0,$E46*$H46,0)","v":0},null,{"$f":"IF(SUM(AK$8:AK$11)>0,$E46*$H46,0)","v":0},null,{"$f":"IF(SUM(AM$8:AM$11)>0,$E46*$H46,0)","v":0},null,{"$f":"IF(SUM(AO$8:AO$11)>0,$E46*$H46,0)","v":0},null,{"$f":"IF(SUM(AQ$8:AQ$11)>0,$E46*$H46,0)","v":0},null,{"$f":"IF(SUM(AS$8:AS$11)>0,$E46*$H46,0)","v":0},null,{"$f":"IF(SUM(AU$8:AU$11)>0,$E46*$H46,0)","v":0},null,{"$f":"IF(SUM(AW$8:AW$11)>0,$E46*$H46,0)","v":0},null,{"$f":"IF(SUM(AY$8:AY$11)>0,$E46*$H46,0)","v":0},null,{"$f":"IF(SUM(BA$8:BA$11)>0,$E46*$H46,0)","v":0},null,{"$f":"IF(SUM(BC$8:BC$11)>0,$E46*$H46,0)","v":0},null,{"$f":"IF(SUM(BE$8:BE$11)>0,$E46*$H46,0)","v":0},null,{"$f":"IF(SUM(BG$8:BG$11)>0,$E46*$H46,0)","v":0},null,{"$f":"IF(SUM(BI$8:BI$11)>0,$E46*$H46,0)","v":0},null,{"$f":"IF(SUM(BK$8:BK$11)>0,$E46*$H46,0)","v":0},null,{"$f":"IF(SUM(BM$8:BM$11)>0,$E46*$H46,0)","v":0},null,{"$f":"IF(SUM(BO$8:BO$11)>0,$E46*$H46,0)","v":0},null,{"$f":"IF(SUM(BQ$8:BQ$11)>0,$E46*$H46,0)","v":0},null,{"$f":"IF(SUM(BS$8:BS$11)>0,$E46*$H46,0)","v":0},null,{"$f":"IF(SUM(BU$8:BU$11)>0,$E46*$H46,0)","v":0},null,{"$f":"IF(SUM(BW$8:BW$11)>0,$E46*$H46,0)","v":0},null,{"$f":"IF(SUM(BY$8:BY$11)>0,$E46*$H46,0)","v":0},null,{"$f":"IF(SUM(CA$8:CA$11)>0,$E46*$H46,0)","v":0},null,{"$f":"IF(SUM(CC$8:CC$11)>0,$E46*$H46,0)","v":0},null,{"$f":"IF(SUM(CE$8:CE$11)>0,$E46*$H46,0)","v":0},null,{"$f":"IF(SUM(CG$8:CG$11)>0,$E46*$H46,0)","v":0},null,{"$f":"IF(SUM(CI$8:CI$11)>0,$E46*$H46,0)","v":0},null,{"$f":"IF(SUM(CK$8:CK$11)>0,$E46*$H46,0)","v":0},null,{"$f":"IF(SUM(CM$8:CM$11)>0,$E46*$H46,0)","v":0},null,{"$f":"IF(SUM(CO$8:CO$11)>0,$E46*$H46,0)","v":0},null,{"$f":"IF(SUM(CQ$8:CQ$11)>0,$E46*$H46,0)","v":0},null,{"$f":"IF(SUM(CS$8:CS$11)>0,$E46*$H46,0)","v":0},null,{"$f":"IF(SUM(CU$8:CU$11)>0,$E46*$H46,0)","v":0},null,{"$f":"IF(SUM(CW$8:CW$11)>0,$E46*$H46,0)","v":0},null,{"$f":"IF(SUM(CY$8:CY$11)>0,$E46*$H46,0)","v":0},null,{"$f":"IF(SUM(DA$8:DA$11)>0,$E46*$H46,0)","v":0},null,{"$f":"IF(SUM(DC$8:DC$11)>0,$E46*$H46,0)","v":0},null,{"$f":"IF(SUM(DE$8:DE$11)>0,$E46*$H46,0)","v":0},null,{"$f":"IF(SUM(DG$8:DG$11)>0,$E46*$H46,0)","v":0},null,{"$f":"IF(SUM(DI$8:DI$11)>0,$E46*$H46,0)","v":0},null,{"$f":"IF(SUM(DK$8:DK$11)>0,$E46*$H46,0)","v":0},null,{"$f":"IF(SUM(DM$8:DM$11)>0,$E46*$H46,0)","v":0},null,{"$f":"IF(SUM(DO$8:DO$11)>0,$E46*$H46,0)","v":0},null,{"$f":"IF(SUM(DQ$8:DQ$11)>0,$E46*$H46,0)","v":0},null,{"$f":"IF(SUM(DS$8:DS$11)>0,$E46*$H46,0)","v":0},null,{"$f":"IF(SUM(DU$8:DU$11)>0,$E46*$H46,0)","v":0},null,{"$f":"IF(SUM(DW$8:DW$11)>0,$E46*$H46,0)","v":0},null,{"$f":"IF(SUM(DY$8:DY$11)>0,$E46*$H46,0)","v":0}]
[null,null,null,null,null,{"$f":"F46","v":{"$error":"#N/A"}},{"$error":"#N/A"},null,null,null,null,{"$f":"IF(SUM(K$39:K$42)>0,$E47*$H47,0)","v":0},null,{"$f":"IF(SUM(M$39:M$42)>0,$E47*$H47,0)","v":0},null,{"$f":"IF(SUM(O$39:O$42)>0,$E47*$H47,0)","v":0},null,{"$f":"IF(SUM(Q$39:Q$42)>0,$E47*$H47,0)","v":0},null,{"$f":"IF(SUM(S$39:S$42)>0,$E47*$H47,0)","v":0},null,{"$f":"IF(SUM(U$39:U$42)>0,$E47*$H47,0)","v":0},null,{"$f":"IF(SUM(W$39:W$42)>0,$E47*$H47,0)","v":0},null,{"$f":"IF(SUM(Y$39:Y$42)>0,$E47*$H47,0)","v":0},null,{"$f":"IF(SUM(AA$39:AA$42)>0,$E47*$H47,0)","v":0},null,{"$f":"IF(SUM(AC$8:AC$11)>0,$E47*$H47,0)","v":0},null,{"$f":"IF(SUM(AE$8:AE$11)>0,$E47*$H47,0)","v":0},null,{"$f":"IF(SUM(AG$8:AG$11)>0,$E47*$H47,0)","v":0},null,{"$f":"IF(SUM(AI$8:AI$11)>0,$E47*$H47,0)","v":0},null,{"$f":"IF(SUM(AK$8:AK$11)>0,$E47*$H47,0)","v":0},null,{"$f":"IF(SUM(AM$8:AM$11)>0,$E47*$H47,0)","v":0},null,{"$f":"IF(SUM(AO$8:AO$11)>0,$E47*$H47,0)","v":0},null,{"$f":"IF(SUM(AQ$8:AQ$11)>0,$E47*$H47,0)","v":0},null,{"$f":"IF(SUM(AS$8:AS$11)>0,$E47*$H47,0)","v":0},null,{"$f":"IF(SUM(AU$8:AU$11)>0,$E47*$H47,0)","v":0},null,{"$f":"IF(SUM(AW$8:AW$11)>0,$E47*$H47,0)","v":0},null,{"$f":"IF(SUM(AY$8:AY$11)>0,$E47*$H47,0)","v":0},null,{"$f":"IF(SUM(BA$8:BA$11)>0,$E47*$H47,0)","v":0},null,{"$f":"IF(SUM(BC$8:BC$11)>0,$E47*$H47,0)","v":0},null,{"$f":"IF(SUM(BE$8:BE$11)>0,$E47*$H47,0)","v":0},null,{"$f":"IF(SUM(BG$8:BG$11)>0,$E47*$H47,0)","v":0},null,{"$f":"IF(SUM(BI$8:BI$11)>0,$E47*$H47,0)","v":0},null,{"$f":"IF(SUM(BK$8:BK$11)>0,$E47*$H47,0)","v":0},null,{"$f":"IF(SUM(BM$8:BM$11)>0,$E47*$H47,0)","v":0},null,{"$f":"IF(SUM(BO$8:BO$11)>0,$E47*$H47,0)","v":0},null,{"$f":"IF(SUM(BQ$8:BQ$11)>0,$E47*$H47,0)","v":0},null,{"$f":"IF(SUM(BS$8:BS$11)>0,$E47*$H47,0)","v":0},null,{"$f":"IF(SUM(BU$8:BU$11)>0,$E47*$H47,0)","v":0},null,{"$f":"IF(SUM(BW$8:BW$11)>0,$E47*$H47,0)","v":0},null,{"$f":"IF(SUM(BY$8:BY$11)>0,$E47*$H47,0)","v":0},null,{"$f":"IF(SUM(CA$8:CA$11)>0,$E47*$H47,0)","v":0},null,{"$f":"IF(SUM(CC$8:CC$11)>0,$E47*$H47,0)","v":0},null,{"$f":"IF(SUM(CE$8:CE$11)>0,$E47*$H47,0)","v":0},null,{"$f":"IF(SUM(CG$8:CG$11)>0,$E47*$H47,0)","v":0},null,{"$f":"IF(SUM(CI$8:CI$11)>0,$E47*$H47,0)","v":0},null,{"$f":"IF(SUM(CK$8:CK$11)>0,$E47*$H47,0)","v":0},null,{"$f":"IF(SUM(CM$8:CM$11)>0,$E47*$H47,0)","v":0},null,{"$f":"IF(SUM(CO$8:CO$11)>0,$E47*$H47,0)","v":0},null,{"$f":"IF(SUM(CQ$8:CQ$11)>0,$E47*$H47,0)","v":0},null,{"$f":"IF(SUM(CS$8:CS$11)>0,$E47*$H47,0)","v":0},null,{"$f":"IF(SUM(CU$8:CU$11)>0,$E47*$H47,0)","v":0},null,{"$f":"IF(SUM(CW$8:CW$11)>0,$E47*$H47,0)","v":0},null,{"$f":"IF(SUM(CY$8:CY$11)>0,$E47*$H47,0)","v":0},null,{"$f":"IF(SUM(DA$8:DA$11)>0,$E47*$H47,0)","v":0},null,{"$f":"IF(SUM(DC$8:DC$11)>0,$E47*$H47,0)","v":0},null,{"$f":"IF(SUM(DE$8:DE$11)>0,$E47*$H47,0)","v":0},null,{"$f":"IF(SUM(DG$8:DG$11)>0,$E47*$H47,0)","v":0},null,{"$f":"IF(SUM(DI$8:DI$11)>0,$E47*$H47,0)","v":0},null,{"$f":"IF(SUM(DK$8:DK$11)>0,$E47*$H47,0)","v":0},null,{"$f":"IF(SUM(DM$8:DM$11)>0,$E47*$H47,0)","v":0},null,{"$f":"IF(SUM(DO$8:DO$11)>0,$E47*$H47,0)","v":0},null,{"$f":"IF(SUM(DQ$8:DQ$11)>0,$E47*$H47,0)","v":0},null,{"$f":"IF(SUM(DS$8:DS$11)>0,$E47*$H47,0)","v":0},null,{"$f":"IF(SUM(DU$8:DU$11)>0,$E47*$H47,0)","v":0},null,{"$f":"IF(SUM(DW$8:DW$11)>0,$E47*$H47,0)","v":0},null,{"$f":"IF(SUM(DY$8:DY$11)>0,$E47*$H47,0)","v":0}]
[null,null,null,null,null,{"$error":"#N/A"},{"$error":"#N/A"},null,null,null,null,{"$f":"IF(SUM(K$39:K$42)>0,$E48*$H48,0)","v":0},null,{"$f":"IF(SUM(M$39:M$42)>0,$E48*$H48,0)","v":0},null,{"$f":"IF(SUM(O$39:O$42)>0,$E48*$H48,0)","v":0},null,{"$f":"IF(SUM(Q$39:Q$42)>0,$E48*$H48,0)","v":0},null,{"$f":"IF(SUM(S$39:S$42)>0,$E48*$H48,0)","v":0},null,{"$f":"IF(SUM(U$39:U$42)>0,$E48*$H48,0)","v":0},null,{"$f":"IF(SUM(W$39:W$42)>0,$E48*$H48,0)","v":0},null,{"$f":"IF(SUM(Y$39:Y$42)>0,$E48*$H48,0)","v":0},null,{"$f":"IF(SUM(AA$39:AA$42)>0,$E48*$H48,0)","v":0},null,{"$f":"IF(SUM(AC$8:AC$11)>0,$E48*$H48,0)","v":0},null,{"$f":"IF(SUM(AE$8:AE$11)>0,$E48*$H48,0)","v":0},null,{"$f":"IF(SUM(AG$8:AG$11)>0,$E48*$H48,0)","v":0},null,{"$f":"IF(SUM(AI$8:AI$11)>0,$E48*$H48,0)","v":0},null,{"$f":"IF(SUM(AK$8:AK$11)>0,$E48*$H48,0)","v":0},null,{"$f":"IF(SUM(AM$8:AM$11)>0,$E48*$H48,0)","v":0},null,{"$f":"IF(SUM(AO$8:AO$11)>0,$E48*$H48,0)","v":0},null,{"$f":"IF(SUM(AQ$8:AQ$11)>0,$E48*$H48,0)","v":0},null,{"$f":"IF(SUM(AS$8:AS$11)>0,$E48*$H48,0)","v":0},null,{"$f":"IF(SUM(AU$8:AU$11)>0,$E48*$H48,0)","v":0},null,{"$f":"IF(SUM(AW$8:AW$11)>0,$E48*$H48,0)","v":0},null,{"$f":"IF(SUM(AY$8:AY$11)>0,$E48*$H48,0)","v":0},null,{"$f":"IF(SUM(BA$8:BA$11)>0,$E48*$H48,0)","v":0},null,{"$f":"IF(SUM(BC$8:BC$11)>0,$E48*$H48,0)","v":0},null,{"$f":"IF(SUM(BE$8:BE$11)>0,$E48*$H48,0)","v":0},null,{"$f":"IF(SUM(BG$8:BG$11)>0,$E48*$H48,0)","v":0},null,{"$f":"IF(SUM(BI$8:BI$11)>0,$E48*$H48,0)","v":0},null,{"$f":"IF(SUM(BK$8:BK$11)>0,$E48*$H48,0)","v":0},null,{"$f":"IF(SUM(BM$8:BM$11)>0,$E48*$H48,0)","v":0},null,{"$f":"IF(SUM(BO$8:BO$11)>0,$E48*$H48,0)","v":0},null,{"$f":"IF(SUM(BQ$8:BQ$11)>0,$E48*$H48,0)","v":0},null,{"$f":"IF(SUM(BS$8:BS$11)>0,$E48*$H48,0)","v":0},null,{"$f":"IF(SUM(BU$8:BU$11)>0,$E48*$H48,0)","v":0},null,{"$f":"IF(SUM(BW$8:BW$11)>0,$E48*$H48,0)","v":0},null,{"$f":"IF(SUM(BY$8:BY$11)>0,$E48*$H48,0)","v":0},null,{"$f":"IF(SUM(CA$8:CA$11)>0,$E48*$H48,0)","v":0},null,{"$f":"IF(SUM(CC$8:CC$11)>0,$E48*$H48,0)","v":0},null,{"$f":"IF(SUM(CE$8:CE$11)>0,$E48*$H48,0)","v":0},null,{"$f":"IF(SUM(CG$8:CG$11)>0,$E48*$H48,0)","v":0},null,{"$f":"IF(SUM(CI$8:CI$11)>0,$E48*$H48,0)","v":0},null,{"$f":"IF(SUM(CK$8:CK$11)>0,$E48*$H48,0)","v":0},null,{"$f":"IF(SUM(CM$8:CM$11)>0,$E48*$H48,0)","v":0},null,{"$f":"IF(SUM(CO$8:CO$11)>0,$E48*$H48,0)","v":0},null,{"$f":"IF(SUM(CQ$8:CQ$11)>0,$E48*$H48,0)","v":0},null,{"$f":"IF(SUM(CS$8:CS$11)>0,$E48*$H48,0)","v":0},null,{"$f":"IF(SUM(CU$8:CU$11)>0,$E48*$H48,0)","v":0},null,{"$f":"IF(SUM(CW$8:CW$11)>0,$E48*$H48,0)","v":0},null,{"$f":"IF(SUM(CY$8:CY$11)>0,$E48*$H48,0)","v":0},null,{"$f":"IF(SUM(DA$8:DA$11)>0,$E48*$H48,0)","v":0},null,{"$f":"IF(SUM(DC$8:DC$11)>0,$E48*$H48,0)","v":0},null,{"$f":"IF(SUM(DE$8:DE$11)>0,$E48*$H48,0)","v":0},null,{"$f":"IF(SUM(DG$8:DG$11)>0,$E48*$H48,0)","v":0},null,{"$f":"IF(SUM(DI$8:DI$11)>0,$E48*$H48,0)","v":0},null,{"$f":"IF(SUM(DK$8:DK$11)>0,$E48*$H48,0)","v":0},null,{"$f":"IF(SUM(DM$8:DM$11)>0,$E48*$H48,0)","v":0},null,{"$f":"IF(SUM(DO$8:DO$11)>0,$E48*$H48,0)","v":0},null,{"$f":"IF(SUM(DQ$8:DQ$11)>0,$E48*$H48,0)","v":0},null,{"$f":"IF(SUM(DS$8:DS$11)>0,$E48*$H48,0)","v":0},null,{"$f":"IF(SUM(DU$8:DU$11)>0,$E48*$H48,0)","v":0},null,{"$f":"IF(SUM(DW$8:DW$11)>0,$E48*$H48,0)","v":0},null,{"$f":"IF(SUM(DY$8:DY$11)>0,$E48*$H48,0)","v":0}]
[]
[null,null,null,null,null,null,null,null,null,null,{"$f":"SUMPRODUCT(#REF!,#REF!)","v":{"$error":"#REF!"}}]
[null,null,null,null,null,null,null,null,null,null,{"$f":"K50*($H$9+#REF!)","v":{"$error":"#REF!"}}]
[null,null,null,null,null,null,null,null,null,null,{"$f":"K51/12","v":{"$error":"#REF!"}}]
[null,null,null,null,null,null,null,null,null,null,{"$f":"K52/91","v":{"$error":"#REF!"}}]

{"sheet":"EPI","index":13,"n_rows":42,"n_cols":128,"rows_kept":42,"cut":false,"hidden":true,"merged":[[2,1,2,3],[3,1,3,5]]}
[]
[]
[]
[null,"EQUIPAMENTOS DE PROTEÇÃO INDIVIDUAL - AQUISIÇÃO",null,null,null,null,null,null,1,null,{"$f":"I4+1","v":2},null,{"$f":"K4+1","v":3},null,{"$f":"M4+1","v":4},null,{"$f":"O4+1","v":5},null,{"$f":"Q4+1","v":6},null,{"$f":"S4+1","v":7},null,{"$f":"U4+1","v":8},null,{"$f":"W4+1","v":9},null,{"$f":"Y4+1","v":10},null,{"$f":"AA4+1","v":11},null,{"$f":"AC4+1","v":12},null,{"$f":"AE4+1","v":13},null,{"$f":"AG4+1","v":14},null,{"$f":"AI4+1","v":15},null,{"$f":"AK4+1","v":16},null,{"$f":"AM4+1","v":17},null,{"$f":"AO4+1","v":18},null,{"$f":"AQ4+1","v":19},null,{"$f":"AS4+1","v":20},null,{"$f":"AU4+1","v":21},null,{"$f":"AW4+1","v":22},null,{"$f":"AY4+1","v":23},null,{"$f":"BA4+1","v":24},null,{"$f":"BC4+1","v":25},null,{"$f":"BE4+1","v":26},null,{"$f":"BG4+1","v":27},null,{"$f":"BI4+1","v":28},null,{"$f":"BK4+1","v":29},null,{"$f":"BM4+1","v":30},null,{"$f":"BO4+1","v":31},null,{"$f":"BQ4+1","v":32},null,{"$f":"BS4+1","v":33},null,{"$f":"BU4+1","v":34},null,{"$f":"BW4+1","v":35},null,{"$f":"BY4+1","v":36},null,{"$f":"CA4+1","v":37},null,{"$f":"CC4+1","v":38},null,{"$f":"CE4+1","v":39},null,{"$f":"CG4+1","v":40},null,{"$f":"CI4+1","v":41},null,{"$f":"CK4+1","v":42},null,{"$f":"CM4+1","v":43},null,{"$f":"CO4+1","v":44},null,{"$f":"CQ4+1","v":45},null,{"$f":"CS4+1","v":46},null,{"$f":"CU4+1","v":47},null,{"$f":"CW4+1","v":48},null,{"$f":"CY4+1","v":49},null,{"$f":"DA4+1","v":50},null,{"$f":"DC4+1","v":51},null,{"$f":"DE4+1","v":52},null,{"$f":"DG4+1","v":53},null,{"$f":"DI4+1","v":54},null,{"$f":"DK4+1","v":55},null,{"$f":"DM4+1","v":56},null,{"$f":"DO4+1","v":57},null,{"$f":"DQ4+1","v":58},null,{"$f":"DS4+1","v":59},null,{"$f":"DU4+1","v":60}]
[]
[null,null,null,null,null,null,null,null,{"$f":"ROUND(SUM(J5:J76),2)","v":0},null,{"$f":"ROUND(SUM(L5:L76),2)","v":0},null,{"$f":"ROUND(SUM(N5:N76),2)","v":0},null,{"$f":"ROUND(SUM(P5:P76),2)","v":0},null,{"$f":"ROUND(SUM(R5:R76),2)","v":0},null,{"$f":"ROUND(SUM(T5:T76),2)","v":0},null,{"$f":"ROUND(SUM(V5:V76),2)","v":0},null,{"$f":"ROUND(SUM(X5:X76),2)","v":0},null,{"$f":"ROUND(SUM(Z5:Z76),2)","v":0},null,{"$f":"ROUND(SUM(AB5:AB76),2)","v":0},null,{"$f":"ROUND(SUM(AD5:AD76),2)","v":0},null,{"$f":"ROUND(SUM(AF5:AF76),2)","v":0},null,{"$f":"ROUND(SUM(AH5:AH76),2)","v":0},null,{"$f":"ROUND(SUM(AJ5:AJ76),2)","v":0},null,{"$f":"ROUND(SUM(AL5:AL76),2)","v":0},null,{"$f":"ROUND(SUM(AN5:AN76),2)","v":0},null,{"$f":"ROUND(SUM(AP5:AP76),2)","v":0},null,{"$f":"ROUND(SUM(AR5:AR76),2)","v":0},null,{"$f":"ROUND(SUM(AT5:AT76),2)","v":0},null,{"$f":"ROUND(SUM(AV5:AV76),2)","v":0},null,{"$f":"ROUND(SUM(AX5:AX76),2)","v":0},null,{"$f":"ROUND(SUM(AZ5:AZ76),2)","v":0},null,{"$f":"ROUND(SUM(BB5:BB76),2)","v":0},null,{"$f":"ROUND(SUM(BD5:BD76),2)","v":0},null,{"$f":"ROUND(SUM(BF5:BF76),2)","v":0},null,{"$f":"ROUND(SUM(BH5:BH76),2)","v":0},null,{"$f":"ROUND(SUM(BJ5:BJ76),2)","v":0},null,{"$f":"ROUND(SUM(BL5:BL76),2)","v":0},null,{"$f":"ROUND(SUM(BN5:BN76),2)","v":0},null,{"$f":"ROUND(SUM(BP5:BP76),2)","v":0},null,{"$f":"ROUND(SUM(BR5:BR76),2)","v":0},null,{"$f":"ROUND(SUM(BT5:BT76),2)","v":0},null,{"$f":"ROUND(SUM(BV5:BV76),2)","v":0},null,{"$f":"ROUND(SUM(BX5:BX76),2)","v":0},null,{"$f":"ROUND(SUM(BZ5:BZ76),2)","v":0},null,{"$f":"ROUND(SUM(CB5:CB76),2)","v":0},null,{"$f":"ROUND(SUM(CD5:CD76),2)","v":0},null,{"$f":"ROUND(SUM(CF5:CF76),2)","v":0},null,{"$f":"ROUND(SUM(CH5:CH76),2)","v":0},null,{"$f":"ROUND(SUM(CJ5:CJ76),2)","v":0},null,{"$f":"ROUND(SUM(CL5:CL76),2)","v":0},null,{"$f":"ROUND(SUM(CN5:CN76),2)","v":0},null,{"$f":"ROUND(SUM(CP5:CP76),2)","v":0},null,{"$f":"ROUND(SUM(CR5:CR76),2)","v":0},null,{"$f":"ROUND(SUM(CT5:CT76),2)","v":0},null,{"$f":"ROUND(SUM(CV5:CV76),2)","v":0},null,{"$f":"ROUND(SUM(CX5:CX76),2)","v":0},null,{"$f":"ROUND(SUM(CZ5:CZ76),2)","v":0},null,{"$f":"ROUND(SUM(DB5:DB76),2)","v":0},null,{"$f":"ROUND(SUM(DD5:DD76),2)","v":0},null,{"$f":"ROUND(SUM(DF5:DF76),2)","v":0},null,{"$f":"ROUND(SUM(DH5:DH76),2)","v":0},null,{"$f":"ROUND(SUM(DJ5:DJ76),2)","v":0},null,{"$f":"ROUND(SUM(DL5:DL76),2)","v":0},null,{"$f":"ROUND(SUM(DN5:DN76),2)","v":0},null,{"$f":"ROUND(SUM(DP5:DP76),2)","v":0},null,{"$f":"ROUND(SUM(DR5:DR76),2)","v":0},null,{"$f":"ROUND(SUM(DT5:DT76),2)","v":0},null,{"$f":"ROUND(SUM(DV5:DV76),2)","v":0},null,{"$f":"ROUND(SUM(DX5:DX76),2)","v":0}]
[null,null,"CATEGORIAS",null,null,"QUANTIDADE"]
[null,null,null,null,null,null,null,null,{"$f":"IF($C8=I$4,1,0)","v":0}]
[null,null,null,{"$f":"HLOOKUP($C9,'Dados Gerais'!$D$5:$BJ$10,6)","v":{"$error":"#N/A"}},null,{"$f":"HLOOKUP($C9,'Dados Gerais'!$D$5:$BJ$14,10)","v":{"$error":"#N/A"}},null,null,{"$f":"IF($C9=I$4,1,0)","v":0},null,{"$f":"IF($C9=K$4,1,0)","v":0},null,{"$f":"IF($C9=M$4,1,0)","v":0},null,{"$f":"IF($C9=O$4,1,0)","v":0},null,{"$f":"IF($C9=Q$4,1,0)","v":0},null,{"$f":"IF($C9=S$4,1,0)","v":0},null,{"$f":"IF($C9=U$4,1,0)","v":0},null,{"$f":"IF($C9=W$4,1,0)","v":0},null,{"$f":"IF($C9=Y$4,1,0)","v":0},null,{"$f":"IF($C9=AA$4,1,0)","v":0},null,{"$f":"IF($C9=AC$4,1,0)","v":0},null,{"$f":"IF($C9=AE$4,1,0)","v":0},null,{"$f":"IF($C9=AG$4,1,0)","v":0},null,{"$f":"IF($C9=AI$4,1,0)","v":0},null,{"$f":"IF($C9=AK$4,1,0)","v":0},null,{"$f":"IF($C9=AM$4,1,0)","v":0},null,{"$f":"IF($C9=AO$4,1,0)","v":0},null,{"$f":"IF($C9=AQ$4,1,0)","v":0},null,{"$f":"IF($C9=AS$4,1,0)","v":0},null,{"$f":"IF($C9=AU$4,1,0)","v":0},null,{"$f":"IF($C9=AW$4,1,0)","v":0},null,{"$f":"IF($C9=AY$4,1,0)","v":0},null,{"$f":"IF($C9=BA$4,1,0)","v":0},null,{"$f":"IF($C9=BC$4,1,0)","v":0},null,{"$f":"IF($C9=BE$4,1,0)","v":0},null,{"$f":"IF($C9=BG$4,1,0)","v":0},null,{"$f":"IF($C9=BI$4,1,0)","v":0},null,{"$f":"IF($C9=BK$4,1,0)","v":0},null,{"$f":"IF($C9=BM$4,1,0)","v":0},null,{"$f":"IF($C9=BO$4,1,0)","v":0},null,{"$f":"IF($C9=BQ$4,1,0)","v":0},null,{"$f":"IF($C9=BS$4,1,0)","v":0},null,{"$f":"IF($C9=BU$4,1,0)","v":0},null,{"$f":"IF($C9=BW$4,1,0)","v":0},null,{"$f":"IF($C9=BY$4,1,0)","v":0},null,{"$f":"IF($C9=CA$4,1,0)","v":0},null,{"$f":"IF($C9=CC$4,1,0)","v":0},null,{"$f":"IF($C9=CE$4,1,0)","v":0},null,{"$f":"IF($C9=CG$4,1,0)","v":0},null,{"$f":"IF($C9=CI$4,1,0)","v":0},null,{"$f":"IF($C9=CK$4,1,0)","v":0},null,{"$f":"IF($C9=CM$4,1,0)","v":0},null,{"$f":"IF($C9=CO$4,1,0)","v":0},null,{"$f":"IF($C9=CQ$4,1,0)","v":0},null,{"$f":"IF($C9=CS$4,1,0)","v":0},null,{"$f":"IF($C9=CU$4,1,0)","v":0},null,{"$f":"IF($C9=CW$4,1,0)","v":0},null,{"$f":"IF($C9=CY$4,1,0)","v":0},null,{"$f":"IF($C9=DA$4,1,0)","v":0},null,{"$f":"IF($C9=DC$4,1,0)","v":0},null,{"$f":"IF($C9=DE$4,1,0)","v":0},null,{"$f":"IF($C9=DG$4,1,0)","v":0},null,{"$f":"IF($C9=DI$4,1,0)","v":0},null,{"$f":"IF($C9=DK$4,1,0)","v":0},null,{"$f":"IF($C9=DM$4,1,0)","v":0},null,{"$f":"IF($C9=DO$4,1,0)","v":0},null,{"$f":"IF($C9=DQ$4,1,0)","v":0},null,{"$f":"IF($C9=DS$4,1,0)","v":0},null,{"$f":"IF($C9=DU$4,1,0)","v":0},null,{"$f":"IF($C9=DW$4,1,0)","v":0}]
[null,null,null,{"$f":"HLOOKUP($C10,'Dados Gerais'!$D$5:$BJ$10,6)","v":{"$error":"#N/A"}},null,{"$f":"HLOOKUP($C10,'Dados Gerais'!$D$5:$BJ$14,10)","v":{"$error":"#N/A"}},null,null,{"$f":"IF($C10=I$4,1,0)","v":0},null,{"$f":"IF($C10=K$4,1,0)","v":0},null,{"$f":"IF($C10=M$4,1,0)","v":0},null,{"$f":"IF($C10=O$4,1,0)","v":0},null,{"$f":"IF($C10=Q$4,1,0)","v":0},null,{"$f":"IF($C10=S$4,1,0)","v":0},null,{"$f":"IF($C10=U$4,1,0)","v":0},null,{"$f":"IF($C10=W$4,1,0)","v":0},null,{"$f":"IF($C10=Y$4,1,0)","v":0},null,{"$f":"IF($C10=AA$4,1,0)","v":0},null,{"$f":"IF($C10=AC$4,1,0)","v":0},null,{"$f":"IF($C10=AE$4,1,0)","v":0},null,{"$f":"IF($C10=AG$4,1,0)","v":0},null,{"$f":"IF($C10=AI$4,1,0)","v":0},null,{"$f":"IF($C10=AK$4,1,0)","v":0},null,{"$f":"IF($C10=AM$4,1,0)","v":0},null,{"$f":"IF($C10=AO$4,1,0)","v":0},null,{"$f":"IF($C10=AQ$4,1,0)","v":0},null,{"$f":"IF($C10=AS$4,1,0)","v":0},null,{"$f":"IF($C10=AU$4,1,0)","v":0},null,{"$f":"IF($C10=AW$4,1,0)","v":0},null,{"$f":"IF($C10=AY$4,1,0)","v":0},null,{"$f":"IF($C10=BA$4,1,0)","v":0},null,{"$f":"IF($C10=BC$4,1,0)","v":0},null,{"$f":"IF($C10=BE$4,1,0)","v":0},null,{"$f":"IF($C10=BG$4,1,0)","v":0},null,{"$f":"IF($C10=BI$4,1,0)","v":0},null,{"$f":"IF($C10=BK$4,1,0)","v":0},null,{"$f":"IF($C10=BM$4,1,0)","v":0},null,{"$f":"IF($C10=BO$4,1,0)","v":0},null,{"$f":"IF($C10=BQ$4,1,0)","v":0},null,{"$f":"IF($C10=BS$4,1,0)","v":0},null,{"$f":"IF($C10=BU$4,1,0)","v":0},null,{"$f":"IF($C10=BW$4,1,0)","v":0},null,{"$f":"IF($C10=BY$4,1,0)","v":0},null,{"$f":"IF($C10=CA$4,1,0)","v":0},null,{"$f":"IF($C10=CC$4,1,0)","v":0},null,{"$f":"IF($C10=CE$4,1,0)","v":0},null,{"$f":"IF($C10=CG$4,1,0)","v":0},null,{"$f":"IF($C10=CI$4,1,0)","v":0},null,{"$f":"IF($C10=CK$4,1,0)","v":0},null,{"$f":"IF($C10=CM$4,1,0)","v":0},null,{"$f":"IF($C10=CO$4,1,0)","v":0},null,{"$f":"IF($C10=CQ$4,1,0)","v":0},null,{"$f":"IF($C10=CS$4,1,0)","v":0},null,{"$f":"IF($C10=CU$4,1,0)","v":0},null,{"$f":"IF($C10=CW$4,1,0)","v":0},null,{"$f":"IF($C10=CY$4,1,0)","v":0},null,{"$f":"IF($C10=DA$4,1,0)","v":0},null,{"$f":"IF($C10=DC$4,1,0)","v":0},null,{"$f":"IF($C10=DE$4,1,0)","v":0},null,{"$f":"IF($C10=DG$4,1,0)","v":0},null,{"$f":"IF($C10=DI$4,1,0)","v":0},null,{"$f":"IF($C10=DK$4,1,0)","v":0},null,{"$f":"IF($C10=DM$4,1,0)","v":0},null,{"$f":"IF($C10=DO$4,1,0)","v":0},null,{"$f":"IF($C10=DQ$4,1,0)","v":0},null,{"$f":"IF($C10=DS$4,1,0)","v":0},null,{"$f":"IF($C10=DU$4,1,0)","v":0},null,{"$f":"IF($C10=DW$4,1,0)","v":0}]
[null,null,null,null,null,null,null,null,{"$f":"IF($C11=I$4,1,0)","v":0}]
[]
[null,null,"ITEM","DESCRIÇÃO","QUANT ANUAL POR POSTO","VALOR"]
[null,null,null,null,null,null,null,null,null,{"$f":"IF(SUM(I$8:I$11)>0,$E14*$F14,0)","v":0},null,{"$f":"IF(SUM(K$8:K$11)>0,$E14*$F14,0)","v":0},null,{"$f":"IF(SUM(M$8:M$11)>0,$E14*$F14,0)","v":0},null,{"$f":"IF(SUM(O$8:O$11)>0,$E14*$F14,0)","v":0},null,{"$f":"IF(SUM(Q$8:Q$11)>0,$E14*$F14,0)","v":0},null,{"$f":"IF(SUM(S$8:S$11)>0,$E14*$F14,0)","v":0},null,{"$f":"IF(SUM(U$8:U$11)>0,$E14*$F14,0)","v":0},null,{"$f":"IF(SUM(W$8:W$11)>0,$E14*$F14,0)","v":0},null,{"$f":"IF(SUM(Y$8:Y$11)>0,$E14*$F14,0)","v":0},null,{"$f":"IF(SUM(AA$8:AA$11)>0,$E14*$F14,0)","v":0},null,{"$f":"IF(SUM(AC$8:AC$11)>0,$E14*$F14,0)","v":0},null,{"$f":"IF(SUM(AE$8:AE$11)>0,$E14*$F14,0)","v":0},null,{"$f":"IF(SUM(AG$8:AG$11)>0,$E14*$F14,0)","v":0},null,{"$f":"IF(SUM(AI$8:AI$11)>0,$E14*$F14,0)","v":0},null,{"$f":"IF(SUM(AK$8:AK$11)>0,$E14*$F14,0)","v":0},null,{"$f":"IF(SUM(AM$8:AM$11)>0,$E14*$F14,0)","v":0},null,{"$f":"IF(SUM(AO$8:AO$11)>0,$E14*$F14,0)","v":0},null,{"$f":"IF(SUM(AQ$8:AQ$11)>0,$E14*$F14,0)","v":0},null,{"$f":"IF(SUM(AS$8:AS$11)>0,$E14*$F14,0)","v":0},null,{"$f":"IF(SUM(AU$8:AU$11)>0,$E14*$F14,0)","v":0},null,{"$f":"IF(SUM(AW$8:AW$11)>0,$E14*$F14,0)","v":0},null,{"$f":"IF(SUM(AY$8:AY$11)>0,$E14*$F14,0)","v":0},null,{"$f":"IF(SUM(BA$8:BA$11)>0,$E14*$F14,0)","v":0},null,{"$f":"IF(SUM(BC$8:BC$11)>0,$E14*$F14,0)","v":0},null,{"$f":"IF(SUM(BE$8:BE$11)>0,$E14*$F14,0)","v":0},null,{"$f":"IF(SUM(BG$8:BG$11)>0,$E14*$F14,0)","v":0},null,{"$f":"IF(SUM(BI$8:BI$11)>0,$E14*$F14,0)","v":0},null,{"$f":"IF(SUM(BK$8:BK$11)>0,$E14*$F14,0)","v":0},null,{"$f":"IF(SUM(BM$8:BM$11)>0,$E14*$F14,0)","v":0},null,{"$f":"IF(SUM(BO$8:BO$11)>0,$E14*$F14,0)","v":0},null,{"$f":"IF(SUM(BQ$8:BQ$11)>0,$E14*$F14,0)","v":0},null,{"$f":"IF(SUM(BS$8:BS$11)>0,$E14*$F14,0)","v":0},null,{"$f":"IF(SUM(BU$8:BU$11)>0,$E14*$F14,0)","v":0},null,{"$f":"IF(SUM(BW$8:BW$11)>0,$E14*$F14,0)","v":0},null,{"$f":"IF(SUM(BY$8:BY$11)>0,$E14*$F14,0)","v":0},null,{"$f":"IF(SUM(CA$8:CA$11)>0,$E14*$F14,0)","v":0},null,{"$f":"IF(SUM(CC$8:CC$11)>0,$E14*$F14,0)","v":0},null,{"$f":"IF(SUM(CE$8:CE$11)>0,$E14*$F14,0)","v":0},null,{"$f":"IF(SUM(CG$8:CG$11)>0,$E14*$F14,0)","v":0},null,{"$f":"IF(SUM(CI$8:CI$11)>0,$E14*$F14,0)","v":0},null,{"$f":"IF(SUM(CK$8:CK$11)>0,$E14*$F14,0)","v":0},null,{"$f":"IF(SUM(CM$8:CM$11)>0,$E14*$F14,0)","v":0},null,{"$f":"IF(SUM(CO$8:CO$11)>0,$E14*$F14,0)","v":0},null,{"$f":"IF(SUM(CQ$8:CQ$11)>0,$E14*$F14,0)","v":0},null,{"$f":"IF(SUM(CS$8:CS$11)>0,$E14*$F14,0)","v":0},null,{"$f":"IF(SUM(CU$8:CU$11)>0,$E14*$F14,0)","v":0},null,{"$f":"IF(SUM(CW$8:CW$11)>0,$E14*$F14,0)","v":0},null,{"$f":"IF(SUM(CY$8:CY$11)>0,$E14*$F14,0)","v":0},null,{"$f":"IF(SUM(DA$8:DA$11)>0,$E14*$F14,0)","v":0},null,{"$f":"IF(SUM(DC$8:DC$11)>0,$E14*$F14,0)","v":0},null,{"$f":"IF(SUM(DE$8:DE$11)>0,$E14*$F14,0)","v":0},null,{"$f":"IF(SUM(DG$8:DG$11)>0,$E14*$F14,0)","v":0},null,{"$f":"IF(SUM(DI$8:DI$11)>0,$E14*$F14,0)","v":0},null,{"$f":"IF(SUM(DK$8:DK$11)>0,$E14*$F14,0)","v":0},null,{"$f":"IF(SUM(DM$8:DM$11)>0,$E14*$F14,0)","v":0},null,{"$f":"IF(SUM(DO$8:DO$11)>0,$E14*$F14,0)","v":0},null,{"$f":"IF(SUM(DQ$8:DQ$11)>0,$E14*$F14,0)","v":0},null,{"$f":"IF(SUM(DS$8:DS$11)>0,$E14*$F14,0)","v":0},null,{"$f":"IF(SUM(DU$8:DU$11)>0,$E14*$F14,0)","v":0},null,{"$f":"IF(SUM(DW$8:DW$11)>0,$E14*$F14,0)","v":0}]
[null,null,1,"Calçado de segurança tipo sapato com resistência a objetos pontiagudos, fechamento em elástico, couro preto, forração em tecido, bico de composite, palmilha de montagem têxtil resistente à perfuração, solado de PU (poliuretano), bidensidade sem cadarço. Ref. MARLUVAS.",null,null,null,null,null,{"$f":"IF(SUM(I$8:I$11)>0,$E15*$F15,0)","v":0},null,{"$f":"IF(SUM(K$8:K$11)>0,$E15*$F15,0)","v":0},null,{"$f":"IF(SUM(M$8:M$11)>0,$E15*$F15,0)","v":0},null,{"$f":"IF(SUM(O$8:O$11)>0,$E15*$F15,0)","v":0},null,{"$f":"IF(SUM(Q$8:Q$11)>0,$E15*$F15,0)","v":0},null,{"$f":"IF(SUM(S$8:S$11)>0,$E15*$F15,0)","v":0},null,{"$f":"IF(SUM(U$8:U$11)>0,$E15*$F15,0)","v":0},null,{"$f":"IF(SUM(W$8:W$11)>0,$E15*$F15,0)","v":0},null,{"$f":"IF(SUM(Y$8:Y$11)>0,$E15*$F15,0)","v":0},null,{"$f":"IF(SUM(AA$8:AA$11)>0,$E15*$F15,0)","v":0},null,{"$f":"IF(SUM(AC$8:AC$11)>0,$E15*$F15,0)","v":0},null,{"$f":"IF(SUM(AE$8:AE$11)>0,$E15*$F15,0)","v":0},null,{"$f":"IF(SUM(AG$8:AG$11)>0,$E15*$F15,0)","v":0},null,{"$f":"IF(SUM(AI$8:AI$11)>0,$E15*$F15,0)","v":0},null,{"$f":"IF(SUM(AK$8:AK$11)>0,$E15*$F15,0)","v":0},null,{"$f":"IF(SUM(AM$8:AM$11)>0,$E15*$F15,0)","v":0},null,{"$f":"IF(SUM(AO$8:AO$11)>0,$E15*$F15,0)","v":0},null,{"$f":"IF(SUM(AQ$8:AQ$11)>0,$E15*$F15,0)","v":0},null,{"$f":"IF(SUM(AS$8:AS$11)>0,$E15*$F15,0)","v":0},null,{"$f":"IF(SUM(AU$8:AU$11)>0,$E15*$F15,0)","v":0},null,{"$f":"IF(SUM(AW$8:AW$11)>0,$E15*$F15,0)","v":0},null,{"$f":"IF(SUM(AY$8:AY$11)>0,$E15*$F15,0)","v":0},null,{"$f":"IF(SUM(BA$8:BA$11)>0,$E15*$F15,0)","v":0},null,{"$f":"IF(SUM(BC$8:BC$11)>0,$E15*$F15,0)","v":0},null,{"$f":"IF(SUM(BE$8:BE$11)>0,$E15*$F15,0)","v":0},null,{"$f":"IF(SUM(BG$8:BG$11)>0,$E15*$F15,0)","v":0},null,{"$f":"IF(SUM(BI$8:BI$11)>0,$E15*$F15,0)","v":0},null,{"$f":"IF(SUM(BK$8:BK$11)>0,$E15*$F15,0)","v":0},null,{"$f":"IF(SUM(BM$8:BM$11)>0,$E15*$F15,0)","v":0},null,{"$f":"IF(SUM(BO$8:BO$11)>0,$E15*$F15,0)","v":0},null,{"$f":"IF(SUM(BQ$8:BQ$11)>0,$E15*$F15,0)","v":0},null,{"$f":"IF(SUM(BS$8:BS$11)>0,$E15*$F15,0)","v":0},null,{"$f":"IF(SUM(BU$8:BU$11)>0,$E15*$F15,0)","v":0},null,{"$f":"IF(SUM(BW$8:BW$11)>0,$E15*$F15,0)","v":0},null,{"$f":"IF(SUM(BY$8:BY$11)>0,$E15*$F15,0)","v":0},null,{"$f":"IF(SUM(CA$8:CA$11)>0,$E15*$F15,0)","v":0},null,{"$f":"IF(SUM(CC$8:CC$11)>0,$E15*$F15,0)","v":0},null,{"$f":"IF(SUM(CE$8:CE$11)>0,$E15*$F15,0)","v":0},null,{"$f":"IF(SUM(CG$8:CG$11)>0,$E15*$F15,0)","v":0},null,{"$f":"IF(SUM(CI$8:CI$11)>0,$E15*$F15,0)","v":0},null,{"$f":"IF(SUM(CK$8:CK$11)>0,$E15*$F15,0)","v":0},null,{"$f":"IF(SUM(CM$8:CM$11)>0,$E15*$F15,0)","v":0},null,{"$f":"IF(SUM(CO$8:CO$11)>0,$E15*$F15,0)","v":0},null,{"$f":"IF(SUM(CQ$8:CQ$11)>0,$E15*$F15,0)","v":0},null,{"$f":"IF(SUM(CS$8:CS$11)>0,$E15*$F15,0)","v":0},null,{"$f":"IF(SUM(CU$8:CU$11)>0,$E15*$F15,0)","v":0},null,{"$f":"IF(SUM(CW$8:CW$11)>0,$E15*$F15,0)","v":0},null,{"$f":"IF(SUM(CY$8:CY$11)>0,$E15*$F15,0)","v":0},null,{"$f":"IF(SUM(DA$8:DA$11)>0,$E15*$F15,0)","v":0},null,{"$f":"IF(SUM(DC$8:DC$11)>0,$E15*$F15,0)","v":0},null,{"$f":"IF(SUM(DE$8:DE$11)>0,$E15*$F15,0)","v":0},null,{"$f":"IF(SUM(DG$8:DG$11)>0,$E15*$F15,0)","v":0},null,{"$f":"IF(SUM(DI$8:DI$11)>0,$E15*$F15,0)","v":0},null,{"$f":"IF(SUM(DK$8:DK$11)>0,$E15*$F15,0)","v":0},null,{"$f":"IF(SUM(DM$8:DM$11)>0,$E15*$F15,0)","v":0},null,{"$f":"IF(SUM(DO$8:DO$11)>0,$E15*$F15,0)","v":0},null,{"$f":"IF(SUM(DQ$8:DQ$11)>0,$E15*$F15,0)","v":0},null,{"$f":"IF(SUM(DS$8:DS$11)>0,$E15*$F15,0)","v":0},null,{"$f":"IF(SUM(DU$8:DU$11)>0,$E15*$F15,0)","v":0},null,{"$f":"IF(SUM(DW$8:DW$11)>0,$E15*$F15,0)","v":0}]
[null,null,2,"Respirador purificador de ar tipo, peça semifacial filtrante para partículas (PFF2), com formato dobrável, solda ultra-sônica em todo o seu perímetro. Fita elástica branca fixada nas laterais externas do respirador, perfazendo uma alça na para fixação na parte superior da cabeça e a outra na parte inferior, para fixação na altura da nuca do usuário. A parte superior externa da peça possui tira de material metálico moldável, utilizada para ajuste no septo nasal. Com válvula de exalação. DEVERÁ APRESENTAR O SELO DE APROVAÇÃO DO INMETRO. Ref. 3M. \nObs.: enquanto durarem os efeitos da pandemia da Covid-19 as máscaras devem ser fornecidas SEM a válvula de exalação",null,null,null,null,null,{"$f":"IF(SUM(I$19:I$22)>0,$E16*$F16,0)","v":0},null,{"$f":"IF(SUM(K$19:K$22)>0,$E16*$F16,0)","v":0},null,{"$f":"IF(SUM(M$19:M$22)>0,$E16*$F16,0)","v":0},null,{"$f":"IF(SUM(O$19:O$22)>0,$E16*$F16,0)","v":0},null,{"$f":"IF(SUM(Q$19:Q$22)>0,$E16*$F16,0)","v":0},null,{"$f":"IF(SUM(S$19:S$22)>0,$E16*$F16,0)","v":0},null,{"$f":"IF(SUM(U$19:U$22)>0,$E16*$F16,0)","v":0},null,{"$f":"IF(SUM(W$19:W$22)>0,$E16*$F16,0)","v":0},null,{"$f":"IF(SUM(Y$19:Y$22)>0,$E16*$F16,0)","v":0},null,{"$f":"IF(SUM(AA$19:AA$22)>0,$E16*$F16,0)","v":0},null,{"$f":"IF(SUM(AC$19:AC$22)>0,$E16*$F16,0)","v":0},null,{"$f":"IF(SUM(AE$19:AE$22)>0,$E16*$F16,0)","v":0},null,{"$f":"IF(SUM(AG$19:AG$22)>0,$E16*$F16,0)","v":0},null,{"$f":"IF(SUM(AI$19:AI$22)>0,$E16*$F16,0)","v":0},null,{"$f":"IF(SUM(AK$19:AK$22)>0,$E16*$F16,0)","v":0},null,{"$f":"IF(SUM(AM$19:AM$22)>0,$E16*$F16,0)","v":0},null,{"$f":"IF(SUM(AO$19:AO$22)>0,$E16*$F16,0)","v":0},null,{"$f":"IF(SUM(AQ$19:AQ$22)>0,$E16*$F16,0)","v":0},null,{"$f":"IF(SUM(AS$19:AS$22)>0,$E16*$F16,0)","v":0},null,{"$f":"IF(SUM(AU$19:AU$22)>0,$E16*$F16,0)","v":0},null,{"$f":"IF(SUM(AW$19:AW$22)>0,$E16*$F16,0)","v":0},null,{"$f":"IF(SUM(AY$19:AY$22)>0,$E16*$F16,0)","v":0},null,{"$f":"IF(SUM(BA$19:BA$22)>0,$E16*$F16,0)","v":0},null,{"$f":"IF(SUM(BC$19:BC$22)>0,$E16*$F16,0)","v":0},null,{"$f":"IF(SUM(BE$19:BE$22)>0,$E16*$F16,0)","v":0},null,{"$f":"IF(SUM(BG$19:BG$22)>0,$E16*$F16,0)","v":0},null,{"$f":"IF(SUM(BI$19:BI$22)>0,$E16*$F16,0)","v":0},null,{"$f":"IF(SUM(BK$19:BK$22)>0,$E16*$F16,0)","v":0},null,{"$f":"IF(SUM(BM$19:BM$22)>0,$E16*$F16,0)","v":0},null,{"$f":"IF(SUM(BO$19:BO$22)>0,$E16*$F16,0)","v":0},null,{"$f":"IF(SUM(BQ$19:BQ$22)>0,$E16*$F16,0)","v":0},null,{"$f":"IF(SUM(BS$19:BS$22)>0,$E16*$F16,0)","v":0},null,{"$f":"IF(SUM(BU$19:BU$22)>0,$E16*$F16,0)","v":0},null,{"$f":"IF(SUM(BW$19:BW$22)>0,$E16*$F16,0)","v":0},null,{"$f":"IF(SUM(BY$19:BY$22)>0,$E16*$F16,0)","v":0},null,{"$f":"IF(SUM(CA$19:CA$22)>0,$E16*$F16,0)","v":0},null,{"$f":"IF(SUM(CC$19:CC$22)>0,$E16*$F16,0)","v":0},null,{"$f":"IF(SUM(CE$19:CE$22)>0,$E16*$F16,0)","v":0},null,{"$f":"IF(SUM(CG$19:CG$22)>0,$E16*$F16,0)","v":0},null,{"$f":"IF(SUM(CI$19:CI$22)>0,$E16*$F16,0)","v":0},null,{"$f":"IF(SUM(CK$19:CK$22)>0,$E16*$F16,0)","v":0},null,{"$f":"IF(SUM(CM$19:CM$22)>0,$E16*$F16,0)","v":0},null,{"$f":"IF(SUM(CO$19:CO$22)>0,$E16*$F16,0)","v":0},null,{"$f":"IF(SUM(CQ$19:CQ$22)>0,$E16*$F16,0)","v":0},null,{"$f":"IF(SUM(CS$19:CS$22)>0,$E16*$F16,0)","v":0},null,{"$f":"IF(SUM(CU$19:CU$22)>0,$E16*$F16,0)","v":0},null,{"$f":"IF(SUM(CW$19:CW$22)>0,$E16*$F16,0)","v":0},null,{"$f":"IF(SUM(CY$19:CY$22)>0,$E16*$F16,0)","v":0},null,{"$f":"IF(SUM(DA$19:DA$22)>0,$E16*$F16,0)","v":0},null,{"$f":"IF(SUM(DC$19:DC$22)>0,$E16*$F16,0)","v":0},null,{"$f":"IF(SUM(DE$19:DE$22)>0,$E16*$F16,0)","v":0},null,{"$f":"IF(SUM(DG$19:DG$22)>0,$E16*$F16,0)","v":0},null,{"$f":"IF(SUM(DI$19:DI$22)>0,$E16*$F16,0)","v":0},null,{"$f":"IF(SUM(DK$19:DK$22)>0,$E16*$F16,0)","v":0},null,{"$f":"IF(SUM(DM$19:DM$22)>0,$E16*$F16,0)","v":0},null,{"$f":"IF(SUM(DO$19:DO$22)>0,$E16*$F16,0)","v":0},null,{"$f":"IF(SUM(DQ$19:DQ$22)>0,$E16*$F16,0)","v":0},null,{"$f":"IF(SUM(DS$19:DS$22)>0,$E16*$F16,0)","v":0},null,{"$f":"IF(SUM(DU$19:DU$22)>0,$E16*$F16,0)","v":0},null,{"$f":"IF(SUM(DW$19:DW$22)>0,$E16*$F16,0)","v":0}]
[]
[null,null,"CATEGORIAS",null,null,"QUANTIDADE"]
[null,null,null,null,null,null,null,null,{"$f":"IF($C19=I$4,1,0)","v":0}]
[null,null,null,{"$f":"HLOOKUP($C20,'Dados Gerais'!$D$5:$BJ$10,6)","v":{"$error":"#N/A"}},null,{"$f":"HLOOKUP($C20,'Dados Gerais'!$D$5:$BJ$14,10)","v":{"$error":"#N/A"}},null,null,{"$f":"IF($C20=I$4,1,0)","v":0},null,{"$f":"IF($C20=K$4,1,0)","v":0},null,{"$f":"IF($C20=M$4,1,0)","v":0},null,{"$f":"IF($C20=O$4,1,0)","v":0},null,{"$f":"IF($C20=Q$4,1,0)","v":0},null,{"$f":"IF($C20=S$4,1,0)","v":0},null,{"$f":"IF($C20=U$4,1,0)","v":0},null,{"$f":"IF($C20=W$4,1,0)","v":0},null,{"$f":"IF($C20=Y$4,1,0)","v":0},null,{"$f":"IF($C20=AA$4,1,0)","v":0},null,{"$f":"IF($C20=AC$4,1,0)","v":0},null,{"$f":"IF($C20=AE$4,1,0)","v":0},null,{"$f":"IF($C20=AG$4,1,0)","v":0},null,{"$f":"IF($C20=AI$4,1,0)","v":0},null,{"$f":"IF($C20=AK$4,1,0)","v":0},null,{"$f":"IF($C20=AM$4,1,0)","v":0},null,{"$f":"IF($C20=AO$4,1,0)","v":0},null,{"$f":"IF($C20=AQ$4,1,0)","v":0},null,{"$f":"IF($C20=AS$4,1,0)","v":0},null,{"$f":"IF($C20=AU$4,1,0)","v":0},null,{"$f":"IF($C20=AW$4,1,0)","v":0},null,{"$f":"IF($C20=AY$4,1,0)","v":0},null,{"$f":"IF($C20=BA$4,1,0)","v":0},null,{"$f":"IF($C20=BC$4,1,0)","v":0},null,{"$f":"IF($C20=BE$4,1,0)","v":0},null,{"$f":"IF($C20=BG$4,1,0)","v":0},null,{"$f":"IF($C20=BI$4,1,0)","v":0},null,{"$f":"IF($C20=BK$4,1,0)","v":0},null,{"$f":"IF($C20=BM$4,1,0)","v":0},null,{"$f":"IF($C20=BO$4,1,0)","v":0},null,{"$f":"IF($C20=BQ$4,1,0)","v":0},null,{"$f":"IF($C20=BS$4,1,0)","v":0},null,{"$f":"IF($C20=BU$4,1,0)","v":0},null,{"$f":"IF($C20=BW$4,1,0)","v":0},null,{"$f":"IF($C20=BY$4,1,0)","v":0},null,{"$f":"IF($C20=CA$4,1,0)","v":0},null,{"$f":"IF($C20=CC$4,1,0)","v":0},null,{"$f":"IF($C20=CE$4,1,0)","v":0},null,{"$f":"IF($C20=CG$4,1,0)","v":0},null,{"$f":"IF($C20=CI$4,1,0)","v":0},null,{"$f":"IF($C20=CK$4,1,0)","v":0},null,{"$f":"IF($C20=CM$4,1,0)","v":0},null,{"$f":"IF($C20=CO$4,1,0)","v":0},null,{"$f":"IF($C20=CQ$4,1,0)","v":0},null,{"$f":"IF($C20=CS$4,1,0)","v":0},null,{"$f":"IF($C20=CU$4,1,0)","v":0},null,{"$f":"IF($C20=CW$4,1,0)","v":0},null,{"$f":"IF($C20=CY$4,1,0)","v":0},null,{"$f":"IF($C20=DA$4,1,0)","v":0},null,{"$f":"IF($C20=DC$4,1,0)","v":0},null,{"$f":"IF($C20=DE$4,1,0)","v":0},null,{"$f":"IF($C20=DG$4,1,0)","v":0},null,{"$f":"IF($C20=DI$4,1,0)","v":0},null,{"$f":"IF($C20=DK$4,1,0)","v":0},null,{"$f":"IF($C20=DM$4,1,0)","v":0},null,{"$f":"IF($C20=DO$4,1,0)","v":0},null,{"$f":"IF($C20=DQ$4,1,0)","v":0},null,{"$f":"IF($C20=DS$4,1,0)","v":0},null,{"$f":"IF($C20=DU$4,1,0)","v":0},null,{"$f":"IF($C20=DW$4,1,0)","v":0}]
[null,null,null,{"$f":"HLOOKUP($C21,'Dados Gerais'!$D$5:$BJ$10,6)","v":{"$error":"#N/A"}},null,{"$f":"HLOOKUP($C21,'Dados Gerais'!$D$5:$BJ$14,10)","v":{"$error":"#N/A"}},null,null,{"$f":"IF($C21=I$4,1,0)","v":0},null,{"$f":"IF($C21=K$4,1,0)","v":0},null,{"$f":"IF($C21=M$4,1,0)","v":0},null,{"$f":"IF($C21=O$4,1,0)","v":0},null,{"$f":"IF($C21=Q$4,1,0)","v":0},null,{"$f":"IF($C21=S$4,1,0)","v":0},null,{"$f":"IF($C21=U$4,1,0)","v":0},null,{"$f":"IF($C21=W$4,1,0)","v":0},null,{"$f":"IF($C21=Y$4,1,0)","v":0},null,{"$f":"IF($C21=AA$4,1,0)","v":0},null,{"$f":"IF($C21=AC$4,1,0)","v":0},null,{"$f":"IF($C21=AE$4,1,0)","v":0},null,{"$f":"IF($C21=AG$4,1,0)","v":0},null,{"$f":"IF($C21=AI$4,1,0)","v":0},null,{"$f":"IF($C21=AK$4,1,0)","v":0},null,{"$f":"IF($C21=AM$4,1,0)","v":0},null,{"$f":"IF($C21=AO$4,1,0)","v":0},null,{"$f":"IF($C21=AQ$4,1,0)","v":0},null,{"$f":"IF($C21=AS$4,1,0)","v":0},null,{"$f":"IF($C21=AU$4,1,0)","v":0},null,{"$f":"IF($C21=AW$4,1,0)","v":0},null,{"$f":"IF($C21=AY$4,1,0)","v":0},null,{"$f":"IF($C21=BA$4,1,0)","v":0},null,{"$f":"IF($C21=BC$4,1,0)","v":0},null,{"$f":"IF($C21=BE$4,1,0)","v":0},null,{"$f":"IF($C21=BG$4,1,0)","v":0},null,{"$f":"IF($C21=BI$4,1,0)","v":0},null,{"$f":"IF($C21=BK$4,1,0)","v":0},null,{"$f":"IF($C21=BM$4,1,0)","v":0},null,{"$f":"IF($C21=BO$4,1,0)","v":0},null,{"$f":"IF($C21=BQ$4,1,0)","v":0},null,{"$f":"IF($C21=BS$4,1,0)","v":0},null,{"$f":"IF($C21=BU$4,1,0)","v":0},null,{"$f":"IF($C21=BW$4,1,0)","v":0},null,{"$f":"IF($C21=BY$4,1,0)","v":0},null,{"$f":"IF($C21=CA$4,1,0)","v":0},null,{"$f":"IF($C21=CC$4,1,0)","v":0},null,{"$f":"IF($C21=CE$4,1,0)","v":0},null,{"$f":"IF($C21=CG$4,1,0)","v":0},null,{"$f":"IF($C21=CI$4,1,0)","v":0},null,{"$f":"IF($C21=CK$4,1,0)","v":0},null,{"$f":"IF($C21=CM$4,1,0)","v":0},null,{"$f":"IF($C21=CO$4,1,0)","v":0},null,{"$f":"IF($C21=CQ$4,1,0)","v":0},null,{"$f":"IF($C21=CS$4,1,0)","v":0},null,{"$f":"IF($C21=CU$4,1,0)","v":0},null,{"$f":"IF($C21=CW$4,1,0)","v":0},null,{"$f":"IF($C21=CY$4,1,0)","v":0},null,{"$f":"IF($C21=DA$4,1,0)","v":0},null,{"$f":"IF($C21=DC$4,1,0)","v":0},null,{"$f":"IF($C21=DE$4,1,0)","v":0},null,{"$f":"IF($C21=DG$4,1,0)","v":0},null,{"$f":"IF($C21=DI$4,1,0)","v":0},null,{"$f":"IF($C21=DK$4,1,0)","v":0},null,{"$f":"IF($C21=DM$4,1,0)","v":0},null,{"$f":"IF($C21=DO$4,1,0)","v":0},null,{"$f":"IF($C21=DQ$4,1,0)","v":0},null,{"$f":"IF($C21=DS$4,1,0)","v":0},null,{"$f":"IF($C21=DU$4,1,0)","v":0},null,{"$f":"IF($C21=DW$4,1,0)","v":0}]
[null,null,null,null,null,null,null,null,{"$f":"IF($C22=I$4,1,0)","v":0}]
[]
[null,null,"ITEM","DESCRIÇÃO","QUANT ANUAL POR POSTO","VALOR"]
[null,null,null,null,null,null,null,null,null,{"$f":"IF(SUM(I$8:I$11)>0,$E25*$F25,0)","v":0},null,{"$f":"IF(SUM(K$8:K$11)>0,$E25*$F25,0)","v":0},null,{"$f":"IF(SUM(M$8:M$11)>0,$E25*$F25,0)","v":0},null,{"$f":"IF(SUM(O$8:O$11)>0,$E25*$F25,0)","v":0},null,{"$f":"IF(SUM(Q$8:Q$11)>0,$E25*$F25,0)","v":0},null,{"$f":"IF(SUM(S$8:S$11)>0,$E25*$F25,0)","v":0},null,{"$f":"IF(SUM(U$8:U$11)>0,$E25*$F25,0)","v":0},null,{"$f":"IF(SUM(W$8:W$11)>0,$E25*$F25,0)","v":0},null,{"$f":"IF(SUM(Y$8:Y$11)>0,$E25*$F25,0)","v":0},null,{"$f":"IF(SUM(AA$8:AA$11)>0,$E25*$F25,0)","v":0},null,{"$f":"IF(SUM(AC$8:AC$11)>0,$E25*$F25,0)","v":0},null,{"$f":"IF(SUM(AE$8:AE$11)>0,$E25*$F25,0)","v":0},null,{"$f":"IF(SUM(AG$8:AG$11)>0,$E25*$F25,0)","v":0},null,{"$f":"IF(SUM(AI$8:AI$11)>0,$E25*$F25,0)","v":0},null,{"$f":"IF(SUM(AK$8:AK$11)>0,$E25*$F25,0)","v":0},null,{"$f":"IF(SUM(AM$8:AM$11)>0,$E25*$F25,0)","v":0},null,{"$f":"IF(SUM(AO$8:AO$11)>0,$E25*$F25,0)","v":0},null,{"$f":"IF(SUM(AQ$8:AQ$11)>0,$E25*$F25,0)","v":0},null,{"$f":"IF(SUM(AS$8:AS$11)>0,$E25*$F25,0)","v":0},null,{"$f":"IF(SUM(AU$8:AU$11)>0,$E25*$F25,0)","v":0},null,{"$f":"IF(SUM(AW$8:AW$11)>0,$E25*$F25,0)","v":0},null,{"$f":"IF(SUM(AY$8:AY$11)>0,$E25*$F25,0)","v":0},null,{"$f":"IF(SUM(BA$8:BA$11)>0,$E25*$F25,0)","v":0},null,{"$f":"IF(SUM(BC$8:BC$11)>0,$E25*$F25,0)","v":0},null,{"$f":"IF(SUM(BE$8:BE$11)>0,$E25*$F25,0)","v":0},null,{"$f":"IF(SUM(BG$8:BG$11)>0,$E25*$F25,0)","v":0},null,{"$f":"IF(SUM(BI$8:BI$11)>0,$E25*$F25,0)","v":0},null,{"$f":"IF(SUM(BK$8:BK$11)>0,$E25*$F25,0)","v":0},null,{"$f":"IF(SUM(BM$8:BM$11)>0,$E25*$F25,0)","v":0},null,{"$f":"IF(SUM(BO$8:BO$11)>0,$E25*$F25,0)","v":0},null,{"$f":"IF(SUM(BQ$8:BQ$11)>0,$E25*$F25,0)","v":0},null,{"$f":"IF(SUM(BS$8:BS$11)>0,$E25*$F25,0)","v":0},null,{"$f":"IF(SUM(BU$8:BU$11)>0,$E25*$F25,0)","v":0},null,{"$f":"IF(SUM(BW$8:BW$11)>0,$E25*$F25,0)","v":0},null,{"$f":"IF(SUM(BY$8:BY$11)>0,$E25*$F25,0)","v":0},null,{"$f":"IF(SUM(CA$8:CA$11)>0,$E25*$F25,0)","v":0},null,{"$f":"IF(SUM(CC$8:CC$11)>0,$E25*$F25,0)","v":0},null,{"$f":"IF(SUM(CE$8:CE$11)>0,$E25*$F25,0)","v":0},null,{"$f":"IF(SUM(CG$8:CG$11)>0,$E25*$F25,0)","v":0},null,{"$f":"IF(SUM(CI$8:CI$11)>0,$E25*$F25,0)","v":0},null,{"$f":"IF(SUM(CK$8:CK$11)>0,$E25*$F25,0)","v":0},null,{"$f":"IF(SUM(CM$8:CM$11)>0,$E25*$F25,0)","v":0},null,{"$f":"IF(SUM(CO$8:CO$11)>0,$E25*$F25,0)","v":0},null,{"$f":"IF(SUM(CQ$8:CQ$11)>0,$E25*$F25,0)","v":0},null,{"$f":"IF(SUM(CS$8:CS$11)>0,$E25*$F25,0)","v":0},null,{"$f":"IF(SUM(CU$8:CU$11)>0,$E25*$F25,0)","v":0},null,{"$f":"IF(SUM(CW$8:CW$11)>0,$E25*$F25,0)","v":0},null,{"$f":"IF(SUM(CY$8:CY$11)>0,$E25*$F25,0)","v":0},null,{"$f":"IF(SUM(DA$8:DA$11)>0,$E25*$F25,0)","v":0},null,{"$f":"IF(SUM(DC$8:DC$11)>0,$E25*$F25,0)","v":0},null,{"$f":"IF(SUM(DE$8:DE$11)>0,$E25*$F25,0)","v":0},null,{"$f":"IF(SUM(DG$8:DG$11)>0,$E25*$F25,0)","v":0},null,{"$f":"IF(SUM(DI$8:DI$11)>0,$E25*$F25,0)","v":0},null,{"$f":"IF(SUM(DK$8:DK$11)>0,$E25*$F25,0)","v":0},null,{"$f":"IF(SUM(DM$8:DM$11)>0,$E25*$F25,0)","v":0},null,{"$f":"IF(SUM(DO$8:DO$11)>0,$E25*$F25,0)","v":0},null,{"$f":"IF(SUM(DQ$8:DQ$11)>0,$E25*$F25,0)","v":0},null,{"$f":"IF(SUM(DS$8:DS$11)>0,$E25*$F25,0)","v":0},null,{"$f":"IF(SUM(DU$8:DU$11)>0,$E25*$F25,0)","v":0},null,{"$f":"IF(SUM(DW$8:DW$11)>0,$E25*$F25,0)","v":0}]
[null,null,null,null,null,null,null,null,null,{"$f":"IF(SUM(I$19:I$22)>0,$E26*$F26,0)","v":0},null,{"$f":"IF(SUM(K$19:K$22)>0,$E26*$F26,0)","v":0},null,{"$f":"IF(SUM(M$19:M$22)>0,$E26*$F26,0)","v":0},null,{"$f":"IF(SUM(O$19:O$22)>0,$E26*$F26,0)","v":0},null,{"$f":"IF(SUM(Q$19:Q$22)>0,$E26*$F26,0)","v":0},null,{"$f":"IF(SUM(S$19:S$22)>0,$E26*$F26,0)","v":0},null,{"$f":"IF(SUM(U$19:U$22)>0,$E26*$F26,0)","v":0},null,{"$f":"IF(SUM(W$19:W$22)>0,$E26*$F26,0)","v":0},null,{"$f":"IF(SUM(Y$19:Y$22)>0,$E26*$F26,0)","v":0},null,{"$f":"IF(SUM(AA$19:AA$22)>0,$E26*$F26,0)","v":0},null,{"$f":"IF(SUM(AC$19:AC$22)>0,$E26*$F26,0)","v":0},null,{"$f":"IF(SUM(AE$19:AE$22)>0,$E26*$F26,0)","v":0},null,{"$f":"IF(SUM(AG$19:AG$22)>0,$E26*$F26,0)","v":0},null,{"$f":"IF(SUM(AI$19:AI$22)>0,$E26*$F26,0)","v":0},null,{"$f":"IF(SUM(AK$19:AK$22)>0,$E26*$F26,0)","v":0},null,{"$f":"IF(SUM(AM$19:AM$22)>0,$E26*$F26,0)","v":0},null,{"$f":"IF(SUM(AO$19:AO$22)>0,$E26*$F26,0)","v":0},null,{"$f":"IF(SUM(AQ$19:AQ$22)>0,$E26*$F26,0)","v":0},null,{"$f":"IF(SUM(AS$19:AS$22)>0,$E26*$F26,0)","v":0},null,{"$f":"IF(SUM(AU$19:AU$22)>0,$E26*$F26,0)","v":0},null,{"$f":"IF(SUM(AW$19:AW$22)>0,$E26*$F26,0)","v":0},null,{"$f":"IF(SUM(AY$19:AY$22)>0,$E26*$F26,0)","v":0},null,{"$f":"IF(SUM(BA$19:BA$22)>0,$E26*$F26,0)","v":0},null,{"$f":"IF(SUM(BC$19:BC$22)>0,$E26*$F26,0)","v":0},null,{"$f":"IF(SUM(BE$19:BE$22)>0,$E26*$F26,0)","v":0},null,{"$f":"IF(SUM(BG$19:BG$22)>0,$E26*$F26,0)","v":0},null,{"$f":"IF(SUM(BI$19:BI$22)>0,$E26*$F26,0)","v":0},null,{"$f":"IF(SUM(BK$19:BK$22)>0,$E26*$F26,0)","v":0},null,{"$f":"IF(SUM(BM$19:BM$22)>0,$E26*$F26,0)","v":0},null,{"$f":"IF(SUM(BO$19:BO$22)>0,$E26*$F26,0)","v":0},null,{"$f":"IF(SUM(BQ$19:BQ$22)>0,$E26*$F26,0)","v":0},null,{"$f":"IF(SUM(BS$19:BS$22)>0,$E26*$F26,0)","v":0},null,{"$f":"IF(SUM(BU$19:BU$22)>0,$E26*$F26,0)","v":0},null,{"$f":"IF(SUM(BW$19:BW$22)>0,$E26*$F26,0)","v":0},null,{"$f":"IF(SUM(BY$19:BY$22)>0,$E26*$F26,0)","v":0},null,{"$f":"IF(SUM(CA$19:CA$22)>0,$E26*$F26,0)","v":0},null,{"$f":"IF(SUM(CC$19:CC$22)>0,$E26*$F26,0)","v":0},null,{"$f":"IF(SUM(CE$19:CE$22)>0,$E26*$F26,0)","v":0},null,{"$f":"IF(SUM(CG$19:CG$22)>0,$E26*$F26,0)","v":0},null,{"$f":"IF(SUM(CI$19:CI$22)>0,$E26*$F26,0)","v":0},null,{"$f":"IF(SUM(CK$19:CK$22)>0,$E26*$F26,0)","v":0},null,{"$f":"IF(SUM(CM$19:CM$22)>0,$E26*$F26,0)","v":0},null,{"$f":"IF(SUM(CO$19:CO$22)>0,$E26*$F26,0)","v":0},null,{"$f":"IF(SUM(CQ$19:CQ$22)>0,$E26*$F26,0)","v":0},null,{"$f":"IF(SUM(CS$19:CS$22)>0,$E26*$F26,0)","v":0},null,{"$f":"IF(SUM(CU$19:CU$22)>0,$E26*$F26,0)","v":0},null,{"$f":"IF(SUM(CW$19:CW$22)>0,$E26*$F26,0)","v":0},null,{"$f":"IF(SUM(CY$19:CY$22)>0,$E26*$F26,0)","v":0},null,{"$f":"IF(SUM(DA$19:DA$22)>0,$E26*$F26,0)","v":0},null,{"$f":"IF(SUM(DC$19:DC$22)>0,$E26*$F26,0)","v":0},null,{"$f":"IF(SUM(DE$19:DE$22)>0,$E26*$F26,0)","v":0},null,{"$f":"IF(SUM(DG$19:DG$22)>0,$E26*$F26,0)","v":0},null,{"$f":"IF(SUM(DI$19:DI$22)>0,$E26*$F26,0)","v":0},null,{"$f":"IF(SUM(DK$19:DK$22)>0,$E26*$F26,0)","v":0},null,{"$f":"IF(SUM(DM$19:DM$22)>0,$E26*$F26,0)","v":0},null,{"$f":"IF(SUM(DO$19:DO$22)>0,$E26*$F26,0)","v":0},null,{"$f":"IF(SUM(DQ$19:DQ$22)>0,$E26*$F26,0)","v":0},null,{"$f":"IF(SUM(DS$19:DS$22)>0,$E26*$F26,0)","v":0},null,{"$f":"IF(SUM(DU$19:DU$22)>0,$E26*$F26,0)","v":0},null,{"$f":"IF(SUM(DW$19:DW$22)>0,$E26*$F26,0)","v":0}]
[null,null,null,null,null,null,null,null,null,{"$f":"IF(SUM(I$19:I$22)>0,$E27*$F27,0)","v":0},null,{"$f":"IF(SUM(K$19:K$22)>0,$E27*$F27,0)","v":0},null,{"$f":"IF(SUM(M$19:M$22)>0,$E27*$F27,0)","v":0},null,{"$f":"IF(SUM(O$19:O$22)>0,$E27*$F27,0)","v":0},null,{"$f":"IF(SUM(Q$19:Q$22)>0,$E27*$F27,0)","v":0},null,{"$f":"IF(SUM(S$19:S$22)>0,$E27*$F27,0)","v":0},null,{"$f":"IF(SUM(U$19:U$22)>0,$E27*$F27,0)","v":0},null,{"$f":"IF(SUM(W$19:W$22)>0,$E27*$F27,0)","v":0},null,{"$f":"IF(SUM(Y$19:Y$22)>0,$E27*$F27,0)","v":0},null,{"$f":"IF(SUM(AA$19:AA$22)>0,$E27*$F27,0)","v":0},null,{"$f":"IF(SUM(AC$19:AC$22)>0,$E27*$F27,0)","v":0},null,{"$f":"IF(SUM(AE$19:AE$22)>0,$E27*$F27,0)","v":0},null,{"$f":"IF(SUM(AG$19:AG$22)>0,$E27*$F27,0)","v":0},null,{"$f":"IF(SUM(AI$19:AI$22)>0,$E27*$F27,0)","v":0},null,{"$f":"IF(SUM(AK$19:AK$22)>0,$E27*$F27,0)","v":0},null,{"$f":"IF(SUM(AM$19:AM$22)>0,$E27*$F27,0)","v":0},null,{"$f":"IF(SUM(AO$19:AO$22)>0,$E27*$F27,0)","v":0},null,{"$f":"IF(SUM(AQ$19:AQ$22)>0,$E27*$F27,0)","v":0},null,{"$f":"IF(SUM(AS$19:AS$22)>0,$E27*$F27,0)","v":0},null,{"$f":"IF(SUM(AU$19:AU$22)>0,$E27*$F27,0)","v":0},null,{"$f":"IF(SUM(AW$19:AW$22)>0,$E27*$F27,0)","v":0},null,{"$f":"IF(SUM(AY$19:AY$22)>0,$E27*$F27,0)","v":0},null,{"$f":"IF(SUM(BA$19:BA$22)>0,$E27*$F27,0)","v":0},null,{"$f":"IF(SUM(BC$19:BC$22)>0,$E27*$F27,0)","v":0},null,{"$f":"IF(SUM(BE$19:BE$22)>0,$E27*$F27,0)","v":0},null,{"$f":"IF(SUM(BG$19:BG$22)>0,$E27*$F27,0)","v":0},null,{"$f":"IF(SUM(BI$19:BI$22)>0,$E27*$F27,0)","v":0},null,{"$f":"IF(SUM(BK$19:BK$22)>0,$E27*$F27,0)","v":0},null,{"$f":"IF(SUM(BM$19:BM$22)>0,$E27*$F27,0)","v":0},null,{"$f":"IF(SUM(BO$19:BO$22)>0,$E27*$F27,0)","v":0},null,{"$f":"IF(SUM(BQ$19:BQ$22)>0,$E27*$F27,0)","v":0},null,{"$f":"IF(SUM(BS$19:BS$22)>0,$E27*$F27,0)","v":0},null,{"$f":"IF(SUM(BU$19:BU$22)>0,$E27*$F27,0)","v":0},null,{"$f":"IF(SUM(BW$19:BW$22)>0,$E27*$F27,0)","v":0},null,{"$f":"IF(SUM(BY$19:BY$22)>0,$E27*$F27,0)","v":0},null,{"$f":"IF(SUM(CA$19:CA$22)>0,$E27*$F27,0)","v":0},null,{"$f":"IF(SUM(CC$19:CC$22)>0,$E27*$F27,0)","v":0},null,{"$f":"IF(SUM(CE$19:CE$22)>0,$E27*$F27,0)","v":0},null,{"$f":"IF(SUM(CG$19:CG$22)>0,$E27*$F27,0)","v":0},null,{"$f":"IF(SUM(CI$19:CI$22)>0,$E27*$F27,0)","v":0},null,{"$f":"IF(SUM(CK$19:CK$22)>0,$E27*$F27,0)","v":0},null,{"$f":"IF(SUM(CM$19:CM$22)>0,$E27*$F27,0)","v":0},null,{"$f":"IF(SUM(CO$19:CO$22)>0,$E27*$F27,0)","v":0},null,{"$f":"IF(SUM(CQ$19:CQ$22)>0,$E27*$F27,0)","v":0},null,{"$f":"IF(SUM(CS$19:CS$22)>0,$E27*$F27,0)","v":0},null,{"$f":"IF(SUM(CU$19:CU$22)>0,$E27*$F27,0)","v":0},null,{"$f":"IF(SUM(CW$19:CW$22)>0,$E27*$F27,0)","v":0},null,{"$f":"IF(SUM(CY$19:CY$22)>0,$E27*$F27,0)","v":0},null,{"$f":"IF(SUM(DA$19:DA$22)>0,$E27*$F27,0)","v":0},null,{"$f":"IF(SUM(DC$19:DC$22)>0,$E27*$F27,0)","v":0},null,{"$f":"IF(SUM(DE$19:DE$22)>0,$E27*$F27,0)","v":0},null,{"$f":"IF(SUM(DG$19:DG$22)>0,$E27*$F27,0)","v":0},null,{"$f":"IF(SUM(DI$19:DI$22)>0,$E27*$F27,0)","v":0},null,{"$f":"IF(SUM(DK$19:DK$22)>0,$E27*$F27,0)","v":0},null,{"$f":"IF(SUM(DM$19:DM$22)>0,$E27*$F27,0)","v":0},null,{"$f":"IF(SUM(DO$19:DO$22)>0,$E27*$F27,0)","v":0},null,{"$f":"IF(SUM(DQ$19:DQ$22)>0,$E27*$F27,0)","v":0},null,{"$f":"IF(SUM(DS$19:DS$22)>0,$E27*$F27,0)","v":0},null,{"$f":"IF(SUM(DU$19:DU$22)>0,$E27*$F27,0)","v":0},null,{"$f":"IF(SUM(DW$19:DW$22)>0,$E27*$F27,0)","v":0}]
[]
[null,null,"CATEGORIAS",null,null,"QUANTIDADE"]
[null,null,null,null,null,null,null,null,{"$f":"IF($C30=I$4,1,0)","v":0}]
[null,null,null,{"$f":"HLOOKUP($C31,'Dados Gerais'!$D$5:$BJ$10,6)","v":{"$error":"#N/A"}},null,{"$f":"HLOOKUP($C31,'Dados Gerais'!$D$5:$BJ$14,10)","v":{"$error":"#N/A"}},null,null,{"$f":"IF($C31=I$4,1,0)","v":0},null,{"$f":"IF($C31=K$4,1,0)","v":0},null,{"$f":"IF($C31=M$4,1,0)","v":0},null,{"$f":"IF($C31=O$4,1,0)","v":0},null,{"$f":"IF($C31=Q$4,1,0)","v":0},null,{"$f":"IF($C31=S$4,1,0)","v":0},null,{"$f":"IF($C31=U$4,1,0)","v":0},null,{"$f":"IF($C31=W$4,1,0)","v":0},null,{"$f":"IF($C31=Y$4,1,0)","v":0},null,{"$f":"IF($C31=AA$4,1,0)","v":0},null,{"$f":"IF($C31=AC$4,1,0)","v":0},null,{"$f":"IF($C31=AE$4,1,0)","v":0},null,{"$f":"IF($C31=AG$4,1,0)","v":0},null,{"$f":"IF($C31=AI$4,1,0)","v":0},null,{"$f":"IF($C31=AK$4,1,0)","v":0},null,{"$f":"IF($C31=AM$4,1,0)","v":0},null,{"$f":"IF($C31=AO$4,1,0)","v":0},null,{"$f":"IF($C31=AQ$4,1,0)","v":0},null,{"$f":"IF($C31=AS$4,1,0)","v":0},null,{"$f":"IF($C31=AU$4,1,0)","v":0},null,{"$f":"IF($C31=AW$4,1,0)","v":0},null,{"$f":"IF($C31=AY$4,1,0)","v":0},null,{"$f":"IF($C31=BA$4,1,0)","v":0},null,{"$f":"IF($C31=BC$4,1,0)","v":0},null,{"$f":"IF($C31=BE$4,1,0)","v":0},null,{"$f":"IF($C31=BG$4,1,0)","v":0},null,{"$f":"IF($C31=BI$4,1,0)","v":0},null,{"$f":"IF($C31=BK$4,1,0)","v":0},null,{"$f":"IF($C31=BM$4,1,0)","v":0},null,{"$f":"IF($C31=BO$4,1,0)","v":0},null,{"$f":"IF($C31=BQ$4,1,0)","v":0},null,{"$f":"IF($C31=BS$4,1,0)","v":0},null,{"$f":"IF($C31=BU$4,1,0)","v":0},null,{"$f":"IF($C31=BW$4,1,0)","v":0},null,{"$f":"IF($C31=BY$4,1,0)","v":0},null,{"$f":"IF($C31=CA$4,1,0)","v":0},null,{"$f":"IF($C31=CC$4,1,0)","v":0},null,{"$f":"IF($C31=CE$4,1,0)","v":0},null,{"$f":"IF($C31=CG$4,1,0)","v":0},null,{"$f":"IF($C31=CI$4,1,0)","v":0},null,{"$f":"IF($C31=CK$4,1,0)","v":0},null,{"$f":"IF($C31=CM$4,1,0)","v":0},null,{"$f":"IF($C31=CO$4,1,0)","v":0},null,{"$f":"IF($C31=CQ$4,1,0)","v":0},null,{"$f":"IF($C31=CS$4,1,0)","v":0},null,{"$f":"IF($C31=CU$4,1,0)","v":0},null,{"$f":"IF($C31=CW$4,1,0)","v":0},null,{"$f":"IF($C31=CY$4,1,0)","v":0},null,{"$f":"IF($C31=DA$4,1,0)","v":0},null,{"$f":"IF($C31=DC$4,1,0)","v":0},null,{"$f":"IF($C31=DE$4,1,0)","v":0},null,{"$f":"IF($C31=DG$4,1,0)","v":0},null,{"$f":"IF($C31=DI$4,1,0)","v":0},null,{"$f":"IF($C31=DK$4,1,0)","v":0},null,{"$f":"IF($C31=DM$4,1,0)","v":0},null,{"$f":"IF($C31=DO$4,1,0)","v":0},null,{"$f":"IF($C31=DQ$4,1,0)","v":0},null,{"$f":"IF($C31=DS$4,1,0)","v":0},null,{"$f":"IF($C31=DU$4,1,0)","v":0},null,{"$f":"IF($C31=DW$4,1,0)","v":0}]
[null,null,null,null,null,null,null,null,{"$f":"IF($C32=I$4,1,0)","v":0}]
[]
[null,null,"ITEM","DESCRIÇÃO","QUANT ANUAL POR POSTO","VALOR"]
[null,null,null,null,null,null,null,null,null,{"$f":"IF(SUM(I$8:I$11)>0,$E35*$F35,0)","v":0},null,{"$f":"IF(SUM(K$8:K$11)>0,$E35*$F35,0)","v":0},null,{"$f":"IF(SUM(M$8:M$11)>0,$E35*$F35,0)","v":0},null,{"$f":"IF(SUM(O$8:O$11)>0,$E35*$F35,0)","v":0},null,{"$f":"IF(SUM(Q$8:Q$11)>0,$E35*$F35,0)","v":0},null,{"$f":"IF(SUM(S$8:S$11)>0,$E35*$F35,0)","v":0},null,{"$f":"IF(SUM(U$8:U$11)>0,$E35*$F35,0)","v":0},null,{"$f":"IF(SUM(W$8:W$11)>0,$E35*$F35,0)","v":0},null,{"$f":"IF(SUM(Y$8:Y$11)>0,$E35*$F35,0)","v":0},null,{"$f":"IF(SUM(AA$8:AA$11)>0,$E35*$F35,0)","v":0},null,{"$f":"IF(SUM(AC$8:AC$11)>0,$E35*$F35,0)","v":0},null,{"$f":"IF(SUM(AE$8:AE$11)>0,$E35*$F35,0)","v":0},null,{"$f":"IF(SUM(AG$8:AG$11)>0,$E35*$F35,0)","v":0},null,{"$f":"IF(SUM(AI$8:AI$11)>0,$E35*$F35,0)","v":0},null,{"$f":"IF(SUM(AK$8:AK$11)>0,$E35*$F35,0)","v":0},null,{"$f":"IF(SUM(AM$8:AM$11)>0,$E35*$F35,0)","v":0},null,{"$f":"IF(SUM(AO$8:AO$11)>0,$E35*$F35,0)","v":0},null,{"$f":"IF(SUM(AQ$8:AQ$11)>0,$E35*$F35,0)","v":0},null,{"$f":"IF(SUM(AS$8:AS$11)>0,$E35*$F35,0)","v":0},null,{"$f":"IF(SUM(AU$8:AU$11)>0,$E35*$F35,0)","v":0},null,{"$f":"IF(SUM(AW$8:AW$11)>0,$E35*$F35,0)","v":0},null,{"$f":"IF(SUM(AY$8:AY$11)>0,$E35*$F35,0)","v":0},null,{"$f":"IF(SUM(BA$8:BA$11)>0,$E35*$F35,0)","v":0},null,{"$f":"IF(SUM(BC$8:BC$11)>0,$E35*$F35,0)","v":0},null,{"$f":"IF(SUM(BE$8:BE$11)>0,$E35*$F35,0)","v":0},null,{"$f":"IF(SUM(BG$8:BG$11)>0,$E35*$F35,0)","v":0},null,{"$f":"IF(SUM(BI$8:BI$11)>0,$E35*$F35,0)","v":0},null,{"$f":"IF(SUM(BK$8:BK$11)>0,$E35*$F35,0)","v":0},null,{"$f":"IF(SUM(BM$8:BM$11)>0,$E35*$F35,0)","v":0},null,{"$f":"IF(SUM(BO$8:BO$11)>0,$E35*$F35,0)","v":0},null,{"$f":"IF(SUM(BQ$8:BQ$11)>0,$E35*$F35,0)","v":0},null,{"$f":"IF(SUM(BS$8:BS$11)>0,$E35*$F35,0)","v":0},null,{"$f":"IF(SUM(BU$8:BU$11)>0,$E35*$F35,0)","v":0},null,{"$f":"IF(SUM(BW$8:BW$11)>0,$E35*$F35,0)","v":0},null,{"$f":"IF(SUM(BY$8:BY$11)>0,$E35*$F35,0)","v":0},null,{"$f":"IF(SUM(CA$8:CA$11)>0,$E35*$F35,0)","v":0},null,{"$f":"IF(SUM(CC$8:CC$11)>0,$E35*$F35,0)","v":0},null,{"$f":"IF(SUM(CE$8:CE$11)>0,$E35*$F35,0)","v":0},null,{"$f":"IF(SUM(CG$8:CG$11)>0,$E35*$F35,0)","v":0},null,{"$f":"IF(SUM(CI$8:CI$11)>0,$E35*$F35,0)","v":0},null,{"$f":"IF(SUM(CK$8:CK$11)>0,$E35*$F35,0)","v":0},null,{"$f":"IF(SUM(CM$8:CM$11)>0,$E35*$F35,0)","v":0},null,{"$f":"IF(SUM(CO$8:CO$11)>0,$E35*$F35,0)","v":0},null,{"$f":"IF(SUM(CQ$8:CQ$11)>0,$E35*$F35,0)","v":0},null,{"$f":"IF(SUM(CS$8:CS$11)>0,$E35*$F35,0)","v":0},null,{"$f":"IF(SUM(CU$8:CU$11)>0,$E35*$F35,0)","v":0},null,{"$f":"IF(SUM(CW$8:CW$11)>0,$E35*$F35,0)","v":0},null,{"$f":"IF(SUM(CY$8:CY$11)>0,$E35*$F35,0)","v":0},null,{"$f":"IF(SUM(DA$8:DA$11)>0,$E35*$F35,0)","v":0},null,{"$f":"IF(SUM(DC$8:DC$11)>0,$E35*$F35,0)","v":0},null,{"$f":"IF(SUM(DE$8:DE$11)>0,$E35*$F35,0)","v":0},null,{"$f":"IF(SUM(DG$8:DG$11)>0,$E35*$F35,0)","v":0},null,{"$f":"IF(SUM(DI$8:DI$11)>0,$E35*$F35,0)","v":0},null,{"$f":"IF(SUM(DK$8:DK$11)>0,$E35*$F35,0)","v":0},null,{"$f":"IF(SUM(DM$8:DM$11)>0,$E35*$F35,0)","v":0},null,{"$f":"IF(SUM(DO$8:DO$11)>0,$E35*$F35,0)","v":0},null,{"$f":"IF(SUM(DQ$8:DQ$11)>0,$E35*$F35,0)","v":0},null,{"$f":"IF(SUM(DS$8:DS$11)>0,$E35*$F35,0)","v":0},null,{"$f":"IF(SUM(DU$8:DU$11)>0,$E35*$F35,0)","v":0},null,{"$f":"IF(SUM(DW$8:DW$11)>0,$E35*$F35,0)","v":0}]
[null,null,null,null,null,null,null,null,null,{"$f":"IF(SUM(I$30:I$32)>0,$E36*$F36,0)","v":0},null,{"$f":"IF(SUM(K$30:K$32)>0,$E36*$F36,0)","v":0},null,{"$f":"IF(SUM(M$30:M$32)>0,$E36*$F36,0)","v":0},null,{"$f":"IF(SUM(O$30:O$32)>0,$E36*$F36,0)","v":0},null,{"$f":"IF(SUM(Q$30:Q$32)>0,$E36*$F36,0)","v":0},null,{"$f":"IF(SUM(S$30:S$32)>0,$E36*$F36,0)","v":0},null,{"$f":"IF(SUM(U$30:U$32)>0,$E36*$F36,0)","v":0},null,{"$f":"IF(SUM(W$30:W$32)>0,$E36*$F36,0)","v":0},null,{"$f":"IF(SUM(Y$30:Y$32)>0,$E36*$F36,0)","v":0},null,{"$f":"IF(SUM(AA$30:AA$32)>0,$E36*$F36,0)","v":0},null,{"$f":"IF(SUM(AC$30:AC$32)>0,$E36*$F36,0)","v":0},null,{"$f":"IF(SUM(AE$30:AE$32)>0,$E36*$F36,0)","v":0},null,{"$f":"IF(SUM(AG$30:AG$32)>0,$E36*$F36,0)","v":0},null,{"$f":"IF(SUM(AI$30:AI$32)>0,$E36*$F36,0)","v":0},null,{"$f":"IF(SUM(AK$30:AK$32)>0,$E36*$F36,0)","v":0},null,{"$f":"IF(SUM(AM$30:AM$32)>0,$E36*$F36,0)","v":0},null,{"$f":"IF(SUM(AO$30:AO$32)>0,$E36*$F36,0)","v":0},null,{"$f":"IF(SUM(AQ$30:AQ$32)>0,$E36*$F36,0)","v":0},null,{"$f":"IF(SUM(AS$30:AS$32)>0,$E36*$F36,0)","v":0},null,{"$f":"IF(SUM(AU$30:AU$32)>0,$E36*$F36,0)","v":0},null,{"$f":"IF(SUM(AW$30:AW$32)>0,$E36*$F36,0)","v":0},null,{"$f":"IF(SUM(AY$30:AY$32)>0,$E36*$F36,0)","v":0},null,{"$f":"IF(SUM(BA$30:BA$32)>0,$E36*$F36,0)","v":0},null,{"$f":"IF(SUM(BC$30:BC$32)>0,$E36*$F36,0)","v":0},null,{"$f":"IF(SUM(BE$30:BE$32)>0,$E36*$F36,0)","v":0},null,{"$f":"IF(SUM(BG$30:BG$32)>0,$E36*$F36,0)","v":0},null,{"$f":"IF(SUM(BI$30:BI$32)>0,$E36*$F36,0)","v":0},null,{"$f":"IF(SUM(BK$30:BK$32)>0,$E36*$F36,0)","v":0},null,{"$f":"IF(SUM(BM$30:BM$32)>0,$E36*$F36,0)","v":0},null,{"$f":"IF(SUM(BO$30:BO$32)>0,$E36*$F36,0)","v":0},null,{"$f":"IF(SUM(BQ$30:BQ$32)>0,$E36*$F36,0)","v":0},null,{"$f":"IF(SUM(BS$30:BS$32)>0,$E36*$F36,0)","v":0},null,{"$f":"IF(SUM(BU$30:BU$32)>0,$E36*$F36,0)","v":0},null,{"$f":"IF(SUM(BW$30:BW$32)>0,$E36*$F36,0)","v":0},null,{"$f":"IF(SUM(BY$30:BY$32)>0,$E36*$F36,0)","v":0},null,{"$f":"IF(SUM(CA$30:CA$32)>0,$E36*$F36,0)","v":0},null,{"$f":"IF(SUM(CC$30:CC$32)>0,$E36*$F36,0)","v":0},null,{"$f":"IF(SUM(CE$30:CE$32)>0,$E36*$F36,0)","v":0},null,{"$f":"IF(SUM(CG$30:CG$32)>0,$E36*$F36,0)","v":0},null,{"$f":"IF(SUM(CI$30:CI$32)>0,$E36*$F36,0)","v":0},null,{"$f":"IF(SUM(CK$30:CK$32)>0,$E36*$F36,0)","v":0},null,{"$f":"IF(SUM(CM$30:CM$32)>0,$E36*$F36,0)","v":0},null,{"$f":"IF(SUM(CO$30:CO$32)>0,$E36*$F36,0)","v":0},null,{"$f":"IF(SUM(CQ$30:CQ$32)>0,$E36*$F36,0)","v":0},null,{"$f":"IF(SUM(CS$30:CS$32)>0,$E36*$F36,0)","v":0},null,{"$f":"IF(SUM(CU$30:CU$32)>0,$E36*$F36,0)","v":0},null,{"$f":"IF(SUM(CW$30:CW$32)>0,$E36*$F36,0)","v":0},null,{"$f":"IF(SUM(CY$30:CY$32)>0,$E36*$F36,0)","v":0},null,{"$f":"IF(SUM(DA$30:DA$32)>0,$E36*$F36,0)","v":0},null,{"$f":"IF(SUM(DC$30:DC$32)>0,$E36*$F36,0)","v":0},null,{"$f":"IF(SUM(DE$30:DE$32)>0,$E36*$F36,0)","v":0},null,{"$f":"IF(SUM(DG$30:DG$32)>0,$E36*$F36,0)","v":0},null,{"$f":"IF(SUM(DI$30:DI$32)>0,$E36*$F36,0)","v":0},null,{"$f":"IF(SUM(DK$30:DK$32)>0,$E36*$F36,0)","v":0},null,{"$f":"IF(SUM(DM$30:DM$32)>0,$E36*$F36,0)","v":0},null,{"$f":"IF(SUM(DO$30:DO$32)>0,$E36*$F36,0)","v":0},null,{"$f":"IF(SUM(DQ$30:DQ$32)>0,$E36*$F36,0)","v":0},null,{"$f":"IF(SUM(DS$30:DS$32)>0,$E36*$F36,0)","v":0},null,{"$f":"IF(SUM(DU$30:DU$32)>0,$E36*$F36,0)","v":0},null,{"$f":"IF(SUM(DW$30:DW$32)>0,$E36*$F36,0)","v":0}]
[null,null,null,null,null,null,null,null,null,{"$f":"IF(SUM(I$30:I$32)>0,$E37*$F37,0)","v":0},null,0,null,0,null,0,null,0,null,0,null,0,null,0,null,0,null,0,null,0,null,0,null,0,null,0,null,0,null,0,null,0,null,0,null,0,null,0,null,0,null,0,null,0,null,0,null,0,null,0,null,0,null,0,null,0,null,0,null,0,null,0,null,0,null,0,null,0,null,0,null,0,null,0,null,0,null,0,null,0,null,0,null,0,null,0,null,0,null,0,null,0,null,0,null,0,null,0,null,0,null,0,null,0,null,0,null,0,null,0,null,0,null,0,null,0,null,0]
[null,null,null,null,null,null,null,null,null,0,null,0,null,0,null,0,null,0,null,0,null,0,null,0,null,0,null,0,null,0,null,0,null,0,null,0,null,0,null,0,null,0,null,0,null,0,null,0,null,0,null,0,null,0,null,0,null,0,null,0,null,0,null,0,null,0,null,0,null,0,null,0,null,0,null,0,null,0,null,0,null,0,null,0,null,0,null,0,null,0,null,0,null,0,null,0,null,0,null,0,null,0,null,0,null,0,null,0,null,0,null,0,null,0,null,0,null,0,null,0,null,0,null,0,null,0,null,0]
[]
[null,null,null,null,null,null,null,null,{"$f":"SUMPRODUCT($E$15:$E$15,$F$15:$F$15)*(F9+F10)","v":{"$error":"#VALUE!"}},"anual",null,"anual",null,"anual",null,"anual",null,"anual",null,"anual",null,"anual",null,"anual",null,"anual",null,"anual",null,"anual",null,"anual",null,"anual",null,"anual",null,"anual",null,"anual",null,"anual",null,"anual",null,"anual",null,"anual",null,"anual",null,"anual",null,"anual",null,"anual",null,"anual",null,"anual",null,"anual",null,"anual",null,"anual",null,"anual",null,"anual",null,"anual",null,"anual",null,"anual",null,"anual",null,"anual",null,"anual",null,"anual",null,"anual",null,"anual",null,"anual",null,"anual",null,"anual",null,"anual",null,"anual",null,"anual",null,"anual",null,"anual",null,"anual",null,"anual",null,"anual",null,"anual",null,"anual",null,"anual",null,"anual",null,"anual",null,"anual",null,"anual",null,"anual",null,"anual"]
[null,null,null,null,null,null,null,null,{"$f":"I40/12","v":{"$error":"#VALUE!"}},"mensal",null,"mensal",null,"mensal",null,"mensal",null,"mensal",null,"mensal",null,"mensal",null,"mensal",null,"mensal",null,"mensal",null,"mensal",null,"mensal",null,"mensal",null,"mensal",null,"mensal",null,"mensal",null,"mensal",null,"mensal",null,"mensal",null,"mensal",null,"mensal",null,"mensal",null,"mensal",null,"mensal",null,"mensal",null,"mensal",null,"mensal",null,"mensal",null,"mensal",null,"mensal",null,"mensal",null,"mensal",null,"mensal",null,"mensal",null,"mensal",null,"mensal",null,"mensal",null,"mensal",null,"mensal",null,"mensal",null,"mensal",null,"mensal",null,"mensal",null,"mensal",null,"mensal",null,"mensal",null,"mensal",null,"mensal",null,"mensal",null,"mensal",null,"mensal",null,"mensal",null,"mensal",null,"mensal",null,"mensal",null,"mensal",null,"mensal",null,"mensal",null,"mensal",null,"mensal"]
[null,null,null,null,null,null,null,null,{"$f":"I41/11","v":{"$error":"#VALUE!"}},"por posto",null,"por posto",null,"por posto",null,"por posto",null,"por posto",null,"por posto",null,"por posto",null,"por posto",null,"por posto",null,"por posto",null,"por posto",null,"por posto",null,"por posto",null,"por posto",null,"por posto",null,"por posto",null,"por posto",null,"por posto",null,"por posto",null,"por posto",null,"por posto",null,"por posto",null,"por posto",null,"por posto",null,"por posto",null,"por posto",null,"por posto",null,"por posto",null,"por posto",null,"por posto",null,"por posto",null,"por posto",null,"por posto",null,"por posto",null,"por posto",null,"por posto",null,"por posto",null,"por posto",null,"por posto",null,"por posto",null,"por posto",null,"por posto",null,"por posto",null,"por posto",null,"por posto",null,"por posto",null,"por posto",null,"por posto",null,"por posto",null,"por posto",null,"por posto",null,"por posto",null,"por posto",null,"por posto",null,"por posto",null,"por posto",null,"por posto",null,"por posto",null,"por posto",null,"por posto"]

{"sheet":"SREP","index":14,"n_rows":75,"n_cols":15,"rows_kept":75,"cut":false,"hidden":true,"merged":[[2,1,2,3],[3,1,3,14]]}
[]
[]
[]
[null,"SISTEMA DE REGISTRO ELETRÔNICO DE PRESENÇA - SREP"]
[]
[]
[null,null,"PAGAMENTO DA DEPRECIAÇÃO"]
[null,null,"ITEM","DESCRIÇÃO","QUANT ANUAL","CONTA SIAFI","VALOR DE AQ.","% RESIDUAL","VIDA ÚTIL","DEP. MENSAL","CUSTO TOTAL","BDI (%)","PREÇO TOTAL","FONTE","REFERÊNCIA"]
[]
[null,null,1,"Equipamento de Registro Eletrônico de Ponto, de parede, com teclado externo e leitor biométrico, em conformidade com a Portaria 1.510/2009 do MT",null,"12311.01.24\n(máquinas e equip\neletrônicos)",1661.4,0.1,10,{"$f":"G10*(1-H10)/(I10*12)","v":12.460500000000001},{"$f":"J10*E10","v":0},{"$f":"BDI!E26","v":5.0700000000000002E-2},{"$f":"ROUND(K10*(1+L10),2)","v":0},"COTAÇÃO"]
[]
[]
[null,null,"PAGAMENTO DA MANUTENÇÃO"]
[null,null,"ITEM","DESCRIÇÃO",null,null,null,"K (calculado)","MENSAL DEPR.","% MAN X DEP","MENSAL MAN.","BDI (%)","PREÇO TOTAL"]
[]
[null,null,2,"Todos os itens",null,null,null,{"$f":"H23","v":1.9000396799999999},{"$f":"K10","v":0},{"$f":"H16","v":1.9000396799999999},{"$f":"I16*H16","v":0},{"$f":"L10","v":5.0700000000000002E-2},{"$f":"ROUND(K16*(1+L16),2)","v":0}]
[]
[null,null,null,null,"K1","K2","K3","K4"]
[null,null,null,null,0.85,1,0.8,1.4]
[null,null,null,null,"K5","K6","K7","K8"]
[null,null,null,null,1,0.6,1.6,1.1000000000000001]
[null,null,null,null,"K9","K10","K11","RESULTADO"]
[null,null,null,"* a descrição de cada coeficiente segue abaixo",1.5,0.9,1.4,{"$f":"E19*F19*G19*H19*E21*F21*G21*H21*E23*F23*G23","v":1.9000396799999999}]
[]
[]
[null,null,"PAGAMENTO DO SOFTWARE"]
[null,null,"ITEM","DESCRIÇÃO",null,null,null,null,"QUANTIDADE","UNIDADE","UNIT. MENSAL","BDI (%)","PREÇO TOTAL"]
[]
[null,null,3,"Software Ponto Secullum 4 - manutenção e suporte técnico com backup - Web Nuvem - Mensalidade até 200 usuários",null,null,null,null,null,"Licença/mês",null,{"$f":"L35","v":5.0700000000000002E-2},{"$f":"ROUND(K29*(1+L29),2)","v":0},"COTAÇÃO"]
[]
[]
[null,null,"MATERIAL DE CONSUMO ASSOCIADO"]
[null,null,"ITEM","DESCRIÇÃO",null,null,null,"QUANTID/ANO","UNIDADE","VALOR DE AQ.","MENSAL MAT","BDI (%)","PREÇO TOTAL"]
[]
[null,null,4,"Bobina térmica específica para o registrador eletrônico de ponto, com papel termossensível, superfície de impressão externa ao rolo, durabilidade de impressão mínima de 5 anos e comprimento mínimo de 300m","* estimado um gasto anual de 35 bobinas por equipamento",null,null,null,"Bobina",31.37,{"$f":"J35*H35/12","v":0},{"$f":"L16","v":5.0700000000000002E-2},{"$f":"ROUND(K35*(1+L35),2)","v":0},"COTAÇÃO"]
[]
[]
[null,null,"MATERIAL DE CONSUMO ASSOCIADO"]
[null,null,"ITEM","DESCRIÇÃO",null,null,null,null,null,null,null,null,"PREÇO TOTAL"]
[]
[null,null,1,"Componente DEPRECIAÇÃO",null,null,null,null,null,null,null,null,{"$f":"M10","v":0}]
[null,null,2,"Componente MANUTENÇÃO",null,null,null,null,null,null,null,null,{"$f":"M16","v":0}]
[null,null,3,"Componente SOFTWARE",null,null,null,null,null,null,null,null,{"$f":"M29","v":0}]
[null,null,4,"Componente MATERIAL DE CONSUMO ASSOCIADO",null,null,null,null,null,null,null,null,{"$f":"M35","v":0}]
[]
[null,null,null,null,null,null,null,null,null,null,null,"SOMATÓRIO TOTAL MENSAL",{"$f":"SUM(M40:M45)","v":0}]
[null,null,null,null,null,null,null,null,null,null,null,"SOMATÓRIO TOTAL ANUAL",{"$f":"M46*12","v":0}]
[]
[]
[null,null,"MATERIAL DE CONSUMO ASSOCIADO"]
[null,null,"MEMÓRIA DE CÁLCULO DO COEFICIENTE DE CORRELAÇÃO MANUTENÇÃO X DEPRECIAÇÃO (K)"]
[]
[null,null,"JUSTIFICATIVAS",null,"TIPO","K1",null,"Condições de Trab","K4",null,"Tempo Vida (anos)","K6",null,"Temperatura","K8"]
[null,null,null,null,"Guindaste",0.5,null,"Em espera",0.4,null,1,0.6,null,"Muito quente (> 40º C)",1.3]
[null,null,"K1","Considerado o valor médio de 0,85","Caminhão-comum",0.8,null,"Leves",0.8,null,2,0.7,null,"Quente (30º a 40º C)",1.1000000000000001]
[null,null,"K2","Considerado o operador médio","Fora-de-estrada",1,null,"Médias",1,null,3,0.8,null,"Médio (10º a 30º C)",1]
[null,null,"K3","Consideradas ferramentas de primeira qualidade","Carregadeira",1,null,"Pesadas",1.4,null,4,0.9,null,"Frio (< 10º C)",1.2]
[null,null,"K4","Há todo o tipo de trabalho, foi considerado condições pesadas","Escavadeira",1.4,null,"Severas",2,null,5,1]
[null,null,"K5","Considerando manutenção normal","Motoescrêiper",1.1000000000000001,null,null,null,null,6,1,null,"Ritmo de Trabalho","K9"]
[null,null,"K6","Equipamentos novos","Trator de esteira",1.2,null,"Manutenção","K5",null,7,1,null,"Folgado",0.9]
[null,null,"K7","44h por dia, 252 dias por ano",null,null,null,"Excelente",0.6,null,8,1.2,null,"Médio ",1]
[null,null,"K8","Clima quente, acima de 30º C","Qualid do Operador","K2",null,"Boa",0.8,null,9,1.3,null,"Com pressa",1.5]
[null,null,"K9","Ritmo de trabalho usualmente com pressa","Excelente",0.8,null,"Média",1,null,10,1.4]
[null,null,"K10","Considerado o operador médio","Boa",0.9,null,"Ruim ",1.5,null,11,2,null,"Conh do Serviço","K10"]
[null,null,"K11","Foi considerada a opção de aluguel a terceiros, ainda que a simulação seja dos custos do contratado, contudo a execução dos serviços é em local de terceiros","Média",1,null,"Inexistente",3,null,15,2,null,"Grande ",0.8]
[null,null,null,null,"Ruim",1.2,null,null,null,null,null,null,null,"Médio     ",0.9]
[null,null,null,null,"Péssima",2,null,"Horas de Uso ","K7",6000,1,null,null,"Pouco ",1]
[null,null,null,null,null,null,null,1000,0.5,8000,1.3]
[null,null,null,null,"Qualidade do Equip","K3",null,2000,0.5,10000,1.6,null,null,"Tipo do Serviço","K11"]
[null,null,null,null,"De primeira",0.8,null,3000,0.6,12000,1.9,null,null,"Mina ou Pedreira",0.8]
[null,null,null,null,"Média",1,null,4000,0.7,15000,2.2999999999999998,null,null,"Construção Geral",1]
[null,null,null,null,"Ruim",1.5,null,5000,0.9,20000,3,null,null,"Aluguel a Terceiros",1.4]
[]
[null,null,null,null,"Fonte: "]
[null,null,null,null,"MATTOS, Aldo Dórea. Como preparar orçamentos de obras. São Paulo: Pini, 2006. 281 p., il"]

{"sheet":"Não Rel - EPI","index":15,"n_rows":32,"n_cols":15,"rows_kept":32,"cut":false,"hidden":true,"merged":[[2,1,2,4],[3,1,3,11]]}
[]
[]
[]
[null,"EPIS NÃO RELACIONADOS DIRETAMENTE A UM POSTO DE TRABALHO - AQUISIÇÃO"]
[]
[]
[null,null,null,"ITEM","DESCRIÇÃO","QUANT ANUAL","UNIDADE","CUSTO UNITÁRIO","CUSTO ANUAL","BDI (%)","PREÇO TOTAL","FONTE"]
[]
[null,null,null,1,null,null,"UNID",null,{"$f":"H9*F9","v":0},{"$f":"BDI!E26","v":5.0700000000000002E-2},{"$f":"ROUND(I9*(1+J9),2)","v":0},"COTAÇÃO"]
[null,null,null,2,null,null,"UNID",null,{"$f":"H10*F10","v":0},{"$f":"J9","v":5.0700000000000002E-2},{"$f":"ROUND(I10*(1+J10),2)","v":0},"COTAÇÃO"]
[null,null,null,3,null,null,"UNID",null,{"$f":"H11*F11","v":0},{"$f":"J10","v":5.0700000000000002E-2},{"$f":"ROUND(I11*(1+J11),2)","v":0},"COTAÇÃO"]
[null,null,null,4,null,null,"UNID",null,0,5.0700000000000002E-2,0,"COTAÇÃO"]
[null,null,null,5,null,null,"PARES",null,0,5.0700000000000002E-2,0,"COTAÇÃO"]
[null,null,null,6,null,null,"UNID",null,0,5.0700000000000002E-2,0,"COTAÇÃO"]
[null,null,null,7,null,null,"UNID",null,0,5.0700000000000002E-2,0,"COTAÇÃO"]
[null,null,null,8,null,null,"PARES",null,0,5.0700000000000002E-2,0,"COTAÇÃO"]
[null,null,null,9,null,null,"CONJ",null,0,5.0700000000000002E-2,0,"COTAÇÃO"]
[null,null,null,10,null,null,"METROS",null,0,5.0700000000000002E-2,0,"COTAÇÃO"]
[null,null,null,11,null,null,"UNID",null,0,5.0700000000000002E-2,0,"COTAÇÃO"]
[null,null,null,12,null,null,"UNID",null,0,5.0700000000000002E-2,0,"COTAÇÃO"]
[null,null,null,13,null,null,"PARES",null,0,5.0700000000000002E-2,0,"COTAÇÃO"]
[null,null,null,14,null,null,"PARES",null,0,5.0700000000000002E-2,0,"COTAÇÃO"]
[null,null,null,15,null,null,"UNID",null,0,5.0700000000000002E-2,0,"COTAÇÃO"]
[null,null,null,16,null,null,"UNID",null,0,5.0700000000000002E-2,0,"COTAÇÃO"]
[null,null,null,17,null,null,"UNID",null,0,5.0700000000000002E-2,0,"COTAÇÃO"]
[null,null,null,18,null,null,"UNID",null,{"$f":"H26*F26","v":0},5.0700000000000002E-2,{"$f":"ROUND(I26*(1+J26),2)","v":0},"COTAÇÃO"]
[null,null,null,19,null,null,"UNID",null,{"$f":"H27*F27","v":0},5.0700000000000002E-2,{"$f":"ROUND(I27*(1+J27),2)","v":0},"COTAÇÃO"]
[null,null,null,20,null,null,"UNID",null,{"$f":"H28*F28","v":0},{"$f":"J26","v":5.0700000000000002E-2},{"$f":"ROUND(I28*(1+J28),2)","v":0},"COTAÇÃO"]
[null,null,null,21,null,null,"UNID",null,{"$f":"H29*F29","v":0},{"$f":"J27","v":5.0700000000000002E-2},{"$f":"ROUND(I29*(1+J29),2)","v":0},"COTAÇÃO"]
[]
[null,null,null,null,null,null,null,null,null,"SOMATÓRIO TOTAL MENSAL",{"$f":"K32/12","v":0}]
[null,null,null,null,null,null,null,null,null,"SOMATÓRIO TOTAL ANUAL",{"$f":"SUM(K8:K30)","v":0},null,null,{"$f":"SUM($I$9:$I$29)","v":0},"por ano sem bdi"]

{"sheet":"Equip Rel","index":16,"n_rows":80,"n_cols":136,"rows_kept":80,"cut":false,"hidden":true,"merged":[[9,1,9,3],[10,1,10,14]]}
[null,null,"CÂMARA DOS DEPUTADOS"]
[null,null,"DEPARTAMENTO TÉCNICO"]
[null,null,"Coordenação de Planejamento e Gestão"]
[]
[null,null,"Data:",{"$f":"'Dados Gerais'!#REF!","v":{"$error":"#REF!"}}]
[null,null,"Processo:",{"$f":"'Dados Gerais'!#REF!","v":{"$error":"#REF!"}}]
[null,null,"Objeto:",{"$f":"'Dados Gerais'!#REF!","v":{"$error":"#REF!"}}]
[]
[]
[]
[null,"EQUIPAMENTOS RELACIONADOS AO POSTO - PAGAMENTO DA DEPRECIAÇÃO / MANUTENÇÃO",null,null,null,null,null,null,null,null,null,null,null,null,null,null,1,null,{"$f":"Q11+1","v":2},null,{"$f":"S11+1","v":3},null,{"$f":"U11+1","v":4},null,{"$f":"W11+1","v":5},null,{"$f":"Y11+1","v":6},null,{"$f":"AA11+1","v":7},null,{"$f":"AC11+1","v":8},null,{"$f":"AE11+1","v":9},null,{"$f":"AG11+1","v":10},null,{"$f":"AI11+1","v":11},null,{"$f":"AK11+1","v":12},null,{"$f":"AM11+1","v":13},null,{"$f":"AO11+1","v":14},null,{"$f":"AQ11+1","v":15},null,{"$f":"AS11+1","v":16},null,{"$f":"AU11+1","v":17},null,{"$f":"AW11+1","v":18},null,{"$f":"AY11+1","v":19},null,{"$f":"BA11+1","v":20},null,{"$f":"BC11+1","v":21},null,{"$f":"BE11+1","v":22},null,{"$f":"BG11+1","v":23},null,{"$f":"BI11+1","v":24},null,{"$f":"BK11+1","v":25},null,{"$f":"BM11+1","v":26},null,{"$f":"BO11+1","v":27},null,{"$f":"BQ11+1","v":28},null,{"$f":"BS11+1","v":29},null,{"$f":"BU11+1","v":30},null,{"$f":"BW11+1","v":31},null,{"$f":"BY11+1","v":32},null,{"$f":"CA11+1","v":33},null,{"$f":"CC11+1","v":34},null,{"$f":"CE11+1","v":35},null,{"$f":"CG11+1","v":36},null,{"$f":"CI11+1","v":37},null,{"$f":"CK11+1","v":38},null,{"$f":"CM11+1","v":39},null,{"$f":"CO11+1","v":40},null,{"$f":"CQ11+1","v":41},null,{"$f":"CS11+1","v":42},null,{"$f":"CU11+1","v":43},null,{"$f":"CW11+1","v":44},null,{"$f":"CY11+1","v":45},null,{"$f":"DA11+1","v":46},null,{"$f":"DC11+1","v":47},null,{"$f":"DE11+1","v":48},null,{"$f":"DG11+1","v":49},null,{"$f":"DI11+1","v":50},null,{"$f":"DK11+1","v":51},null,{"$f":"DM11+1","v":52},null,{"$f":"DO11+1","v":53},null,{"$f":"DQ11+1","v":54},null,{"$f":"DS11+1","v":55},null,{"$f":"DU11+1","v":56},null,{"$f":"DW11+1","v":57},null,{"$f":"DY11+1","v":58},null,{"$f":"EA11+1","v":59},null,{"$f":"EC11+1","v":60}]
[]
[null,null,null,null,null,null,null,null,null,null,null,null,null,null,null,null,{"$f":"SUM(R12:R61)","v":0},null,{"$f":"SUM(T12:T61)","v":0},null,{"$f":"SUM(V12:V61)","v":0},null,{"$f":"SUM(X12:X61)","v":0},null,{"$f":"SUM(Z12:Z61)","v":0},null,{"$f":"SUM(AB12:AB61)","v":0},null,{"$f":"SUM(AD12:AD61)","v":0},null,{"$f":"SUM(AF12:AF61)","v":0},null,{"$f":"SUM(AH12:AH61)","v":0},null,{"$f":"SUM(AJ12:AJ61)","v":0},null,{"$f":"SUM(AL12:AL61)","v":0},null,{"$f":"SUM(AN12:AN61)","v":0},null,{"$f":"SUM(AP12:AP61)","v":0},null,{"$f":"SUM(AR12:AR61)","v":0},null,{"$f":"SUM(AT12:AT61)","v":0},null,{"$f":"SUM(AV12:AV61)","v":0},null,{"$f":"SUM(AX12:AX61)","v":0},null,{"$f":"SUM(AZ12:AZ61)","v":0},null,{"$f":"SUM(BB12:BB61)","v":0},null,{"$f":"SUM(BD12:BD61)","v":0},null,{"$f":"SUM(BF12:BF61)","v":0},null,{"$f":"SUM(BH12:BH61)","v":0},null,{"$f":"SUM(BJ12:BJ61)","v":0},null,{"$f":"SUM(BL12:BL61)","v":0},null,{"$f":"SUM(BN12:BN61)","v":0},null,{"$f":"SUM(BP12:BP61)","v":0},null,{"$f":"SUM(BR12:BR61)","v":0},null,{"$f":"SUM(BT12:BT61)","v":0},null,{"$f":"SUM(BV12:BV61)","v":0},null,{"$f":"SUM(BX12:BX61)","v":0},null,{"$f":"SUM(BZ12:BZ61)","v":0},null,{"$f":"SUM(CB12:CB61)","v":0},null,{"$f":"SUM(CD12:CD61)","v":0},null,{"$f":"SUM(CF12:CF61)","v":0},null,{"$f":"SUM(CH12:CH61)","v":0},null,{"$f":"SUM(CJ12:CJ61)","v":0},null,{"$f":"SUM(CL12:CL61)","v":0},null,{"$f":"SUM(CN12:CN61)","v":0},null,{"$f":"SUM(CP12:CP61)","v":0},null,{"$f":"SUM(CR12:CR61)","v":0},null,{"$f":"SUM(CT12:CT61)","v":0},null,{"$f":"SUM(CV12:CV61)","v":0},null,{"$f":"SUM(CX12:CX61)","v":0},null,{"$f":"SUM(CZ12:CZ61)","v":0},null,{"$f":"SUM(DB12:DB61)","v":0},null,{"$f":"SUM(DD12:DD61)","v":0},null,{"$f":"SUM(DF12:DF61)","v":0},null,{"$f":"SUM(DH12:DH61)","v":0},null,{"$f":"SUM(DJ12:DJ61)","v":0},null,{"$f":"SUM(DL12:DL61)","v":0},null,{"$f":"SUM(DN12:DN61)","v":0},null,{"$f":"SUM(DP12:DP61)","v":0},null,{"$f":"SUM(DR12:DR61)","v":0},null,{"$f":"SUM(DT12:DT61)","v":0},null,{"$f":"SUM(DV12:DV61)","v":0},null,{"$f":"SUM(DX12:DX61)","v":0},null,{"$f":"SUM(DZ12:DZ61)","v":0},null,{"$f":"SUM(EB12:EB61)","v":0},null,{"$f":"SUM(ED12:ED61)","v":0},null,{"$f":"SUM(EF12:EF61)","v":0}]
[null,null,"CATEGORIAS",null,"QUANTIDADE"]
[null,null,null,null,null,null,null,null,null,null,null,null,null,null,null,null,{"$f":"IF($C15=Q$11,1,0)","v":0},null,{"$f":"IF($C15=S$11,1,0)","v":0},null,{"$f":"IF($C15=U$11,1,0)","v":0},null,{"$f":"IF($C15=W$11,1,0)","v":0},null,{"$f":"IF($C15=Y$11,1,0)","v":0},null,{"$f":"IF($C15=AA$11,1,0)","v":0},null,{"$f":"IF($C15=AC$11,1,0)","v":0},null,{"$f":"IF($C15=AE$11,1,0)","v":0},null,{"$f":"IF($C15=AG$11,1,0)","v":0},null,{"$f":"IF($C15=AI$11,1,0)","v":0},null,{"$f":"IF($C15=AK$11,1,0)","v":0},null,{"$f":"IF($C15=AM$11,1,0)","v":0},null,{"$f":"IF($C15=AO$11,1,0)","v":0},null,{"$f":"IF($C15=AQ$11,1,0)","v":0},null,{"$f":"IF($C15=AS$11,1,0)","v":0},null,{"$f":"IF($C15=AU$11,1,0)","v":0},null,{"$f":"IF($C15=AW$11,1,0)","v":0},null,{"$f":"IF($C15=AY$11,1,0)","v":0},null,{"$f":"IF($C15=BA$11,1,0)","v":0},null,{"$f":"IF($C15=BC$11,1,0)","v":0},null,{"$f":"IF($C15=BE$11,1,0)","v":0},null,{"$f":"IF($C15=BG$11,1,0)","v":0},null,{"$f":"IF($C15=BI$11,1,0)","v":0},null,{"$f":"IF($C15=BK$11,1,0)","v":0},null,{"$f":"IF($C15=BM$11,1,0)","v":0},null,{"$f":"IF($C15=BO$11,1,0)","v":0},null,{"$f":"IF($C15=BQ$11,1,0)","v":0},null,{"$f":"IF($C15=BS$11,1,0)","v":0},null,{"$f":"IF($C15=BU$11,1,0)","v":0},null,{"$f":"IF($C15=BW$11,1,0)","v":0},null,{"$f":"IF($C15=BY$11,1,0)","v":0},null,{"$f":"IF($C15=CA$11,1,0)","v":0},null,{"$f":"IF($C15=CC$11,1,0)","v":0},null,{"$f":"IF($C15=CE$11,1,0)","v":0},null,{"$f":"IF($C15=CG$11,1,0)","v":0},null,{"$f":"IF($C15=CI$11,1,0)","v":0},null,{"$f":"IF($C15=CK$11,1,0)","v":0},null,{"$f":"IF($C15=CM$11,1,0)","v":0},null,{"$f":"IF($C15=CO$11,1,0)","v":0},null,{"$f":"IF($C15=CQ$11,1,0)","v":0},null,{"$f":"IF($C15=CS$11,1,0)","v":0},null,{"$f":"IF($C15=CU$11,1,0)","v":0},null,{"$f":"IF($C15=CW$11,1,0)","v":0},null,{"$f":"IF($C15=CY$11,1,0)","v":0},null,{"$f":"IF($C15=DA$11,1,0)","v":0},null,{"$f":"IF($C15=DC$11,1,0)","v":0},null,{"$f":"IF($C15=DE$11,1,0)","v":0},null,{"$f":"IF($C15=DG$11,1,0)","v":0},null,{"$f":"IF($C15=DI$11,1,0)","v":0},null,{"$f":"IF($C15=DK$11,1,0)","v":0},null,{"$f":"IF($C15=DM$11,1,0)","v":0},null,{"$f":"IF($C15=DO$11,1,0)","v":0},null,{"$f":"IF($C15=DQ$11,1,0)","v":0},null,{"$f":"IF($C15=DS$11,1,0)","v":0},null,{"$f":"IF($C15=DU$11,1,0)","v":0},null,{"$f":"IF($C15=DW$11,1,0)","v":0},null,{"$f":"IF($C15=DY$11,1,0)","v":0},null,{"$f":"IF($C15=EA$11,1,0)","v":0},null,{"$f":"IF($C15=EC$11,1,0)","v":0},null,{"$f":"IF($C15=EE$11,1,0)","v":0}]
[null,null,null,{"$f":"HLOOKUP($C16,'Dados Gerais'!$D$5:$BJ$10,6)","v":{"$error":"#N/A"}},{"$f":"HLOOKUP($C16,'Dados Gerais'!$D$5:$BJ$14,10)","v":{"$error":"#N/A"}},null,null,null,null,null,null,null,null,null,null,null,{"$f":"IF($C16=Q$11,1,0)","v":0},null,{"$f":"IF($C16=S$11,1,0)","v":0},null,{"$f":"IF($C16=U$11,1,0)","v":0},null,{"$f":"IF($C16=W$11,1,0)","v":0},null,{"$f":"IF($C16=Y$11,1,0)","v":0},null,{"$f":"IF($C16=AA$11,1,0)","v":0},null,{"$f":"IF($C16=AC$11,1,0)","v":0},null,{"$f":"IF($C16=AE$11,1,0)","v":0},null,{"$f":"IF($C16=AG$11,1,0)","v":0},null,{"$f":"IF($C16=AI$11,1,0)","v":0},null,{"$f":"IF($C16=AK$11,1,0)","v":0},null,{"$f":"IF($C16=AM$11,1,0)","v":0},null,{"$f":"IF($C16=AO$11,1,0)","v":0},null,{"$f":"IF($C16=AQ$11,1,0)","v":0},null,{"$f":"IF($C16=AS$11,1,0)","v":0},null,{"$f":"IF($C16=AU$11,1,0)","v":0},null,{"$f":"IF($C16=AW$11,1,0)","v":0},null,{"$f":"IF($C16=AY$11,1,0)","v":0},null,{"$f":"IF($C16=BA$11,1,0)","v":0},null,{"$f":"IF($C16=BC$11,1,0)","v":0},null,{"$f":"IF($C16=BE$11,1,0)","v":0},null,{"$f":"IF($C16=BG$11,1,0)","v":0},null,{"$f":"IF($C16=BI$11,1,0)","v":0},null,{"$f":"IF($C16=BK$11,1,0)","v":0},null,{"$f":"IF($C16=BM$11,1,0)","v":0},null,{"$f":"IF($C16=BO$11,1,0)","v":0},null,{"$f":"IF($C16=BQ$11,1,0)","v":0},null,{"$f":"IF($C16=BS$11,1,0)","v":0},null,{"$f":"IF($C16=BU$11,1,0)","v":0},null,{"$f":"IF($C16=BW$11,1,0)","v":0},null,{"$f":"IF($C16=BY$11,1,0)","v":0},null,{"$f":"IF($C16=CA$11,1,0)","v":0},null,{"$f":"IF($C16=CC$11,1,0)","v":0},null,{"$f":"IF($C16=CE$11,1,0)","v":0},null,{"$f":"IF($C16=CG$11,1,0)","v":0},null,{"$f":"IF($C16=CI$11,1,0)","v":0},null,{"$f":"IF($C16=CK$11,1,0)","v":0},null,{"$f":"IF($C16=CM$11,1,0)","v":0},null,{"$f":"IF($C16=CO$11,1,0)","v":0},null,{"$f":"IF($C16=CQ$11,1,0)","v":0},null,{"$f":"IF($C16=CS$11,1,0)","v":0},null,{"$f":"IF($C16=CU$11,1,0)","v":0},null,{"$f":"IF($C16=CW$11,1,0)","v":0},null,{"$f":"IF($C16=CY$11,1,0)","v":0},null,{"$f":"IF($C16=DA$11,1,0)","v":0},null,{"$f":"IF($C16=DC$11,1,0)","v":0},null,{"$f":"IF($C16=DE$11,1,0)","v":0},null,{"$f":"IF($C16=DG$11,1,0)","v":0},null,{"$f":"IF($C16=DI$11,1,0)","v":0},null,{"$f":"IF($C16=DK$11,1,0)","v":0},null,{"$f":"IF($C16=DM$11,1,0)","v":0},null,{"$f":"IF($C16=DO$11,1,0)","v":0},null,{"$f":"IF($C16=DQ$11,1,0)","v":0},null,{"$f":"IF($C16=DS$11,1,0)","v":0},null,{"$f":"IF($C16=DU$11,1,0)","v":0},null,{"$f":"IF($C16=DW$11,1,0)","v":0},null,{"$f":"IF($C16=DY$11,1,0)","v":0},null,{"$f":"IF($C16=EA$11,1,0)","v":0},null,{"$f":"IF($C16=EC$11,1,0)","v":0},null,{"$f":"IF($C16=EE$11,1,0)","v":0}]
[null,null,null,null,null,null,null,null,null,null,null,null,null,null,null,null,{"$f":"IF($C17=Q$11,1,0)","v":0},null,{"$f":"IF($C17=S$11,1,0)","v":0},null,{"$f":"IF($C17=U$11,1,0)","v":0},null,{"$f":"IF($C17=W$11,1,0)","v":0},null,{"$f":"IF($C17=Y$11,1,0)","v":0},null,{"$f":"IF($C17=AA$11,1,0)","v":0},null,{"$f":"IF($C17=AC$11,1,0)","v":0},null,{"$f":"IF($C17=AE$11,1,0)","v":0},null,{"$f":"IF($C17=AG$11,1,0)","v":0},null,{"$f":"IF($C17=AI$11,1,0)","v":0},null,{"$f":"IF($C17=AK$11,1,0)","v":0},null,{"$f":"IF($C17=AM$11,1,0)","v":0},null,{"$f":"IF($C17=AO$11,1,0)","v":0},null,{"$f":"IF($C17=AQ$11,1,0)","v":0},null,{"$f":"IF($C17=AS$11,1,0)","v":0},null,{"$f":"IF($C17=AU$11,1,0)","v":0},null,{"$f":"IF($C17=AW$11,1,0)","v":0},null,{"$f":"IF($C17=AY$11,1,0)","v":0},null,{"$f":"IF($C17=BA$11,1,0)","v":0},null,{"$f":"IF($C17=BC$11,1,0)","v":0},null,{"$f":"IF($C17=BE$11,1,0)","v":0},null,{"$f":"IF($C17=BG$11,1,0)","v":0},null,{"$f":"IF($C17=BI$11,1,0)","v":0},null,{"$f":"IF($C17=BK$11,1,0)","v":0},null,{"$f":"IF($C17=BM$11,1,0)","v":0},null,{"$f":"IF($C17=BO$11,1,0)","v":0},null,{"$f":"IF($C17=BQ$11,1,0)","v":0},null,{"$f":"IF($C17=BS$11,1,0)","v":0},null,{"$f":"IF($C17=BU$11,1,0)","v":0},null,{"$f":"IF($C17=BW$11,1,0)","v":0},null,{"$f":"IF($C17=BY$11,1,0)","v":0},null,{"$f":"IF($C17=CA$11,1,0)","v":0},null,{"$f":"IF($C17=CC$11,1,0)","v":0},null,{"$f":"IF($C17=CE$11,1,0)","v":0},null,{"$f":"IF($C17=CG$11,1,0)","v":0},null,{"$f":"IF($C17=CI$11,1,0)","v":0},null,{"$f":"IF($C17=CK$11,1,0)","v":0},null,{"$f":"IF($C17=CM$11,1,0)","v":0},null,{"$f":"IF($C17=CO$11,1,0)","v":0},null,{"$f":"IF($C17=CQ$11,1,0)","v":0},null,{"$f":"IF($C17=CS$11,1,0)","v":0},null,{"$f":"IF($C17=CU$11,1,0)","v":0},null,{"$f":"IF($C17=CW$11,1,0)","v":0},null,{"$f":"IF($C17=CY$11,1,0)","v":0},null,{"$f":"IF($C17=DA$11,1,0)","v":0},null,{"$f":"IF($C17=DC$11,1,0)","v":0},null,{"$f":"IF($C17=DE$11,1,0)","v":0},null,{"$f":"IF($C17=DG$11,1,0)","v":0},null,{"$f":"IF($C17=DI$11,1,0)","v":0},null,{"$f":"IF($C17=DK$11,1,0)","v":0},null,{"$f":"IF($C17=DM$11,1,0)","v":0},null,{"$f":"IF($C17=DO$11,1,0)","v":0},null,{"$f":"IF($C17=DQ$11,1,0)","v":0},null,{"$f":"IF($C17=DS$11,1,0)","v":0},null,{"$f":"IF($C17=DU$11,1,0)","v":0},null,{"$f":"IF($C17=DW$11,1,0)","v":0},null,{"$f":"IF($C17=DY$11,1,0)","v":0},null,{"$f":"IF($C17=EA$11,1,0)","v":0},null,{"$f":"IF($C17=EC$11,1,0)","v":0},null,{"$f":"IF($C17=EE$11,1,0)","v":0}]
[]
[null,null,"PAGAMENTO DA DEPRECIAÇÃO"]
[null,null,"ITEM","DESCRIÇÃO","QUANT ANUAL","CONTA SIAFI","VALOR DE AQ.","% RESIDUAL","VIDA ÚTIL","DEP. MENSAL","CUSTO TOTAL","BDI (%)","PREÇO TOTAL","FONTE","REFERÊNCIA"]
[]
[null,null,null,null,null,null,null,null,null,{"$f":"G22*(1-H22)/(I22*12)","v":{"$error":"#DIV/0!"}},{"$f":"J22*E22","v":{"$error":"#DIV/0!"}},{"$f":"BDI!E26","v":5.0700000000000002E-2},{"$f":"ROUND(K22*(1+L22),2)","v":{"$error":"#DIV/0!"}},"COTAÇÃO"]
[]
[]
[null,null,"PAGAMENTO DA MANUTENÇÃO"]
[null,null,"ITEM","DESCRIÇÃO",null,null,null,"K (calculado)","MENSAL DEPR.","% MAN X DEP","MENSAL MAN.","BDI (%)","PREÇO TOTAL"]
[]
[null,null,null,null,null,null,null,{"$f":"H35","v":0.23950080000000007},{"$f":"M22","v":{"$error":"#DIV/0!"}},{"$f":"H28","v":0.23950080000000007},{"$f":"I28*H28","v":{"$error":"#DIV/0!"}},{"$f":"L22","v":5.0700000000000002E-2},{"$f":"ROUND(K28*(1+L28),2)","v":{"$error":"#DIV/0!"}}]
[]
[null,null,null,null,"K1","K2","K3","K4"]
[null,null,null,null,1,1,0.8,0.8]
[null,null,null,null,"K5","K6","K7","K8"]
[null,null,null,null,1,0.6,0.5,1.1000000000000001]
[null,null,null,null,"K9","K10","K11","RESULTADO"]
[null,null,null,"* a descrição de cada coeficiente segue abaixo",0.9,0.9,1.4,{"$f":"E31*F31*G31*H31*E33*F33*G33*H33*E35*F35*G35","v":0.23950080000000007}]
[]
[]
[null,null,"MATERIAL DE CONSUMO ASSOCIADO"]
[null,null,"ITEM","DESCRIÇÃO",null,null,null,"QUANTID/ANO","UNIDADE","VALOR DE AQ.","MENSAL MAT","BDI (%)","PREÇO TOTAL"]
[]
[null,null,null,null,null,null,null,null,null,null,{"$f":"J41*H41/12","v":0},{"$f":"L28","v":5.0700000000000002E-2},{"$f":"ROUND(K41*(1+L41),2)","v":0}]
[]
[]
[null,null,"MATERIAL DE CONSUMO ASSOCIADO"]
[null,null,"ITEM","DESCRIÇÃO",null,null,null,null,null,null,null,null,"PREÇO TOTAL"]
[]
[null,null,1,"Componente DEPRECIAÇÃO - POR POSTO",null,null,null,null,null,null,null,null,{"$f":"M22","v":{"$error":"#DIV/0!"}}]
[null,null,2,"Componente MANUTENÇÃO - POR POSTO",null,null,null,null,null,null,null,null,{"$f":"M28","v":{"$error":"#DIV/0!"}}]
[null,null,3,"Componente MATERIAL DE CONSUMO ASSOCIADO - POR POSTO",null,null,null,null,null,null,null,null,{"$f":"M41","v":0}]
[]
[null,null,null,null,null,null,null,null,null,null,null,"SOMATÓRIO TOTAL MENSAL - POR POSTO",{"$f":"SUM(M46:M50)","v":{"$error":"#DIV/0!"}},null,null,null,null,{"$f":"IF(SUM(Q$15:Q$17)>0,$M51,0)","v":0},null,{"$f":"IF(SUM(S$15:S$17)>0,$M51,0)","v":0},null,{"$f":"IF(SUM(U$15:U$17)>0,$M51,0)","v":0},null,{"$f":"IF(SUM(W$15:W$17)>0,$M51,0)","v":0},null,{"$f":"IF(SUM(Y$15:Y$17)>0,$M51,0)","v":0},null,{"$f":"IF(SUM(AA$15:AA$17)>0,$M51,0)","v":0},null,{"$f":"IF(SUM(AC$15:AC$17)>0,$M51,0)","v":0},null,{"$f":"IF(SUM(AE$15:AE$17)>0,$M51,0)","v":0},null,{"$f":"IF(SUM(AG$15:AG$17)>0,$M51,0)","v":0},null,{"$f":"IF(SUM(AI$15:AI$17)>0,$M51,0)","v":0},null,{"$f":"IF(SUM(AK$15:AK$17)>0,$M51,0)","v":0},null,{"$f":"IF(SUM(AM$15:AM$17)>0,$M51,0)","v":0},null,{"$f":"IF(SUM(AO$15:AO$17)>0,$M51,0)","v":0},null,{"$f":"IF(SUM(AQ$15:AQ$17)>0,$M51,0)","v":0},null,{"$f":"IF(SUM(AS$15:AS$17)>0,$M51,0)","v":0},null,{"$f":"IF(SUM(AU$15:AU$17)>0,$M51,0)","v":0},null,{"$f":"IF(SUM(AW$15:AW$17)>0,$M51,0)","v":0},null,{"$f":"IF(SUM(AY$15:AY$17)>0,$M51,0)","v":0},null,{"$f":"IF(SUM(BA$15:BA$17)>0,$M51,0)","v":0},null,{"$f":"IF(SUM(BC$15:BC$17)>0,$M51,0)","v":0},null,{"$f":"IF(SUM(BE$15:BE$17)>0,$M51,0)","v":0},null,{"$f":"IF(SUM(BG$15:BG$17)>0,$M51,0)","v":0},null,{"$f":"IF(SUM(BI$15:BI$17)>0,$M51,0)","v":0},null,{"$f":"IF(SUM(BK$15:BK$17)>0,$M51,0)","v":0},null,{"$f":"IF(SUM(BM$15:BM$17)>0,$M51,0)","v":0},null,{"$f":"IF(SUM(BO$15:BO$17)>0,$M51,0)","v":0},null,{"$f":"IF(SUM(BQ$15:BQ$17)>0,$M51,0)","v":0},null,{"$f":"IF(SUM(BS$15:BS$17)>0,$M51,0)","v":0},null,{"$f":"IF(SUM(BU$15:BU$17)>0,$M51,0)","v":0},null,{"$f":"IF(SUM(BW$15:BW$17)>0,$M51,0)","v":0},null,{"$f":"IF(SUM(BY$15:BY$17)>0,$M51,0)","v":0},null,{"$f":"IF(SUM(CA$15:CA$17)>0,$M51,0)","v":0},null,{"$f":"IF(SUM(CC$15:CC$17)>0,$M51,0)","v":0},null,{"$f":"IF(SUM(CE$15:CE$17)>0,$M51,0)","v":0},null,{"$f":"IF(SUM(CG$15:CG$17)>0,$M51,0)","v":0},null,{"$f":"IF(SUM(CI$15:CI$17)>0,$M51,0)","v":0},null,{"$f":"IF(SUM(CK$15:CK$17)>0,$M51,0)","v":0},null,{"$f":"IF(SUM(CM$15:CM$17)>0,$M51,0)","v":0},null,{"$f":"IF(SUM(CO$15:CO$17)>0,$M51,0)","v":0},null,{"$f":"IF(SUM(CQ$15:CQ$17)>0,$M51,0)","v":0},null,{"$f":"IF(SUM(CS$15:CS$17)>0,$M51,0)","v":0},null,{"$f":"IF(SUM(CU$15:CU$17)>0,$M51,0)","v":0},null,{"$f":"IF(SUM(CW$15:CW$17)>0,$M51,0)","v":0},null,{"$f":"IF(SUM(CY$15:CY$17)>0,$M51,0)","v":0},null,{"$f":"IF(SUM(DA$15:DA$17)>0,$M51,0)","v":0},null,{"$f":"IF(SUM(DC$15:DC$17)>0,$M51,0)","v":0},null,{"$f":"IF(SUM(DE$15:DE$17)>0,$M51,0)","v":0},null,{"$f":"IF(SUM(DG$15:DG$17)>0,$M51,0)","v":0},null,{"$f":"IF(SUM(DI$15:DI$17)>0,$M51,0)","v":0},null,{"$f":"IF(SUM(DK$15:DK$17)>0,$M51,0)","v":0},null,{"$f":"IF(SUM(DM$15:DM$17)>0,$M51,0)","v":0},null,{"$f":"IF(SUM(DO$15:DO$17)>0,$M51,0)","v":0},null,{"$f":"IF(SUM(DQ$15:DQ$17)>0,$M51,0)","v":0},null,{"$f":"IF(SUM(DS$15:DS$17)>0,$M51,0)","v":0},null,{"$f":"IF(SUM(DU$15:DU$17)>0,$M51,0)","v":0},null,{"$f":"IF(SUM(DW$15:DW$17)>0,$M51,0)","v":0},null,{"$f":"IF(SUM(DY$15:DY$17)>0,$M51,0)","v":0},null,{"$f":"IF(SUM(EA$15:EA$17)>0,$M51,0)","v":0},null,{"$f":"IF(SUM(EC$15:EC$17)>0,$M51,0)","v":0},null,{"$f":"IF(SUM(EE$15:EE$17)>0,$M51,0)","v":0}]
[null,null,null,null,null,null,null,null,null,null,null,"SOMATÓRIO TOTAL ANUAL - POR POSTO",{"$f":"M51*12","v":{"$error":"#DIV/0!"}}]
[]
[]
[null,null,"MATERIAL DE CONSUMO ASSOCIADO"]
[null,null,"MEMÓRIA DE CÁLCULO DO COEFICIENTE DE CORRELAÇÃO MANUTENÇÃO X DEPRECIAÇÃO (K)"]
[]
[null,null,"JUSTIFICATIVAS",null,"TIPO","K1",null,"Condições de Trab","K4",null,"Tempo Vida (anos)","K6",null,"Temperatura","K8"]
[null,null,null,null,"Guindaste",0.5,null,"Em espera",0.4,null,1,0.6,null,"Muito quente (> 40º C)",1.3]
[null,null,"K1","Arbitrado 1","Caminhão-comum",0.8,null,"Leves",0.8,null,2,0.7,null,"Quente (30º a 40º C)",1.1000000000000001]
[null,null,"K2","Considerado o operador médio","Fora-de-estrada",1,null,"Médias",1,null,3,0.8,null,"Médio (10º a 30º C)",1]
[null,null,"K3","Consideradas ferramentas de primeira qualidade","Carregadeira",1,null,"Pesadas",1.4,null,4,0.9,null,"Frio (< 10º C)",1.2]
[null,null,"K4","Consições leves","Escavadeira",1.4,null,"Severas",2,null,5,1]
[null,null,"K5","Considerando manutenção normal","Motoescrêiper",1.1000000000000001,null,null,null,null,6,1,null,"Ritmo de Trabalho","K9"]
[null,null,"K6","Equipamentos novos","Trator de esteira",1.2,null,"Manutenção","K5",null,7,1,null,"Folgado",0.9]
[null,null,"K7","220h por mês, 252 dias por ano",null,null,null,"Excelente",0.6,null,8,1.2,null,"Médio ",1]
[null,null,"K8","Clima quente, acima de 30º C","Qualid do Operador","K2",null,"Boa",0.8,null,9,1.3,null,"Com pressa",1.5]
[null,null,"K9","Ritmo de trabalho usualmente folgado","Excelente",0.8,null,"Média",1,null,10,1.4]
[null,null,"K10","Considerado o operador médio","Boa",0.9,null,"Ruim ",1.5,null,11,2,null,"Conh do Serviço","K10"]
[null,null,"K11","Foi considerada a opção de aluguel a terceiros, ainda que a simulação seja dos custos do contratado, contudo a execução dos serviços é em local de terceiros","Média",1,null,"Inexistente",3,null,15,2,null,"Grande ",0.8]
[null,null,null,null,"Ruim",1.2,null,null,null,null,null,null,null,"Médio     ",0.9]
[null,null,null,null,"Péssima",2,null,"Horas de Uso ","K7",6000,1,null,null,"Pouco ",1]
[null,null,null,null,null,null,null,1000,0.5,8000,1.3]
[null,null,null,null,"Qualidade do Equip","K3",null,2000,0.5,10000,1.6,null,null,"Tipo do Serviço","K11"]
[null,null,null,null,"De primeira",0.8,null,3000,0.6,12000,1.9,null,null,"Mina ou Pedreira",0.8]
[null,null,null,null,"Média",1,null,4000,0.7,15000,2.2999999999999998,null,null,"Construção Geral",1]
[null,null,null,null,"Ruim",1.5,null,5000,0.9,20000,3,null,null,"Aluguel a Terceiros",1.4]
[]
[null,null,null,null,"Fonte: "]
[null,null,null,null,"MATTOS, Aldo Dórea. Como preparar orçamentos de obras. São Paulo: Pini, 2006. 281 p., il"]

{"sheet":"Não Rel - Depr","index":17,"n_rows":95,"n_cols":15,"rows_kept":95,"cut":false,"hidden":true,"merged":[[2,1,2,3],[3,1,3,14]]}
[]
[]
[]
[null,"EQUIPAMENTOS NÃO RELACIONADOS DIRETAMENTE A UM POSTO DE TRABALHO - PAGAMENTO DA DEPRECIAÇÃO / MANUTENÇÃO"]
[]
[]
[null,null,"PAGAMENTO DA DEPRECIAÇÃO"]
[null,null,"ITEM","DESCRIÇÃO","QUANT ANUAL","CONTA SIAFI","VALOR DE AQ.","% RESIDUAL","VIDA ÚTIL","DEP. MENSAL","CUSTO TOTAL","BDI (%)","PREÇO TOTAL","FONTE","REFERÊNCIA"]
[]
[null,null,1,null,null,"12311.01.25",null,0.1,10,{"$f":"G10*(1-H10)/(I10*12)","v":0},{"$f":"J10*E10","v":0},{"$f":"BDI!$E$26","v":5.0700000000000002E-2},{"$f":"ROUND(K10*(1+L10),2)","v":0},"COTAÇÃO"]
[null,null,2,null,null,"12311.01.25",null,0.1,10,0,0,{"$f":"BDI!$E$26","v":5.0700000000000002E-2},0,"COTAÇÃO"]
[null,null,3,null,null,"12311.01.25",null,0.1,10,0,0,{"$f":"BDI!$E$26","v":5.0700000000000002E-2},0,"COTAÇÃO"]
[null,null,4,null,null,"12311.01.25",null,0.1,10,0,0,{"$f":"BDI!$E$26","v":5.0700000000000002E-2},0,"COTAÇÃO"]
[null,null,5,null,null,"12311.01.25",null,0.1,10,0,0,{"$f":"BDI!$E$26","v":5.0700000000000002E-2},0,"COTAÇÃO"]
[null,null,6,null,null,"12311.01.25",null,0.1,10,0,0,{"$f":"BDI!$E$26","v":5.0700000000000002E-2},0,"COTAÇÃO"]
[null,null,7,null,null,"12311.01.25",null,0.1,10,0,0,{"$f":"BDI!$E$26","v":5.0700000000000002E-2},0,"COTAÇÃO"]
[null,null,8,null,null,"12311.01.25",null,0.1,10,0,0,{"$f":"BDI!$E$26","v":5.0700000000000002E-2},0,"COTAÇÃO"]
[null,null,9,null,null,"12311.01.25",null,0.1,10,0,0,{"$f":"BDI!$E$26","v":5.0700000000000002E-2},0,"COTAÇÃO"]
[null,null,10,null,null,"12311.01.25",null,0.1,10,0,0,{"$f":"BDI!$E$26","v":5.0700000000000002E-2},0,"COTAÇÃO"]
[null,null,11,null,null,"12311.01.25",null,0.1,10,0,0,{"$f":"BDI!$E$26","v":5.0700000000000002E-2},0,"COTAÇÃO"]
[null,null,12,null,null,"12311.01.25",null,0.1,10,{"$f":"G21*(1-H21)/(I21*12)","v":0},{"$f":"J21*E21","v":0},{"$f":"BDI!$E$26","v":5.0700000000000002E-2},{"$f":"ROUND(K21*(1+L21),2)","v":0},"COTAÇÃO"]
[null,null,13,null,null,"12311.01.25",null,0.1,10,0,0,{"$f":"BDI!$E$26","v":5.0700000000000002E-2},0,"COTAÇÃO"]
[null,null,14,null,null,"12311.01.25",null,0.1,10,0,0,{"$f":"BDI!$E$26","v":5.0700000000000002E-2},0,"COTAÇÃO"]
[null,null,15,null,null,"12311.01.25",null,0.1,10,0,0,{"$f":"BDI!$E$26","v":5.0700000000000002E-2},0,"COTAÇÃO"]
[null,null,16,null,null,"12311.01.25",null,0.1,10,0,0,{"$f":"BDI!$E$26","v":5.0700000000000002E-2},0,"COTAÇÃO"]
[null,null,17,null,null,"12311.01.25",null,0.1,10,0,0,{"$f":"BDI!$E$26","v":5.0700000000000002E-2},0,"COTAÇÃO"]
[null,null,18,null,null,"12311.01.25",null,0.1,10,0,0,{"$f":"BDI!$E$26","v":5.0700000000000002E-2},0,"COTAÇÃO"]
[null,null,19,null,null,"12311.01.25",null,0.1,10,0,0,{"$f":"BDI!$E$26","v":5.0700000000000002E-2},0,"COTAÇÃO"]
[null,null,20,null,null,"12311.01.25",null,0.1,10,0,0,{"$f":"BDI!$E$26","v":5.0700000000000002E-2},0,"COTAÇÃO"]
[null,null,21,null,null,"12311.01.25",null,0.1,10,0,0,{"$f":"BDI!$E$26","v":5.0700000000000002E-2},0,"COTAÇÃO"]
[null,null,22,null,null,"12311.01.25",null,0.1,10,0,0,{"$f":"BDI!$E$26","v":5.0700000000000002E-2},0,"COTAÇÃO"]
[null,null,23,null,null,"12311.01.25",null,0.1,10,0,0,{"$f":"BDI!$E$26","v":5.0700000000000002E-2},0,"COTAÇÃO"]
[null,null,24,null,null,"12311.01.25",null,0.1,10,0,0,{"$f":"BDI!$E$26","v":5.0700000000000002E-2},0,"COTAÇÃO"]
[null,null,25,null,null,"12311.01.25",null,0.1,10,0,0,{"$f":"BDI!$E$26","v":5.0700000000000002E-2},0,"COTAÇÃO"]
[null,null,26,null,null,"12311.01.25",null,0.1,10,0,0,{"$f":"BDI!$E$26","v":5.0700000000000002E-2},0,"COTAÇÃO"]
[null,null,27,null,null,"12311.01.25",null,0.1,10,0,0,{"$f":"BDI!$E$26","v":5.0700000000000002E-2},0,"COTAÇÃO"]
[null,null,28,null,null,"12311.01.25",null,0.1,10,0,0,{"$f":"BDI!$E$26","v":5.0700000000000002E-2},0,"COTAÇÃO"]
[]
[]
[null,null,"PAGAMENTO DA MANUTENÇÃO"]
[null,null,"ITEM","DESCRIÇÃO",null,null,null,"K (calculado)","MENSAL DEPR.","% MAN X DEP","MENSAL MAN.","BDI (%)","PREÇO TOTAL"]
[]
[null,null,null,null,null,null,null,{"$f":"H50","v":0.42411600000000005},{"$f":"SUM(M10:M37)","v":0},{"$f":"H43","v":0.42411600000000005},{"$f":"I43*H43","v":0},{"$f":"BDI!E26","v":5.0700000000000002E-2},{"$f":"ROUND(K43*(1+L43),2)","v":0}]
[]
[null,null,null,null,"K1","K2","K3","K4"]
[null,null,null,null,0.85,1,0.8,1]
[null,null,null,null,"K5","K6","K7","K8"]
[null,null,null,null,1,0.6,0.5,1.1000000000000001]
[null,null,null,null,"K9","K10","K11","RESULTADO"]
[null,null,null,"* a descrição de cada coeficiente segue abaixo",1.5,0.9,1.4,{"$f":"E46*F46*G46*H46*E48*F48*G48*H48*E50*F50*G50","v":0.42411600000000005}]
[]
[]
[null,null,"MATERIAL DE CONSUMO ASSOCIADO"]
[null,null,"ITEM","DESCRIÇÃO",null,null,null,"QUANTID/ANO","UNIDADE","VALOR DE AQ.","MENSAL MAT","BDI (%)","PREÇO TOTAL"]
[]
[null,null,null,null,null,null,null,null,null,null,{"$f":"J56*H56/12","v":0},{"$f":"BDI!E26","v":5.0700000000000002E-2},{"$f":"ROUND(K56*(1+L56),2)","v":0}]
[]
[]
[null,null,"MATERIAL DE CONSUMO ASSOCIADO"]
[null,null,"ITEM","DESCRIÇÃO",null,null,null,null,null,null,null,null,"PREÇO TOTAL"]
[]
[null,null,1,"Componente DEPRECIAÇÃO",null,null,null,null,null,null,null,null,{"$f":"I43","v":0}]
[null,null,2,"Componente MANUTENÇÃO",null,null,null,null,null,null,null,null,{"$f":"M43","v":0}]
[null,null,3,"Componente MATERIAL DE CONSUMO ASSOCIADO",null,null,null,null,null,null,null,null,{"$f":"M56","v":0}]
[]
[null,null,null,null,null,null,null,null,null,null,null,"SOMATÓRIO TOTAL MENSAL",{"$f":"SUM(M61:M65)","v":0}]
[null,null,null,null,null,null,null,null,null,null,null,"SOMATÓRIO TOTAL ANUAL",{"$f":"M66*12","v":0}]
[]
[]
[null,null,"MATERIAL DE CONSUMO ASSOCIADO"]
[null,null,"MEMÓRIA DE CÁLCULO DO COEFICIENTE DE CORRELAÇÃO MANUTENÇÃO X DEPRECIAÇÃO (K)"]
[]
[null,null,"JUSTIFICATIVAS",null,"TIPO","K1",null,"Condições de Trab","K4",null,"Tempo Vida (anos)","K6",null,"Temperatura","K8"]
[null,null,null,null,"Guindaste",0.5,null,"Em espera",0.4,null,1,0.6,null,"Muito quente (> 40º C)",1.3]
[null,null,"K1","Considerado o valor médio de 0,85","Caminhão-comum",0.8,null,"Leves",0.8,null,2,0.7,null,"Quente (30º a 40º C)",1.1000000000000001]
[null,null,"K2","Considerado o operador médio","Fora-de-estrada",1,null,"Médias",1,null,3,0.8,null,"Médio (10º a 30º C)",1]
[null,null,"K3","Consideradas ferramentas de primeira qualidade","Carregadeira",1,null,"Pesadas",1.4,null,4,0.9,null,"Frio (< 10º C)",1.2]
[null,null,"K4","Há todo o tipo de trabalho, foi considerado o valor médio","Escavadeira",1.4,null,"Severas",2,null,5,1]
[null,null,"K5","Considerando manutenção normal","Motoescrêiper",1.1000000000000001,null,null,null,null,6,1,null,"Ritmo de Trabalho","K9"]
[null,null,"K6","Equipamentos novos","Trator de esteira",1.2,null,"Manutenção","K5",null,7,1,null,"Folgado",0.9]
[null,null,"K7","220h por mês, 252 dias por ano",null,null,null,"Excelente",0.6,null,8,1.2,null,"Médio ",1]
[null,null,"K8","Clima quente, acima de 30º C","Qualid do Operador","K2",null,"Boa",0.8,null,9,1.3,null,"Com pressa",1.5]
[null,null,"K9","Ritmo de trabalho usualmente com pressa","Excelente",0.8,null,"Média",1,null,10,1.4]
[null,null,"K10","Considerado o operador médio","Boa",0.9,null,"Ruim ",1.5,null,11,2,null,"Conh do Serviço","K10"]
[null,null,"K11","Foi considerada a opção de aluguel a terceiros, ainda que a simulação seja dos custos do contratado, contudo a execução dos serviços é em local de terceiros","Média",1,null,"Inexistente",3,null,15,2,null,"Grande ",0.8]
[null,null,null,null,"Ruim",1.2,null,null,null,null,null,null,null,"Médio     ",0.9]
[null,null,null,null,"Péssima",2,null,"Horas de Uso ","K7",6000,1,null,null,"Pouco ",1]
[null,null,null,null,null,null,null,1000,0.5,8000,1.3]
[null,null,null,null,"Qualidade do Equip","K3",null,2000,0.5,10000,1.6,null,null,"Tipo do Serviço","K11"]
[null,null,null,null,"De primeira",0.8,null,3000,0.6,12000,1.9,null,null,"Mina ou Pedreira",0.8]
[null,null,null,null,"Média",1,null,4000,0.7,15000,2.2999999999999998,null,null,"Construção Geral",1]
[null,null,null,null,"Ruim",1.5,null,5000,0.9,20000,3,null,null,"Aluguel a Terceiros",1.4]
[]
[null,null,null,null,"Fonte: "]
[null,null,null,null,"MATTOS, Aldo Dórea. Como preparar orçamentos de obras. São Paulo: Pini, 2006. 281 p., il"]

{"sheet":"Não Rel - Mat Consumo","index":18,"n_rows":50,"n_cols":14,"rows_kept":50,"cut":false,"hidden":true,"merged":[[2,1,2,4],[3,1,3,13]]}
[]
[]
[]
[null,"MATERIAIS NÃO RELACIONADOS DIRETAMENTE A UM POSTO DE TRABALHO - AQUISIÇÃO SOB DEMANDA"]
[]
[]
[null,null,"ITEM","CÓDIGO","DESCRIÇÃO","QUANT MENSAL","QUANT ANUAL","UNIDADE","CUSTO UNITÁRIO","CUSTO TOTAL","BDI (%)","PREÇO TOTAL","FONTE","REFERÊNCIA"]
[]
[null,null,1,null,null,null,null,"Litros",null,{"$f":"I9*G9","v":0},{"$f":"BDI!E26","v":5.0700000000000002E-2},{"$f":"ROUND(J9*(1+K9),2)","v":0},"Cotação"]
[null,null,2,null,null,null,null,"Refil",null,{"$f":"I10*G10","v":0},{"$f":"K9","v":5.0700000000000002E-2},{"$f":"ROUND(J10*(1+K10),2)","v":0},"Cotação"]
[null,null,3,null,null,null,null,"Litros",null,0,{"$f":"K10","v":5.0700000000000002E-2},0,"Cotação"]
[null,null,4,null,null,null,null,"Litros",null,0,5.0700000000000002E-2,0,"Cotação"]
[null,null,5,null,null,null,null,"Litros",null,0,5.0700000000000002E-2,0,"Cotação"]
[null,null,6,null,null,null,null,"Galão",null,0,5.0700000000000002E-2,0,"Cotação"]
[null,null,7,null,null,null,null,"Balde 10 kg",null,0,5.0700000000000002E-2,0,"Cotação"]
[null,null,8,null,null,null,null,"Galão",null,0,5.0700000000000002E-2,0,"Cotação"]
[null,null,9,null,null,null,null,"Frasco",null,0,5.0700000000000002E-2,0,"Cotação"]
[null,null,10,null,null,null,null,"Galão",null,0,5.0700000000000002E-2,0,"Cotação"]
[null,null,11,null,null,null,null,"Unidade",null,0,5.0700000000000002E-2,0,"Cotação"]
[null,null,12,null,null,null,null,"Unidade",null,0,5.0700000000000002E-2,0,"Cotação"]
[null,null,13,null,null,null,null,"Unidade",null,0,5.0700000000000002E-2,0,"Cotação"]
[null,null,14,null,null,null,null,"Unidade",null,0,5.0700000000000002E-2,0,"Cotação"]
[null,null,15,null,null,null,null,"Unidade",null,0,5.0700000000000002E-2,0,"Cotação"]
[null,null,16,null,null,null,null,"Unidade",null,0,5.0700000000000002E-2,0,"Cotação"]
[null,null,17,null,null,null,null,"Unidade",null,0,5.0700000000000002E-2,0,"Cotação"]
[null,null,18,null,null,null,null,"Unidade",null,0,5.0700000000000002E-2,0,"Cotação"]
[null,null,19,null,null,null,null,"Unidade",null,0,5.0700000000000002E-2,0,"Cotação"]
[null,null,20,null,null,null,null,"Rolo",null,0,5.0700000000000002E-2,0,"Cotação"]
[null,null,21,null,null,null,null,"Litros",null,0,5.0700000000000002E-2,0,"Cotação"]
[null,null,22,null,null,null,null,"Frasco",null,0,5.0700000000000002E-2,0,"Cotação"]
[null,null,23,null,null,null,null,"Unidade",null,0,5.0700000000000002E-2,0,"Cotação"]
[null,null,24,null,null,null,null,"Unidade",null,0,5.0700000000000002E-2,0,"Cotação"]
[null,null,25,null,null,null,null,"Unidade",null,0,5.0700000000000002E-2,0,"Cotação"]
[null,null,26,null,null,null,null,"Caixa",null,0,5.0700000000000002E-2,0,"Cotação"]
[null,null,27,null,null,null,null,"Caixa",null,0,5.0700000000000002E-2,0,"Cotação"]
[null,null,28,null,null,null,null,"Galão",null,0,5.0700000000000002E-2,0,"Cotação"]
[null,null,29,null,null,null,null,"Galão",null,0,5.0700000000000002E-2,0,"Cotação"]
[null,null,30,null,null,null,null,"Pacote",null,0,5.0700000000000002E-2,0,"Cotação"]
[null,null,31,null,null,null,null,"Caixa",null,0,5.0700000000000002E-2,0,"Cotação"]
[null,null,32,null,null,null,null,"Galão",null,0,5.0700000000000002E-2,0,"Cotação"]
[null,null,33,null,null,null,null,"Unidade",null,0,5.0700000000000002E-2,0,"Cotação"]
[null,null,34,null,null,null,null,"Unidade",null,{"$f":"I42*G42","v":0},5.0700000000000002E-2,{"$f":"ROUND(J42*(1+K42),2)","v":0},"Cotação"]
[null,null,35,null,null,null,null,"Unidade",null,{"$f":"I43*G43","v":0},5.0700000000000002E-2,{"$f":"ROUND(J43*(1+K43),2)","v":0},"Cotação"]
[null,null,36,null,null,null,null,"Unidade",null,0,5.0700000000000002E-2,0,"Cotação"]
[null,null,37,null,null,null,null,"Unidade",null,0,5.0700000000000002E-2,0,"Cotação"]
[null,null,38,null,null,null,null,"Unidade",null,0,5.0700000000000002E-2,0,"Cotação"]
[null,null,39,null,null,null,null,"Unidade",null,0,5.0700000000000002E-2,0,"Cotação"]
[]
[null,null,null,null,null,null,null,null,null,null,"SOMATÓRIO TOTAL MENSAL",{"$f":"L50/12","v":0}]
[null,null,null,null,null,null,null,null,null,null,"SOMATÓRIO TOTAL ANUAL",{"$f":"SUM(L8:L48)","v":0}]

{"sheet":"Não Rel - Mat Cons Durável","index":19,"n_rows":36,"n_cols":14,"rows_kept":36,"cut":false,"hidden":true,"merged":[[2,1,2,4],[3,1,3,13]]}
[]
[]
[]
[null,"MATERIAIS DE CONSUMO PERMANENTE NÃO RELACIONADOS DIRETAMENTE A UM POSTO DE TRABALHO - AQUISIÇÃO SOB DEMANDA"]
[]
[]
[null,null,"ITEM","CÓDIGO","DESCRIÇÃO","ESTOQUE INICIAL","QUANT ANUAL","UNIDADE","CUSTO UNITÁRIO","CUSTO TOTAL","BDI (%)","PREÇO TOTAL","FONTE","REFERÊNCIA"]
[]
[null,null,1,null,null,null,null,"Unidade",null,{"$f":"I9*G9","v":0},{"$f":"BDI!E26","v":5.0700000000000002E-2},{"$f":"ROUND(J9*(1+K9),2)","v":0},"Cotação"]
[null,null,2,null,null,null,null,"Unidade",null,{"$f":"I10*G10","v":0},{"$f":"K9","v":5.0700000000000002E-2},{"$f":"ROUND(J10*(1+K10),2)","v":0},"Cotação"]
[null,null,3,null,null,null,null,"Unidade",null,0,{"$f":"K10","v":5.0700000000000002E-2},0,"Cotação"]
[null,null,4,null,null,null,null,"Metro",null,0,5.0700000000000002E-2,0,"Cotação"]
[null,null,5,null,null,null,null,"Unidade",null,0,5.0700000000000002E-2,0,"Cotação"]
[null,null,6,null,null,null,null,"Unidade",null,0,5.0700000000000002E-2,0,"Cotação"]
[null,null,7,null,null,null,null,"Unidade",null,0,5.0700000000000002E-2,0,"Cotação"]
[null,null,8,null,null,null,null,"Unidade",null,0,5.0700000000000002E-2,0,"Cotação"]
[null,null,9,null,null,null,null,"Unidade",null,0,5.0700000000000002E-2,0,"Cotação"]
[null,null,10,null,null,null,null,"Unidade",null,0,5.0700000000000002E-2,0,"Cotação"]
[null,null,11,null,null,null,null,"Unidade",null,0,5.0700000000000002E-2,0,"Cotação"]
[null,null,12,null,null,null,null,"Unidade",null,0,5.0700000000000002E-2,0,"Cotação"]
[null,null,13,null,null,null,null,"Unidade",null,0,5.0700000000000002E-2,0,"Cotação"]
[null,null,14,null,null,null,null,"Unidade",null,0,5.0700000000000002E-2,0,"Cotação"]
[null,null,15,null,null,null,null,"Unidade",null,0,5.0700000000000002E-2,0,"Cotação"]
[null,null,16,null,null,null,null,"Unidade",null,0,5.0700000000000002E-2,0,"Cotação"]
[null,null,17,null,null,null,null,"Unidade",null,0,5.0700000000000002E-2,0,"Cotação"]
[null,null,18,null,null,null,null,"Unidade",null,0,5.0700000000000002E-2,0,"Cotação"]
[null,null,19,null,null,null,null,"Unidade",null,0,5.0700000000000002E-2,0,"Cotação"]
[null,null,20,null,null,null,null,"Unidade",null,0,5.0700000000000002E-2,0,"Cotação"]
[null,null,21,null,null,null,null,"Unidade",null,0,5.0700000000000002E-2,0,"Cotação"]
[null,null,22,null,null,null,null,"Unidade",null,0,5.0700000000000002E-2,0,"Cotação"]
[null,null,23,null,null,null,null,"Unidade",null,0,5.0700000000000002E-2,0,"Cotação"]
[null,null,24,null,null,null,null,"Unidade",null,0,5.0700000000000002E-2,0,"Cotação"]
[null,null,25,null,null,null,null,"Unidade",null,0,5.0700000000000002E-2,0,"Cotação"]
[]
[null,null,null,null,null,null,null,null,null,null,"SOMATÓRIO TOTAL MENSAL",{"$f":"L36/12","v":0}]
[null,null,null,null,null,null,null,null,null,null,"SOMATÓRIO TOTAL ANUAL",{"$f":"SUM(L8:L34)","v":0}]

{"sheet":"Não Rel - Serviços","index":20,"n_rows":11,"n_cols":13,"rows_kept":11,"cut":false,"hidden":true,"merged":[[1,1,1,4],[2,1,2,12]]}
[]
[]
[null,"SERVIÇOS NÃO RELACIONADOS DIRETAMENTE A UM POSTO DE TRABALHO - AQUISIÇÃO SOB DEMANDA"]
[]
[]
[null,null,"ITEM","CÓDIGO","DESCRIÇÃO","QUANT ANUAL","UNIDADE","CUSTO UNITÁRIO","CUSTO TOTAL","BDI (%)","PREÇO TOTAL","FONTE","REFERÊNCIA"]
[]
[null,null,1,null,null,null,null,null,{"$f":"H8*F8","v":0},{"$f":"BDI!E17","v":0},{"$f":"ROUND(I8*(1+J8),2)","v":0},"Cotação"]
[]
[null,null,null,null,null,null,null,null,null,"SOMATÓRIO TOTAL MENSAL",{"$f":"K11/12","v":0}]
[null,null,null,null,null,null,null,null,null,"SOMATÓRIO TOTAL ANUAL",{"$f":"SUM(K7:K9)","v":0}]

{"sheet":"Not. Demanda","index":21,"n_rows":59,"n_cols":8,"rows_kept":59,"cut":false,"hidden":true,"merged":[[9,1,9,3],[10,1,10,7]]}
[null,null,"CÂMARA DOS DEPUTADOS"]
[null,null,"DEPARTAMENTO TÉCNICO"]
[null,null,"Coordenação de Planejamento e Gestão"]
[]
[null,null,"Data:",{"$f":"'Dados Gerais'!#REF!","v":{"$error":"#REF!"}}]
[null,null,"Processo:",{"$f":"'Dados Gerais'!#REF!","v":{"$error":"#REF!"}}]
[null,null,"Objeto:",{"$f":"'Dados Gerais'!#REF!","v":{"$error":"#REF!"}}]
[]
[]
[]
[null,"ADICIONAL NOTURNO SOB DEMANDA"]
[]
[]
[null,null,"CATEGORIAS",null,null,null,"HORAS / MÊS","% NOTURNA"]
[]
[null,null,1,{"$f":"HLOOKUP($C16,'Dados Gerais'!$D$5:$BJ$10,6)","v":"ADOLESCENTE APRENDIZ"},null,null,0,0.2]
[null,null,3,{"$f":"HLOOKUP($C17,'Dados Gerais'!$D$5:$BJ$10,6)","v":0},null,null,0,0.2]
[]
[]
[null,null,"AJUSTE DE HORAS FICTAS",null,"AJUSTE H.NOT","HORA NORMAL","H.FICTAS/MÊS","H.ÚTEIS/MÊS"]
[]
[null,null,1,{"$f":"HLOOKUP($C22,'Dados Gerais'!$D$5:$BJ$10,6)","v":"ADOLESCENTE APRENDIZ"},52.5,60,{"$f":"G16*(F22/E22)","v":0},{"$f":"HLOOKUP(C22,'Dados Gerais'!$D$5:$F$16,12,0)","v":100}]
[null,null,3,{"$f":"HLOOKUP($C23,'Dados Gerais'!$D$5:$BJ$10,6)","v":0},52.5,60,{"$f":"G17*(F23/E23)","v":0},{"$f":"HLOOKUP(C23,'Dados Gerais'!$D$5:$F$16,12,0)","v":0}]
[]
[]
[null,null,"VALOR DO ADICIONAL NOTURNO",null,null,"SALÁRIO MÊS","VL.H.NORMAL","ADIC.H.FICTAS"]
[]
[null,null,1,{"$f":"HLOOKUP($C28,'Dados Gerais'!$D$5:$BJ$10,6)","v":"ADOLESCENTE APRENDIZ"},null,{"$f":"HLOOKUP(C28,'Dados Gerais'!$D$5:$F$12,8,0)","v":1320},{"$f":"F28/H22","v":13.2},{"$f":"G28*(H16)","v":2.64}]
[null,null,3,{"$f":"HLOOKUP($C29,'Dados Gerais'!$D$5:$BJ$10,6)","v":0},null,{"$f":"HLOOKUP(C29,'Dados Gerais'!$D$5:$F$12,8,0)","v":0},{"$f":"F29/H23","v":{"$error":"#DIV/0!"}},{"$f":"G29*(H17)","v":{"$error":"#DIV/0!"}}]
[]
[]
[null,null,"RESUMO DO ADICIONAL NOTURNO SOB DEMANDA"]
[null,null,"TOTAIS MENSAIS",null,null,null,"PREÇO MENSAL"]
[]
[null,null,1,{"$f":"HLOOKUP($C35,'Dados Gerais'!$D$5:$BJ$10,6)","v":"ADOLESCENTE APRENDIZ"},null,null,{"$f":"H28*G22","v":0}]
[null,null,3,{"$f":"HLOOKUP($C36,'Dados Gerais'!$D$5:$BJ$10,6)","v":0},null,null,{"$f":"H29*G23","v":{"$error":"#DIV/0!"}}]
[]
[null,null,null,null,null,"SOMATÓRIO TOTAL MENSAL",{"$f":"SUM(G35:G37)","v":{"$error":"#DIV/0!"}}]
[null,null,null,null,null,"SOMATÓRIO TOTAL ANUAL",{"$f":"G38*12","v":{"$error":"#DIV/0!"}}]
[]
[]
[null,null,"ENCARGOS SOCIAIS E BDI SOBRE ADICIONAL NOTURNO SOB DEMANDA"]
[null,null,"TOTAIS MENSAIS",null,null,"PERCENTUAIS","PREÇO MENSAL"]
[]
[null,null,null,"ENCARGOS SOCIAIS",null,{"$f":"'Encargos Sociais (APRENDIZ)'!$E$46","v":0.21829999999999997},{"$f":"F45*G38","v":{"$error":"#DIV/0!"}}]
[null,null,null,"BDI",null,{"$f":"BDI!$E$26","v":5.0700000000000002E-2},{"$f":"F46*(G38+G45)","v":{"$error":"#DIV/0!"}}]
[]
[null,null,null,null,null,"SOMATÓRIO TOTAL MENSAL",{"$f":"SUM(G45:G47)","v":{"$error":"#DIV/0!"}}]
[null,null,null,null,null,"SOMATÓRIO TOTAL ANUAL",{"$f":"G48*12","v":{"$error":"#DIV/0!"}}]
[]
[]
[null,null,"VALOR TOTAL ADICIONAL NOTURNO SOB DEMANDA (COM ENCARGOS SOCIAIS E BDI INCLUSOS)"]
[null,null,"TOTAIS MENSAIS",null,null,"PERCENTUAIS","PREÇO MENSAL"]
[]
[null,null,null,"ENCARGOS SOCIAIS",null,{"$f":"'Encargos Sociais (APRENDIZ)'!$E$46","v":0.21829999999999997},{"$f":"G35+G45","v":{"$error":"#DIV/0!"}}]
[null,null,null,"BDI",null,{"$f":"BDI!$E$26","v":5.0700000000000002E-2},{"$f":"G36+G46","v":{"$error":"#DIV/0!"}}]
[]
[null,null,null,null,null,"SOMATÓRIO TOTAL MENSAL",{"$f":"SUM(G55:G57)","v":{"$error":"#DIV/0!"}}]
[null,null,null,null,null,"SOMATÓRIO TOTAL ANUAL",{"$f":"G58*12","v":{"$error":"#DIV/0!"}}]

{"sheet":"Mat Cons","index":22,"n_rows":28,"n_cols":128,"rows_kept":28,"cut":false,"hidden":true,"merged":[[9,1,9,3],[10,1,10,5]]}
[null,null,"CÂMARA DOS DEPUTADOS"]
[null,null,"DEPARTAMENTO TÉCNICO"]
[null,null,"Coordenação de Planejamento e Gestão"]
[]
[null,null,"Data:",{"$f":"'Dados Gerais'!#REF!","v":{"$error":"#REF!"}}]
[null,null,"Processo:",{"$f":"'Dados Gerais'!#REF!","v":{"$error":"#REF!"}}]
[null,null,"Objeto:",{"$f":"'Dados Gerais'!#REF!","v":{"$error":"#REF!"}}]
[]
[]
[]
[null,"MATERIAIS DE CONSUMO RELACIONADOS AO POSTO - AQUISIÇÃO",null,null,null,null,null,null,1,null,{"$f":"I11+1","v":2},null,{"$f":"K11+1","v":3},null,{"$f":"M11+1","v":4},null,{"$f":"O11+1","v":5},null,{"$f":"Q11+1","v":6},null,{"$f":"S11+1","v":7},null,{"$f":"U11+1","v":8},null,{"$f":"W11+1","v":9},null,{"$f":"Y11+1","v":10},null,{"$f":"AA11+1","v":11},null,{"$f":"AC11+1","v":12},null,{"$f":"AE11+1","v":13},null,{"$f":"AG11+1","v":14},null,{"$f":"AI11+1","v":15},null,{"$f":"AK11+1","v":16},null,{"$f":"AM11+1","v":17},null,{"$f":"AO11+1","v":18},null,{"$f":"AQ11+1","v":19},null,{"$f":"AS11+1","v":20},null,{"$f":"AU11+1","v":21},null,{"$f":"AW11+1","v":22},null,{"$f":"AY11+1","v":23},null,{"$f":"BA11+1","v":24},null,{"$f":"BC11+1","v":25},null,{"$f":"BE11+1","v":26},null,{"$f":"BG11+1","v":27},null,{"$f":"BI11+1","v":28},null,{"$f":"BK11+1","v":29},null,{"$f":"BM11+1","v":30},null,{"$f":"BO11+1","v":31},null,{"$f":"BQ11+1","v":32},null,{"$f":"BS11+1","v":33},null,{"$f":"BU11+1","v":34},null,{"$f":"BW11+1","v":35},null,{"$f":"BY11+1","v":36},null,{"$f":"CA11+1","v":37},null,{"$f":"CC11+1","v":38},null,{"$f":"CE11+1","v":39},null,{"$f":"CG11+1","v":40},null,{"$f":"CI11+1","v":41},null,{"$f":"CK11+1","v":42},null,{"$f":"CM11+1","v":43},null,{"$f":"CO11+1","v":44},null,{"$f":"CQ11+1","v":45},null,{"$f":"CS11+1","v":46},null,{"$f":"CU11+1","v":47},null,{"$f":"CW11+1","v":48},null,{"$f":"CY11+1","v":49},null,{"$f":"DA11+1","v":50},null,{"$f":"DC11+1","v":51},null,{"$f":"DE11+1","v":52},null,{"$f":"DG11+1","v":53},null,{"$f":"DI11+1","v":54},null,{"$f":"DK11+1","v":55},null,{"$f":"DM11+1","v":56},null,{"$f":"DO11+1","v":57},null,{"$f":"DQ11+1","v":58},null,{"$f":"DS11+1","v":59},null,{"$f":"DU11+1","v":60}]
[]
[null,null,null,null,null,null,null,null,{"$f":"ROUND(SUM(J12:J65),2)","v":0},null,{"$f":"ROUND(SUM(L12:L65),2)","v":0},null,{"$f":"ROUND(SUM(N12:N65),2)","v":0},null,{"$f":"ROUND(SUM(P12:P65),2)","v":0},null,{"$f":"ROUND(SUM(R12:R65),2)","v":0},null,{"$f":"ROUND(SUM(T12:T65),2)","v":0},null,{"$f":"ROUND(SUM(V12:V65),2)","v":0},null,{"$f":"ROUND(SUM(X12:X65),2)","v":0},null,{"$f":"ROUND(SUM(Z12:Z65),2)","v":0},null,{"$f":"ROUND(SUM(AB12:AB65),2)","v":0},null,{"$f":"ROUND(SUM(AD12:AD65),2)","v":0},null,{"$f":"ROUND(SUM(AF12:AF65),2)","v":0},null,{"$f":"ROUND(SUM(AH12:AH65),2)","v":0},null,{"$f":"ROUND(SUM(AJ12:AJ65),2)","v":0},null,{"$f":"ROUND(SUM(AL12:AL65),2)","v":0},null,{"$f":"ROUND(SUM(AN12:AN65),2)","v":0},null,{"$f":"ROUND(SUM(AP12:AP65),2)","v":0},null,{"$f":"ROUND(SUM(AR12:AR65),2)","v":0},null,{"$f":"ROUND(SUM(AT12:AT65),2)","v":0},null,{"$f":"ROUND(SUM(AV12:AV65),2)","v":0},null,{"$f":"ROUND(SUM(AX12:AX65),2)","v":0},null,{"$f":"ROUND(SUM(AZ12:AZ65),2)","v":0},null,{"$f":"ROUND(SUM(BB12:BB65),2)","v":0},null,{"$f":"ROUND(SUM(BD12:BD65),2)","v":0},null,{"$f":"ROUND(SUM(BF12:BF65),2)","v":0},null,{"$f":"ROUND(SUM(BH12:BH65),2)","v":0},null,{"$f":"ROUND(SUM(BJ12:BJ65),2)","v":0},null,{"$f":"ROUND(SUM(BL12:BL65),2)","v":0},null,{"$f":"ROUND(SUM(BN12:BN65),2)","v":0},null,{"$f":"ROUND(SUM(BP12:BP65),2)","v":0},null,{"$f":"ROUND(SUM(BR12:BR65),2)","v":0},null,{"$f":"ROUND(SUM(BT12:BT65),2)","v":0},null,{"$f":"ROUND(SUM(BV12:BV65),2)","v":0},null,{"$f":"ROUND(SUM(BX12:BX65),2)","v":0},null,{"$f":"ROUND(SUM(BZ12:BZ65),2)","v":0},null,{"$f":"ROUND(SUM(CB12:CB65),2)","v":0},null,{"$f":"ROUND(SUM(CD12:CD65),2)","v":0},null,{"$f":"ROUND(SUM(CF12:CF65),2)","v":0},null,{"$f":"ROUND(SUM(CH12:CH65),2)","v":0},null,{"$f":"ROUND(SUM(CJ12:CJ65),2)","v":0},null,{"$f":"ROUND(SUM(CL12:CL65),2)","v":0},null,{"$f":"ROUND(SUM(CN12:CN65),2)","v":0},null,{"$f":"ROUND(SUM(CP12:CP65),2)","v":0},null,{"$f":"ROUND(SUM(CR12:CR65),2)","v":0},null,{"$f":"ROUND(SUM(CT12:CT65),2)","v":0},null,{"$f":"ROUND(SUM(CV12:CV65),2)","v":0},null,{"$f":"ROUND(SUM(CX12:CX65),2)","v":0},null,{"$f":"ROUND(SUM(CZ12:CZ65),2)","v":0},null,{"$f":"ROUND(SUM(DB12:DB65),2)","v":0},null,{"$f":"ROUND(SUM(DD12:DD65),2)","v":0},null,{"$f":"ROUND(SUM(DF12:DF65),2)","v":0},null,{"$f":"ROUND(SUM(DH12:DH65),2)","v":0},null,{"$f":"ROUND(SUM(DJ12:DJ65),2)","v":0},null,{"$f":"ROUND(SUM(DL12:DL65),2)","v":0},null,{"$f":"ROUND(SUM(DN12:DN65),2)","v":0},null,{"$f":"ROUND(SUM(DP12:DP65),2)","v":0},null,{"$f":"ROUND(SUM(DR12:DR65),2)","v":0},null,{"$f":"ROUND(SUM(DT12:DT65),2)","v":0},null,{"$f":"ROUND(SUM(DV12:DV65),2)","v":0},null,{"$f":"ROUND(SUM(DX12:DX65),2)","v":0}]
[null,null,"CATEGORIAS",null,null,"QUANTIDADE"]
[null,null,null,null,null,null,null,null,{"$f":"IF($C15=I$11,1,0)","v":0}]
[null,null,null,null,null,null,null,null,0,null,{"$f":"IF($C16=K$11,1,0)","v":0},null,{"$f":"IF($C16=M$11,1,0)","v":0},null,{"$f":"IF($C16=O$11,1,0)","v":0},null,{"$f":"IF($C16=Q$11,1,0)","v":0},null,{"$f":"IF($C16=S$11,1,0)","v":0},null,{"$f":"IF($C16=U$11,1,0)","v":0},null,{"$f":"IF($C16=W$11,1,0)","v":0},null,{"$f":"IF($C16=Y$11,1,0)","v":0},null,{"$f":"IF($C16=AA$11,1,0)","v":0},null,{"$f":"IF($C16=AC$11,1,0)","v":0},null,{"$f":"IF($C16=AE$11,1,0)","v":0},null,{"$f":"IF($C16=AG$11,1,0)","v":0},null,{"$f":"IF($C16=AI$11,1,0)","v":0},null,{"$f":"IF($C16=AK$11,1,0)","v":0},null,{"$f":"IF($C16=AM$11,1,0)","v":0},null,{"$f":"IF($C16=AO$11,1,0)","v":0},null,{"$f":"IF($C16=AQ$11,1,0)","v":0},null,{"$f":"IF($C16=AS$11,1,0)","v":0},null,{"$f":"IF($C16=AU$11,1,0)","v":0},null,{"$f":"IF($C16=AW$11,1,0)","v":0},null,{"$f":"IF($C16=AY$11,1,0)","v":0},null,{"$f":"IF($C16=BA$11,1,0)","v":0},null,{"$f":"IF($C16=BC$11,1,0)","v":0},null,{"$f":"IF($C16=BE$11,1,0)","v":0},null,{"$f":"IF($C16=BG$11,1,0)","v":0},null,{"$f":"IF($C16=BI$11,1,0)","v":0},null,{"$f":"IF($C16=BK$11,1,0)","v":0},null,{"$f":"IF($C16=BM$11,1,0)","v":0},null,{"$f":"IF($C16=BO$11,1,0)","v":0},null,{"$f":"IF($C16=BQ$11,1,0)","v":0},null,{"$f":"IF($C16=BS$11,1,0)","v":0},null,{"$f":"IF($C16=BU$11,1,0)","v":0},null,{"$f":"IF($C16=BW$11,1,0)","v":0},null,{"$f":"IF($C16=BY$11,1,0)","v":0},null,{"$f":"IF($C16=CA$11,1,0)","v":0},null,{"$f":"IF($C16=CC$11,1,0)","v":0},null,{"$f":"IF($C16=CE$11,1,0)","v":0},null,{"$f":"IF($C16=CG$11,1,0)","v":0},null,{"$f":"IF($C16=CI$11,1,0)","v":0},null,{"$f":"IF($C16=CK$11,1,0)","v":0},null,{"$f":"IF($C16=CM$11,1,0)","v":0},null,{"$f":"IF($C16=CO$11,1,0)","v":0},null,{"$f":"IF($C16=CQ$11,1,0)","v":0},null,{"$f":"IF($C16=CS$11,1,0)","v":0},null,{"$f":"IF($C16=CU$11,1,0)","v":0},null,{"$f":"IF($C16=CW$11,1,0)","v":0},null,{"$f":"IF($C16=CY$11,1,0)","v":0},null,{"$f":"IF($C16=DA$11,1,0)","v":0},null,{"$f":"IF($C16=DC$11,1,0)","v":0},null,{"$f":"IF($C16=DE$11,1,0)","v":0},null,{"$f":"IF($C16=DG$11,1,0)","v":0},null,{"$f":"IF($C16=DI$11,1,0)","v":0},null,{"$f":"IF($C16=DK$11,1,0)","v":0},null,{"$f":"IF($C16=DM$11,1,0)","v":0},null,{"$f":"IF($C16=DO$11,1,0)","v":0},null,{"$f":"IF($C16=DQ$11,1,0)","v":0},null,{"$f":"IF($C16=DS$11,1,0)","v":0},null,{"$f":"IF($C16=DU$11,1,0)","v":0},null,{"$f":"IF($C16=DW$11,1,0)","v":0}]
[null,null,null,null,null,null,null,null,0,null,0,null,0,null,0,null,0,null,0,null,0,null,0,null,0,null,0,null,0,null,0,null,0,null,0,null,0,null,0,null,0,null,0,null,0,null,0,null,0,null,0,null,0,null,0,null,0,null,0,null,0,null,0,null,0,null,0,null,0,null,0,null,0,null,0,null,0,null,0,null,0,null,0,null,0,null,0,null,0,null,0,null,0,null,0,null,0,null,0,null,0,null,0,null,0,null,0,null,0,null,0,null,0,null,0,null,0,null,0,null,0,null,0,null,0,null,0]
[null,null,null,null,null,null,null,null,0,null,0,null,0,null,0,null,0,null,0,null,0,null,0,null,0,null,0,null,0,null,0,null,0,null,0,null,0,null,0,null,0,null,0,null,0,null,0,null,0,null,0,null,0,null,0,null,0,null,0,null,0,null,0,null,0,null,0,null,0,null,0,null,0,null,0,null,0,null,0,null,0,null,0,null,0,null,0,null,0,null,0,null,0,null,0,null,0,null,0,null,0,null,0,null,0,null,0,null,0,null,0,null,0,null,0,null,0,null,0,null,0,null,0,null,0,null,0]
[null,null,null,null,null,null,null,null,0,null,0,null,0,null,0,null,0,null,0,null,0,null,0,null,0,null,0,null,0,null,0,null,0,null,0,null,0,null,0,null,0,null,0,null,0,null,0,null,0,null,0,null,0,null,0,null,0,null,0,null,0,null,0,null,0,null,0,null,0,null,0,null,0,null,0,null,0,null,0,null,0,null,0,null,0,null,0,null,0,null,0,null,0,null,0,null,0,null,0,null,0,null,0,null,0,null,0,null,0,null,0,null,0,null,0,null,0,null,0,null,0,null,0,null,0,null,0]
[null,null,null,null,null,null,null,null,0,null,0,null,0,null,0,null,0,null,0,null,0,null,0,null,0,null,0,null,0,null,0,null,0,null,0,null,0,null,0,null,0,null,0,null,0,null,0,null,0,null,0,null,0,null,0,null,0,null,0,null,0,null,0,null,0,null,0,null,0,null,0,null,0,null,0,null,0,null,0,null,0,null,0,null,0,null,0,null,0,null,0,null,0,null,0,null,0,null,0,null,0,null,0,null,0,null,0,null,0,null,0,null,0,null,0,null,0,null,0,null,0,null,0,null,0,null,0]
[null,null,null,null,null,null,null,null,0,null,0,null,0,null,0,null,0,null,0,null,0,null,0,null,0,null,0,null,0,null,0,null,0,null,0,null,0,null,0,null,0,null,0,null,0,null,0,null,0,null,0,null,0,null,0,null,0,null,0,null,0,null,0,null,0,null,0,null,0,null,0,null,0,null,0,null,0,null,0,null,0,null,0,null,0,null,0,null,0,null,0,null,0,null,0,null,0,null,0,null,0,null,0,null,0,null,0,null,0,null,0,null,0,null,0,null,0,null,0,null,0,null,0,null,0,null,0]
[null,null,null,null,null,null,null,null,0]
[]
[null,null,"ITEM","DESCRIÇÃO","QUANT ANUAL","VALOR"]
[null,null,null,null,null,null,null,null,null,{"$f":"IF(SUM(I$15:I$22)>0,$E25*$F25,0)","v":0},null,{"$f":"IF(SUM(K$15:K$22)>0,$E25*$F25,0)","v":0},null,{"$f":"IF(SUM(M$15:M$22)>0,$E25*$F25,0)","v":0},null,{"$f":"IF(SUM(O$15:O$22)>0,$E25*$F25,0)","v":0},null,{"$f":"IF(SUM(Q$15:Q$22)>0,$E25*$F25,0)","v":0},null,{"$f":"IF(SUM(S$15:S$22)>0,$E25*$F25,0)","v":0},null,{"$f":"IF(SUM(U$15:U$22)>0,$E25*$F25,0)","v":0},null,{"$f":"IF(SUM(W$15:W$22)>0,$E25*$F25,0)","v":0},null,{"$f":"IF(SUM(Y$15:Y$22)>0,$E25*$F25,0)","v":0},null,{"$f":"IF(SUM(AA$15:AA$22)>0,$E25*$F25,0)","v":0},null,{"$f":"IF(SUM(AC$15:AC$22)>0,$E25*$F25,0)","v":0},null,{"$f":"IF(SUM(AE$15:AE$22)>0,$E25*$F25,0)","v":0},null,{"$f":"IF(SUM(AG$15:AG$22)>0,$E25*$F25,0)","v":0},null,{"$f":"IF(SUM(AI$15:AI$22)>0,$E25*$F25,0)","v":0},null,{"$f":"IF(SUM(AK$15:AK$22)>0,$E25*$F25,0)","v":0},null,{"$f":"IF(SUM(AM$15:AM$22)>0,$E25*$F25,0)","v":0},null,{"$f":"IF(SUM(AO$15:AO$22)>0,$E25*$F25,0)","v":0},null,{"$f":"IF(SUM(AQ$15:AQ$22)>0,$E25*$F25,0)","v":0},null,{"$f":"IF(SUM(AS$15:AS$22)>0,$E25*$F25,0)","v":0},null,{"$f":"IF(SUM(AU$15:AU$22)>0,$E25*$F25,0)","v":0},null,{"$f":"IF(SUM(AW$15:AW$22)>0,$E25*$F25,0)","v":0},null,{"$f":"IF(SUM(AY$15:AY$22)>0,$E25*$F25,0)","v":0},null,{"$f":"IF(SUM(BA$15:BA$22)>0,$E25*$F25,0)","v":0},null,{"$f":"IF(SUM(BC$15:BC$22)>0,$E25*$F25,0)","v":0},null,{"$f":"IF(SUM(BE$15:BE$22)>0,$E25*$F25,0)","v":0},null,{"$f":"IF(SUM(BG$15:BG$22)>0,$E25*$F25,0)","v":0},null,{"$f":"IF(SUM(BI$15:BI$22)>0,$E25*$F25,0)","v":0},null,{"$f":"IF(SUM(BK$15:BK$22)>0,$E25*$F25,0)","v":0},null,{"$f":"IF(SUM(BM$15:BM$22)>0,$E25*$F25,0)","v":0},null,{"$f":"IF(SUM(BO$15:BO$22)>0,$E25*$F25,0)","v":0},null,{"$f":"IF(SUM(BQ$15:BQ$22)>0,$E25*$F25,0)","v":0},null,{"$f":"IF(SUM(BS$15:BS$22)>0,$E25*$F25,0)","v":0},null,{"$f":"IF(SUM(BU$15:BU$22)>0,$E25*$F25,0)","v":0},null,{"$f":"IF(SUM(BW$15:BW$22)>0,$E25*$F25,0)","v":0},null,{"$f":"IF(SUM(BY$15:BY$22)>0,$E25*$F25,0)","v":0},null,{"$f":"IF(SUM(CA$15:CA$22)>0,$E25*$F25,0)","v":0},null,{"$f":"IF(SUM(CC$15:CC$22)>0,$E25*$F25,0)","v":0},null,{"$f":"IF(SUM(CE$15:CE$22)>0,$E25*$F25,0)","v":0},null,{"$f":"IF(SUM(CG$15:CG$22)>0,$E25*$F25,0)","v":0},null,{"$f":"IF(SUM(CI$15:CI$22)>0,$E25*$F25,0)","v":0},null,{"$f":"IF(SUM(CK$15:CK$22)>0,$E25*$F25,0)","v":0},null,{"$f":"IF(SUM(CM$15:CM$22)>0,$E25*$F25,0)","v":0},null,{"$f":"IF(SUM(CO$15:CO$22)>0,$E25*$F25,0)","v":0},null,{"$f":"IF(SUM(CQ$15:CQ$22)>0,$E25*$F25,0)","v":0},null,{"$f":"IF(SUM(CS$15:CS$22)>0,$E25*$F25,0)","v":0},null,{"$f":"IF(SUM(CU$15:CU$22)>0,$E25*$F25,0)","v":0},null,{"$f":"IF(SUM(CW$15:CW$22)>0,$E25*$F25,0)","v":0},null,{"$f":"IF(SUM(CY$15:CY$22)>0,$E25*$F25,0)","v":0},null,{"$f":"IF(SUM(DA$15:DA$22)>0,$E25*$F25,0)","v":0},null,{"$f":"IF(SUM(DC$15:DC$22)>0,$E25*$F25,0)","v":0},null,{"$f":"IF(SUM(DE$15:DE$22)>0,$E25*$F25,0)","v":0},null,{"$f":"IF(SUM(DG$15:DG$22)>0,$E25*$F25,0)","v":0},null,{"$f":"IF(SUM(DI$15:DI$22)>0,$E25*$F25,0)","v":0},null,{"$f":"IF(SUM(DK$15:DK$22)>0,$E25*$F25,0)","v":0},null,{"$f":"IF(SUM(DM$15:DM$22)>0,$E25*$F25,0)","v":0},null,{"$f":"IF(SUM(DO$15:DO$22)>0,$E25*$F25,0)","v":0},null,{"$f":"IF(SUM(DQ$15:DQ$22)>0,$E25*$F25,0)","v":0},null,{"$f":"IF(SUM(DS$15:DS$22)>0,$E25*$F25,0)","v":0},null,{"$f":"IF(SUM(DU$15:DU$22)>0,$E25*$F25,0)","v":0},null,{"$f":"IF(SUM(DW$15:DW$22)>0,$E25*$F25,0)","v":0}]
[null,null,null,null,null,null,null,null,null,{"$f":"IF(SUM(I$15:I$22)>0,$E26*$F26,0)","v":0},null,{"$f":"IF(SUM(K$15:K$22)>0,$E26*$F26,0)","v":0},null,{"$f":"IF(SUM(M$15:M$22)>0,$E26*$F26,0)","v":0},null,{"$f":"IF(SUM(O$15:O$22)>0,$E26*$F26,0)","v":0},null,{"$f":"IF(SUM(Q$15:Q$22)>0,$E26*$F26,0)","v":0},null,{"$f":"IF(SUM(S$15:S$22)>0,$E26*$F26,0)","v":0},null,{"$f":"IF(SUM(U$15:U$22)>0,$E26*$F26,0)","v":0},null,{"$f":"IF(SUM(W$15:W$22)>0,$E26*$F26,0)","v":0},null,{"$f":"IF(SUM(Y$15:Y$22)>0,$E26*$F26,0)","v":0},null,{"$f":"IF(SUM(AA$15:AA$22)>0,$E26*$F26,0)","v":0},null,{"$f":"IF(SUM(AC$15:AC$22)>0,$E26*$F26,0)","v":0},null,{"$f":"IF(SUM(AE$15:AE$22)>0,$E26*$F26,0)","v":0},null,{"$f":"IF(SUM(AG$15:AG$22)>0,$E26*$F26,0)","v":0},null,{"$f":"IF(SUM(AI$15:AI$22)>0,$E26*$F26,0)","v":0},null,{"$f":"IF(SUM(AK$15:AK$22)>0,$E26*$F26,0)","v":0},null,{"$f":"IF(SUM(AM$15:AM$22)>0,$E26*$F26,0)","v":0},null,{"$f":"IF(SUM(AO$15:AO$22)>0,$E26*$F26,0)","v":0},null,{"$f":"IF(SUM(AQ$15:AQ$22)>0,$E26*$F26,0)","v":0},null,{"$f":"IF(SUM(AS$15:AS$22)>0,$E26*$F26,0)","v":0},null,{"$f":"IF(SUM(AU$15:AU$22)>0,$E26*$F26,0)","v":0},null,{"$f":"IF(SUM(AW$15:AW$22)>0,$E26*$F26,0)","v":0},null,{"$f":"IF(SUM(AY$15:AY$22)>0,$E26*$F26,0)","v":0},null,{"$f":"IF(SUM(BA$15:BA$22)>0,$E26*$F26,0)","v":0},null,{"$f":"IF(SUM(BC$15:BC$22)>0,$E26*$F26,0)","v":0},null,{"$f":"IF(SUM(BE$15:BE$22)>0,$E26*$F26,0)","v":0},null,{"$f":"IF(SUM(BG$15:BG$22)>0,$E26*$F26,0)","v":0},null,{"$f":"IF(SUM(BI$15:BI$22)>0,$E26*$F26,0)","v":0},null,{"$f":"IF(SUM(BK$15:BK$22)>0,$E26*$F26,0)","v":0},null,{"$f":"IF(SUM(BM$15:BM$22)>0,$E26*$F26,0)","v":0},null,{"$f":"IF(SUM(BO$15:BO$22)>0,$E26*$F26,0)","v":0},null,{"$f":"IF(SUM(BQ$15:BQ$22)>0,$E26*$F26,0)","v":0},null,{"$f":"IF(SUM(BS$15:BS$22)>0,$E26*$F26,0)","v":0},null,{"$f":"IF(SUM(BU$15:BU$22)>0,$E26*$F26,0)","v":0},null,{"$f":"IF(SUM(BW$15:BW$22)>0,$E26*$F26,0)","v":0},null,{"$f":"IF(SUM(BY$15:BY$22)>0,$E26*$F26,0)","v":0},null,{"$f":"IF(SUM(CA$15:CA$22)>0,$E26*$F26,0)","v":0},null,{"$f":"IF(SUM(CC$15:CC$22)>0,$E26*$F26,0)","v":0},null,{"$f":"IF(SUM(CE$15:CE$22)>0,$E26*$F26,0)","v":0},null,{"$f":"IF(SUM(CG$15:CG$22)>0,$E26*$F26,0)","v":0},null,{"$f":"IF(SUM(CI$15:CI$22)>0,$E26*$F26,0)","v":0},null,{"$f":"IF(SUM(CK$15:CK$22)>0,$E26*$F26,0)","v":0},null,{"$f":"IF(SUM(CM$15:CM$22)>0,$E26*$F26,0)","v":0},null,{"$f":"IF(SUM(CO$15:CO$22)>0,$E26*$F26,0)","v":0},null,{"$f":"IF(SUM(CQ$15:CQ$22)>0,$E26*$F26,0)","v":0},null,{"$f":"IF(SUM(CS$15:CS$22)>0,$E26*$F26,0)","v":0},null,{"$f":"IF(SUM(CU$15:CU$22)>0,$E26*$F26,0)","v":0},null,{"$f":"IF(SUM(CW$15:CW$22)>0,$E26*$F26,0)","v":0},null,{"$f":"IF(SUM(CY$15:CY$22)>0,$E26*$F26,0)","v":0},null,{"$f":"IF(SUM(DA$15:DA$22)>0,$E26*$F26,0)","v":0},null,{"$f":"IF(SUM(DC$15:DC$22)>0,$E26*$F26,0)","v":0},null,{"$f":"IF(SUM(DE$15:DE$22)>0,$E26*$F26,0)","v":0},null,{"$f":"IF(SUM(DG$15:DG$22)>0,$E26*$F26,0)","v":0},null,{"$f":"IF(SUM(DI$15:DI$22)>0,$E26*$F26,0)","v":0},null,{"$f":"IF(SUM(DK$15:DK$22)>0,$E26*$F26,0)","v":0},null,{"$f":"IF(SUM(DM$15:DM$22)>0,$E26*$F26,0)","v":0},null,{"$f":"IF(SUM(DO$15:DO$22)>0,$E26*$F26,0)","v":0},null,{"$f":"IF(SUM(DQ$15:DQ$22)>0,$E26*$F26,0)","v":0},null,{"$f":"IF(SUM(DS$15:DS$22)>0,$E26*$F26,0)","v":0},null,{"$f":"IF(SUM(DU$15:DU$22)>0,$E26*$F26,0)","v":0},null,{"$f":"IF(SUM(DW$15:DW$22)>0,$E26*$F26,0)","v":0}]
[null,null,null,null,null,null,null,null,null,{"$f":"IF(SUM(I$15:I$22)>0,$E27*$F27,0)","v":0},null,{"$f":"IF(SUM(K$15:K$22)>0,$E27*$F27,0)","v":0},null,{"$f":"IF(SUM(M$15:M$22)>0,$E27*$F27,0)","v":0},null,{"$f":"IF(SUM(O$15:O$22)>0,$E27*$F27,0)","v":0},null,{"$f":"IF(SUM(Q$15:Q$22)>0,$E27*$F27,0)","v":0},null,{"$f":"IF(SUM(S$15:S$22)>0,$E27*$F27,0)","v":0},null,{"$f":"IF(SUM(U$15:U$22)>0,$E27*$F27,0)","v":0},null,{"$f":"IF(SUM(W$15:W$22)>0,$E27*$F27,0)","v":0},null,{"$f":"IF(SUM(Y$15:Y$22)>0,$E27*$F27,0)","v":0},null,{"$f":"IF(SUM(AA$15:AA$22)>0,$E27*$F27,0)","v":0},null,{"$f":"IF(SUM(AC$15:AC$22)>0,$E27*$F27,0)","v":0},null,{"$f":"IF(SUM(AE$15:AE$22)>0,$E27*$F27,0)","v":0},null,{"$f":"IF(SUM(AG$15:AG$22)>0,$E27*$F27,0)","v":0},null,{"$f":"IF(SUM(AI$15:AI$22)>0,$E27*$F27,0)","v":0},null,{"$f":"IF(SUM(AK$15:AK$22)>0,$E27*$F27,0)","v":0},null,{"$f":"IF(SUM(AM$15:AM$22)>0,$E27*$F27,0)","v":0},null,{"$f":"IF(SUM(AO$15:AO$22)>0,$E27*$F27,0)","v":0},null,{"$f":"IF(SUM(AQ$15:AQ$22)>0,$E27*$F27,0)","v":0},null,{"$f":"IF(SUM(AS$15:AS$22)>0,$E27*$F27,0)","v":0},null,{"$f":"IF(SUM(AU$15:AU$22)>0,$E27*$F27,0)","v":0},null,{"$f":"IF(SUM(AW$15:AW$22)>0,$E27*$F27,0)","v":0},null,{"$f":"IF(SUM(AY$15:AY$22)>0,$E27*$F27,0)","v":0},null,{"$f":"IF(SUM(BA$15:BA$22)>0,$E27*$F27,0)","v":0},null,{"$f":"IF(SUM(BC$15:BC$22)>0,$E27*$F27,0)","v":0},null,{"$f":"IF(SUM(BE$15:BE$22)>0,$E27*$F27,0)","v":0},null,{"$f":"IF(SUM(BG$15:BG$22)>0,$E27*$F27,0)","v":0},null,{"$f":"IF(SUM(BI$15:BI$22)>0,$E27*$F27,0)","v":0},null,{"$f":"IF(SUM(BK$15:BK$22)>0,$E27*$F27,0)","v":0},null,{"$f":"IF(SUM(BM$15:BM$22)>0,$E27*$F27,0)","v":0},null,{"$f":"IF(SUM(BO$15:BO$22)>0,$E27*$F27,0)","v":0},null,{"$f":"IF(SUM(BQ$15:BQ$22)>0,$E27*$F27,0)","v":0},null,{"$f":"IF(SUM(BS$15:BS$22)>0,$E27*$F27,0)","v":0},null,{"$f":"IF(SUM(BU$15:BU$22)>0,$E27*$F27,0)","v":0},null,{"$f":"IF(SUM(BW$15:BW$22)>0,$E27*$F27,0)","v":0},null,{"$f":"IF(SUM(BY$15:BY$22)>0,$E27*$F27,0)","v":0},null,{"$f":"IF(SUM(CA$15:CA$22)>0,$E27*$F27,0)","v":0},null,{"$f":"IF(SUM(CC$15:CC$22)>0,$E27*$F27,0)","v":0},null,{"$f":"IF(SUM(CE$15:CE$22)>0,$E27*$F27,0)","v":0},null,{"$f":"IF(SUM(CG$15:CG$22)>0,$E27*$F27,0)","v":0},null,{"$f":"IF(SUM(CI$15:CI$22)>0,$E27*$F27,0)","v":0},null,{"$f":"IF(SUM(CK$15:CK$22)>0,$E27*$F27,0)","v":0},null,{"$f":"IF(SUM(CM$15:CM$22)>0,$E27*$F27,0)","v":0},null,{"$f":"IF(SUM(CO$15:CO$22)>0,$E27*$F27,0)","v":0},null,{"$f":"IF(SUM(CQ$15:CQ$22)>0,$E27*$F27,0)","v":0},null,{"$f":"IF(SUM(CS$15:CS$22)>0,$E27*$F27,0)","v":0},null,{"$f":"IF(SUM(CU$15:CU$22)>0,$E27*$F27,0)","v":0},null,{"$f":"IF(SUM(CW$15:CW$22)>0,$E27*$F27,0)","v":0},null,{"$f":"IF(SUM(CY$15:CY$22)>0,$E27*$F27,0)","v":0},null,{"$f":"IF(SUM(DA$15:DA$22)>0,$E27*$F27,0)","v":0},null,{"$f":"IF(SUM(DC$15:DC$22)>0,$E27*$F27,0)","v":0},null,{"$f":"IF(SUM(DE$15:DE$22)>0,$E27*$F27,0)","v":0},null,{"$f":"IF(SUM(DG$15:DG$22)>0,$E27*$F27,0)","v":0},null,{"$f":"IF(SUM(DI$15:DI$22)>0,$E27*$F27,0)","v":0},null,{"$f":"IF(SUM(DK$15:DK$22)>0,$E27*$F27,0)","v":0},null,{"$f":"IF(SUM(DM$15:DM$22)>0,$E27*$F27,0)","v":0},null,{"$f":"IF(SUM(DO$15:DO$22)>0,$E27*$F27,0)","v":0},null,{"$f":"IF(SUM(DQ$15:DQ$22)>0,$E27*$F27,0)","v":0},null,{"$f":"IF(SUM(DS$15:DS$22)>0,$E27*$F27,0)","v":0},null,{"$f":"IF(SUM(DU$15:DU$22)>0,$E27*$F27,0)","v":0},null,{"$f":"IF(SUM(DW$15:DW$22)>0,$E27*$F27,0)","v":0}]
[null,null,null,null,null,null,null,null,null,{"$f":"IF(SUM(I$15:I$22)>0,$E28*$F28,0)","v":0},null,{"$f":"IF(SUM(K$15:K$22)>0,$E28*$F28,0)","v":0},null,{"$f":"IF(SUM(M$15:M$22)>0,$E28*$F28,0)","v":0},null,{"$f":"IF(SUM(O$15:O$22)>0,$E28*$F28,0)","v":0},null,{"$f":"IF(SUM(Q$15:Q$22)>0,$E28*$F28,0)","v":0},null,{"$f":"IF(SUM(S$15:S$22)>0,$E28*$F28,0)","v":0},null,{"$f":"IF(SUM(U$15:U$22)>0,$E28*$F28,0)","v":0},null,{"$f":"IF(SUM(W$15:W$22)>0,$E28*$F28,0)","v":0},null,{"$f":"IF(SUM(Y$15:Y$22)>0,$E28*$F28,0)","v":0},null,{"$f":"IF(SUM(AA$15:AA$22)>0,$E28*$F28,0)","v":0},null,{"$f":"IF(SUM(AC$15:AC$22)>0,$E28*$F28,0)","v":0},null,{"$f":"IF(SUM(AE$15:AE$22)>0,$E28*$F28,0)","v":0},null,{"$f":"IF(SUM(AG$15:AG$22)>0,$E28*$F28,0)","v":0},null,{"$f":"IF(SUM(AI$15:AI$22)>0,$E28*$F28,0)","v":0},null,{"$f":"IF(SUM(AK$15:AK$22)>0,$E28*$F28,0)","v":0},null,{"$f":"IF(SUM(AM$15:AM$22)>0,$E28*$F28,0)","v":0},null,{"$f":"IF(SUM(AO$15:AO$22)>0,$E28*$F28,0)","v":0},null,{"$f":"IF(SUM(AQ$15:AQ$22)>0,$E28*$F28,0)","v":0},null,{"$f":"IF(SUM(AS$15:AS$22)>0,$E28*$F28,0)","v":0},null,{"$f":"IF(SUM(AU$15:AU$22)>0,$E28*$F28,0)","v":0},null,{"$f":"IF(SUM(AW$15:AW$22)>0,$E28*$F28,0)","v":0},null,{"$f":"IF(SUM(AY$15:AY$22)>0,$E28*$F28,0)","v":0},null,{"$f":"IF(SUM(BA$15:BA$22)>0,$E28*$F28,0)","v":0},null,{"$f":"IF(SUM(BC$15:BC$22)>0,$E28*$F28,0)","v":0},null,{"$f":"IF(SUM(BE$15:BE$22)>0,$E28*$F28,0)","v":0},null,{"$f":"IF(SUM(BG$15:BG$22)>0,$E28*$F28,0)","v":0},null,{"$f":"IF(SUM(BI$15:BI$22)>0,$E28*$F28,0)","v":0},null,{"$f":"IF(SUM(BK$15:BK$22)>0,$E28*$F28,0)","v":0},null,{"$f":"IF(SUM(BM$15:BM$22)>0,$E28*$F28,0)","v":0},null,{"$f":"IF(SUM(BO$15:BO$22)>0,$E28*$F28,0)","v":0},null,{"$f":"IF(SUM(BQ$15:BQ$22)>0,$E28*$F28,0)","v":0},null,{"$f":"IF(SUM(BS$15:BS$22)>0,$E28*$F28,0)","v":0},null,{"$f":"IF(SUM(BU$15:BU$22)>0,$E28*$F28,0)","v":0},null,{"$f":"IF(SUM(BW$15:BW$22)>0,$E28*$F28,0)","v":0},null,{"$f":"IF(SUM(BY$15:BY$22)>0,$E28*$F28,0)","v":0},null,{"$f":"IF(SUM(CA$15:CA$22)>0,$E28*$F28,0)","v":0},null,{"$f":"IF(SUM(CC$15:CC$22)>0,$E28*$F28,0)","v":0},null,{"$f":"IF(SUM(CE$15:CE$22)>0,$E28*$F28,0)","v":0},null,{"$f":"IF(SUM(CG$15:CG$22)>0,$E28*$F28,0)","v":0},null,{"$f":"IF(SUM(CI$15:CI$22)>0,$E28*$F28,0)","v":0},null,{"$f":"IF(SUM(CK$15:CK$22)>0,$E28*$F28,0)","v":0},null,{"$f":"IF(SUM(CM$15:CM$22)>0,$E28*$F28,0)","v":0},null,{"$f":"IF(SUM(CO$15:CO$22)>0,$E28*$F28,0)","v":0},null,{"$f":"IF(SUM(CQ$15:CQ$22)>0,$E28*$F28,0)","v":0},null,{"$f":"IF(SUM(CS$15:CS$22)>0,$E28*$F28,0)","v":0},null,{"$f":"IF(SUM(CU$15:CU$22)>0,$E28*$F28,0)","v":0},null,{"$f":"IF(SUM(CW$15:CW$22)>0,$E28*$F28,0)","v":0},null,{"$f":"IF(SUM(CY$15:CY$22)>0,$E28*$F28,0)","v":0},null,{"$f":"IF(SUM(DA$15:DA$22)>0,$E28*$F28,0)","v":0},null,{"$f":"IF(SUM(DC$15:DC$22)>0,$E28*$F28,0)","v":0},null,{"$f":"IF(SUM(DE$15:DE$22)>0,$E28*$F28,0)","v":0},null,{"$f":"IF(SUM(DG$15:DG$22)>0,$E28*$F28,0)","v":0},null,{"$f":"IF(SUM(DI$15:DI$22)>0,$E28*$F28,0)","v":0},null,{"$f":"IF(SUM(DK$15:DK$22)>0,$E28*$F28,0)","v":0},null,{"$f":"IF(SUM(DM$15:DM$22)>0,$E28*$F28,0)","v":0},null,{"$f":"IF(SUM(DO$15:DO$22)>0,$E28*$F28,0)","v":0},null,{"$f":"IF(SUM(DQ$15:DQ$22)>0,$E28*$F28,0)","v":0},null,{"$f":"IF(SUM(DS$15:DS$22)>0,$E28*$F28,0)","v":0},null,{"$f":"IF(SUM(DU$15:DU$22)>0,$E28*$F28,0)","v":0},null,{"$f":"IF(SUM(DW$15:DW$22)>0,$E28*$F28,0)","v":0}]

{"sheet":"Mat Perm","index":23,"n_rows":113,"n_cols":136,"rows_kept":113,"cut":false,"hidden":true,"merged":[[9,1,9,3],[10,1,10,14]]}
[null,null,"CÂMARA DOS DEPUTADOS"]
[null,null,"DEPARTAMENTO TÉCNICO"]
[null,null,"Coordenação de Planejamento e Gestão"]
[]
[null,null,"Data:",{"$f":"'Dados Gerais'!#REF!","v":{"$error":"#REF!"}}]
[null,null,"Processo:",{"$f":"'Dados Gerais'!#REF!","v":{"$error":"#REF!"}}]
[null,null,"Objeto:",{"$f":"'Dados Gerais'!#REF!","v":{"$error":"#REF!"}}]
[]
[]
[]
[null,"MATERIAIS PERMANENTES RELACIONADOS AO POSTO - PAGAMENTO DA DEPRECIAÇÃO / MANUTENÇÃO",null,null,null,null,null,null,null,null,null,null,null,null,null,null,1,null,{"$f":"Q11+1","v":2},null,{"$f":"S11+1","v":3},null,{"$f":"U11+1","v":4},null,{"$f":"W11+1","v":5},null,{"$f":"Y11+1","v":6},null,{"$f":"AA11+1","v":7},null,{"$f":"AC11+1","v":8},null,{"$f":"AE11+1","v":9},null,{"$f":"AG11+1","v":10},null,{"$f":"AI11+1","v":11},null,{"$f":"AK11+1","v":12},null,{"$f":"AM11+1","v":13},null,{"$f":"AO11+1","v":14},null,{"$f":"AQ11+1","v":15},null,{"$f":"AS11+1","v":16},null,{"$f":"AU11+1","v":17},null,{"$f":"AW11+1","v":18},null,{"$f":"AY11+1","v":19},null,{"$f":"BA11+1","v":20},null,{"$f":"BC11+1","v":21},null,{"$f":"BE11+1","v":22},null,{"$f":"BG11+1","v":23},null,{"$f":"BI11+1","v":24},null,{"$f":"BK11+1","v":25},null,{"$f":"BM11+1","v":26},null,{"$f":"BO11+1","v":27},null,{"$f":"BQ11+1","v":28},null,{"$f":"BS11+1","v":29},null,{"$f":"BU11+1","v":30},null,{"$f":"BW11+1","v":31},null,{"$f":"BY11+1","v":32},null,{"$f":"CA11+1","v":33},null,{"$f":"CC11+1","v":34},null,{"$f":"CE11+1","v":35},null,{"$f":"CG11+1","v":36},null,{"$f":"CI11+1","v":37},null,{"$f":"CK11+1","v":38},null,{"$f":"CM11+1","v":39},null,{"$f":"CO11+1","v":40},null,{"$f":"CQ11+1","v":41},null,{"$f":"CS11+1","v":42},null,{"$f":"CU11+1","v":43},null,{"$f":"CW11+1","v":44},null,{"$f":"CY11+1","v":45},null,{"$f":"DA11+1","v":46},null,{"$f":"DC11+1","v":47},null,{"$f":"DE11+1","v":48},null,{"$f":"DG11+1","v":49},null,{"$f":"DI11+1","v":50},null,{"$f":"DK11+1","v":51},null,{"$f":"DM11+1","v":52},null,{"$f":"DO11+1","v":53},null,{"$f":"DQ11+1","v":54},null,{"$f":"DS11+1","v":55},null,{"$f":"DU11+1","v":56},null,{"$f":"DW11+1","v":57},null,{"$f":"DY11+1","v":58},null,{"$f":"EA11+1","v":59},null,{"$f":"EC11+1","v":60}]
[]
[null,null,null,null,null,null,null,null,null,null,null,null,null,null,null,null,{"$f":"SUM(R12:R94)","v":0},null,{"$f":"SUM(T12:T94)","v":0},null,{"$f":"SUM(V12:V94)","v":0},null,{"$f":"SUM(X12:X94)","v":0},null,{"$f":"SUM(Z12:Z94)","v":0},null,{"$f":"SUM(AB12:AB94)","v":0},null,{"$f":"SUM(AD12:AD94)","v":0},null,{"$f":"SUM(AF12:AF94)","v":0},null,{"$f":"SUM(AH12:AH94)","v":0},null,{"$f":"SUM(AJ12:AJ94)","v":0},null,{"$f":"SUM(AL12:AL94)","v":0},null,{"$f":"SUM(AN12:AN94)","v":0},null,{"$f":"SUM(AP12:AP94)","v":0},null,{"$f":"SUM(AR12:AR94)","v":0},null,{"$f":"SUM(AT12:AT94)","v":0},null,{"$f":"SUM(AV12:AV94)","v":0},null,{"$f":"SUM(AX12:AX94)","v":0},null,{"$f":"SUM(AZ12:AZ94)","v":0},null,{"$f":"SUM(BB12:BB94)","v":0},null,{"$f":"SUM(BD12:BD94)","v":0},null,{"$f":"SUM(BF12:BF94)","v":0},null,{"$f":"SUM(BH12:BH94)","v":0},null,{"$f":"SUM(BJ12:BJ94)","v":0},null,{"$f":"SUM(BL12:BL94)","v":0},null,{"$f":"SUM(BN12:BN94)","v":0},null,{"$f":"SUM(BP12:BP94)","v":0},null,{"$f":"SUM(BR12:BR94)","v":0},null,{"$f":"SUM(BT12:BT94)","v":0},null,{"$f":"SUM(BV12:BV94)","v":0},null,{"$f":"SUM(BX12:BX94)","v":0},null,{"$f":"SUM(BZ12:BZ94)","v":0},null,{"$f":"SUM(CB12:CB94)","v":0},null,{"$f":"SUM(CD12:CD94)","v":0},null,{"$f":"SUM(CF12:CF94)","v":0},null,{"$f":"SUM(CH12:CH94)","v":0},null,{"$f":"SUM(CJ12:CJ94)","v":0},null,{"$f":"SUM(CL12:CL94)","v":0},null,{"$f":"SUM(CN12:CN94)","v":0},null,{"$f":"SUM(CP12:CP94)","v":0},null,{"$f":"SUM(CR12:CR94)","v":0},null,{"$f":"SUM(CT12:CT94)","v":0},null,{"$f":"SUM(CV12:CV94)","v":0},null,{"$f":"SUM(CX12:CX94)","v":0},null,{"$f":"SUM(CZ12:CZ94)","v":0},null,{"$f":"SUM(DB12:DB94)","v":0},null,{"$f":"SUM(DD12:DD94)","v":0},null,{"$f":"SUM(DF12:DF94)","v":0},null,{"$f":"SUM(DH12:DH94)","v":0},null,{"$f":"SUM(DJ12:DJ94)","v":0},null,{"$f":"SUM(DL12:DL94)","v":0},null,{"$f":"SUM(DN12:DN94)","v":0},null,{"$f":"SUM(DP12:DP94)","v":0},null,{"$f":"SUM(DR12:DR94)","v":0},null,{"$f":"SUM(DT12:DT94)","v":0},null,{"$f":"SUM(DV12:DV94)","v":0},null,{"$f":"SUM(DX12:DX94)","v":0},null,{"$f":"SUM(DZ12:DZ94)","v":0},null,{"$f":"SUM(EB12:EB94)","v":0},null,{"$f":"SUM(ED12:ED94)","v":0},null,{"$f":"SUM(EF12:EF94)","v":0}]
[null,null,"CATEGORIAS",null,"QUANTIDADE"]
[null,null,null,null,null,null,null,null,null,null,null,null,null,null,null,null,{"$f":"IF($C15=Q$11,1,0)","v":0},null,{"$f":"IF($C15=S$11,1,0)","v":0},null,{"$f":"IF($C15=U$11,1,0)","v":0},null,{"$f":"IF($C15=W$11,1,0)","v":0},null,{"$f":"IF($C15=Y$11,1,0)","v":0},null,{"$f":"IF($C15=AA$11,1,0)","v":0},null,{"$f":"IF($C15=AC$11,1,0)","v":0},null,{"$f":"IF($C15=AE$11,1,0)","v":0},null,{"$f":"IF($C15=AG$11,1,0)","v":0},null,{"$f":"IF($C15=AI$11,1,0)","v":0},null,{"$f":"IF($C15=AK$11,1,0)","v":0},null,{"$f":"IF($C15=AM$11,1,0)","v":0},null,{"$f":"IF($C15=AO$11,1,0)","v":0},null,{"$f":"IF($C15=AQ$11,1,0)","v":0},null,{"$f":"IF($C15=AS$11,1,0)","v":0},null,{"$f":"IF($C15=AU$11,1,0)","v":0},null,{"$f":"IF($C15=AW$11,1,0)","v":0},null,{"$f":"IF($C15=AY$11,1,0)","v":0},null,{"$f":"IF($C15=BA$11,1,0)","v":0},null,{"$f":"IF($C15=BC$11,1,0)","v":0},null,{"$f":"IF($C15=BE$11,1,0)","v":0},null,{"$f":"IF($C15=BG$11,1,0)","v":0},null,{"$f":"IF($C15=BI$11,1,0)","v":0},null,{"$f":"IF($C15=BK$11,1,0)","v":0},null,{"$f":"IF($C15=BM$11,1,0)","v":0},null,{"$f":"IF($C15=BO$11,1,0)","v":0},null,{"$f":"IF($C15=BQ$11,1,0)","v":0},null,{"$f":"IF($C15=BS$11,1,0)","v":0},null,{"$f":"IF($C15=BU$11,1,0)","v":0},null,{"$f":"IF($C15=BW$11,1,0)","v":0},null,{"$f":"IF($C15=BY$11,1,0)","v":0},null,{"$f":"IF($C15=CA$11,1,0)","v":0},null,{"$f":"IF($C15=CC$11,1,0)","v":0},null,{"$f":"IF($C15=CE$11,1,0)","v":0},null,{"$f":"IF($C15=CG$11,1,0)","v":0},null,{"$f":"IF($C15=CI$11,1,0)","v":0},null,{"$f":"IF($C15=CK$11,1,0)","v":0},null,{"$f":"IF($C15=CM$11,1,0)","v":0},null,{"$f":"IF($C15=CO$11,1,0)","v":0},null,{"$f":"IF($C15=CQ$11,1,0)","v":0},null,{"$f":"IF($C15=CS$11,1,0)","v":0},null,{"$f":"IF($C15=CU$11,1,0)","v":0},null,{"$f":"IF($C15=CW$11,1,0)","v":0},null,{"$f":"IF($C15=CY$11,1,0)","v":0},null,{"$f":"IF($C15=DA$11,1,0)","v":0},null,{"$f":"IF($C15=DC$11,1,0)","v":0},null,{"$f":"IF($C15=DE$11,1,0)","v":0},null,{"$f":"IF($C15=DG$11,1,0)","v":0},null,{"$f":"IF($C15=DI$11,1,0)","v":0},null,{"$f":"IF($C15=DK$11,1,0)","v":0},null,{"$f":"IF($C15=DM$11,1,0)","v":0},null,{"$f":"IF($C15=DO$11,1,0)","v":0},null,{"$f":"IF($C15=DQ$11,1,0)","v":0},null,{"$f":"IF($C15=DS$11,1,0)","v":0},null,{"$f":"IF($C15=DU$11,1,0)","v":0},null,{"$f":"IF($C15=DW$11,1,0)","v":0},null,{"$f":"IF($C15=DY$11,1,0)","v":0},null,{"$f":"IF($C15=EA$11,1,0)","v":0},null,{"$f":"IF($C15=EC$11,1,0)","v":0},null,{"$f":"IF($C15=EE$11,1,0)","v":0}]
[null,null,null,{"$f":"HLOOKUP($C16,'Dados Gerais'!$D$5:$BJ$10,6)","v":{"$error":"#N/A"}},{"$f":"HLOOKUP($C16,'Dados Gerais'!$D$5:$BJ$14,10)","v":{"$error":"#N/A"}},null,null,null,null,null,null,null,null,null,null,null,0,null,0,null,0,null,0,null,0,null,0,null,0,null,0,null,0,null,0,null,0,null,0,null,0,null,0,null,0,null,0,null,0,null,0,null,0,null,0,null,0,null,0,null,0,null,0,null,0,null,0,null,0,null,0,null,0,null,0,null,0,null,0,null,0,null,0,null,0,null,0,null,0,null,0,null,0,null,0,null,0,null,0,null,0,null,0,null,0,null,0,null,0,null,0,null,0,null,0,null,0,null,0,null,0,null,0,null,0,null,0,null,0,null,0,null,0,null,0]
[null,null,null,{"$f":"HLOOKUP($C17,'Dados Gerais'!$D$5:$BJ$10,6)","v":{"$error":"#N/A"}},{"$f":"HLOOKUP($C17,'Dados Gerais'!$D$5:$BJ$14,10)","v":{"$error":"#N/A"}},null,null,null,null,null,null,null,null,null,null,null,0,null,0,null,0,null,0,null,0,null,0,null,0,null,0,null,0,null,0,null,0,null,0,null,0,null,0,null,0,null,0,null,0,null,0,null,0,null,0,null,0,null,0,null,0,null,0,null,0,null,0,null,0,null,0,null,0,null,0,null,0,null,0,null,0,null,0,null,0,null,0,null,0,null,0,null,0,null,0,null,0,null,0,null,0,null,0,null,0,null,0,null,0,null,0,null,0,null,0,null,0,null,0,null,0,null,0,null,0,null,0,null,0,null,0,null,0,null,0]
[null,null,null,{"$f":"HLOOKUP($C18,'Dados Gerais'!$D$5:$BJ$10,6)","v":{"$error":"#N/A"}},{"$f":"HLOOKUP($C18,'Dados Gerais'!$D$5:$BJ$14,10)","v":{"$error":"#N/A"}},null,null,null,null,null,null,null,null,null,null,null,0,null,0,null,0,null,0,null,0,null,0,null,0,null,0,null,0,null,0,null,0,null,0,null,0,null,0,null,0,null,0,null,0,null,0,null,0,null,0,null,0,null,0,null,0,null,0,null,0,null,0,null,0,null,0,null,0,null,0,null,0,null,0,null,0,null,0,null,0,null,0,null,0,null,0,null,0,null,0,null,0,null,0,null,0,null,0,null,0,null,0,null,0,null,0,null,0,null,0,null,0,null,0,null,0,null,0,null,0,null,0,null,0,null,0,null,0,null,0]
[null,null,null,{"$f":"HLOOKUP($C19,'Dados Gerais'!$D$5:$BJ$10,6)","v":{"$error":"#N/A"}},{"$f":"HLOOKUP($C19,'Dados Gerais'!$D$5:$BJ$14,10)","v":{"$error":"#N/A"}},null,null,null,null,null,null,null,null,null,null,null,0,null,0,null,0,null,0,null,0,null,0,null,0,null,0,null,0,null,0,null,0,null,0,null,0,null,0,null,0,null,0,null,0,null,0,null,0,null,0,null,0,null,0,null,0,null,0,null,0,null,0,null,0,null,0,null,0,null,0,null,0,null,0,null,0,null,0,null,0,null,0,null,0,null,0,null,0,null,0,null,0,null,0,null,0,null,0,null,0,null,0,null,0,null,0,null,0,null,0,null,0,null,0,null,0,null,0,null,0,null,0,null,0,null,0,null,0,null,0]
[null,null,null,{"$f":"HLOOKUP($C20,'Dados Gerais'!$D$5:$BJ$10,6)","v":{"$error":"#N/A"}},{"$f":"HLOOKUP($C20,'Dados Gerais'!$D$5:$BJ$14,10)","v":{"$error":"#N/A"}},null,null,null,null,null,null,null,null,null,null,null,0,null,0,null,0,null,0,null,0,null,0,null,0,null,0,null,0,null,0,null,0,null,0,null,0,null,0,null,0,null,0,null,0,null,0,null,0,null,0,null,0,null,0,null,0,null,0,null,0,null,0,null,0,null,0,null,0,null,0,null,0,null,0,null,0,null,0,null,0,null,0,null,0,null,0,null,0,null,0,null,0,null,0,null,0,null,0,null,0,null,0,null,0,null,0,null,0,null,0,null,0,null,0,null,0,null,0,null,0,null,0,null,0,null,0,null,0,null,0]
[null,null,null,{"$f":"HLOOKUP($C21,'Dados Gerais'!$D$5:$BJ$10,6)","v":{"$error":"#N/A"}},{"$f":"HLOOKUP($C21,'Dados Gerais'!$D$5:$BJ$14,10)","v":{"$error":"#N/A"}},null,null,null,null,null,null,null,null,null,null,null,0,null,0,null,0,null,0,null,0,null,0,null,0,null,0,null,0,null,0,null,0,null,0,null,0,null,0,null,0,null,0,null,0,null,0,null,0,null,0,null,0,null,0,null,0,null,0,null,0,null,0,null,0,null,0,null,0,null,0,null,0,null,0,null,0,null,0,null,0,null,0,null,0,null,0,null,0,null,0,null,0,null,0,null,0,null,0,null,0,null,0,null,0,null,0,null,0,null,0,null,0,null,0,null,0,null,0,null,0,null,0,null,0,null,0,null,0,null,0]
[null,null,null,null,null,null,null,null,null,null,null,null,null,null,null,null,0,null,0,null,0,null,0,null,0,null,0,null,0,null,0,null,0,null,0,null,0,null,0,null,0,null,0,null,0,null,0,null,0,null,0,null,0,null,0,null,0,null,0,null,0,null,0,null,0,null,0,null,0,null,0,null,0,null,0,null,0,null,0,null,0,null,0,null,0,null,0,null,0,null,0,null,0,null,0,null,0,null,0,null,0,null,0,null,0,null,0,null,0,null,0,null,0,null,0,null,0,null,0,null,0,null,0,null,0,null,0,null,0,null,0,null,0,null,0]
[]
[null,null,"PAGAMENTO DA DEPRECIAÇÃO"]
[null,null,"ITEM","DESCRIÇÃO","QUANT ANUAL","CONTA SIAFI","VALOR DE AQ.","% RESIDUAL","VIDA ÚTIL","DEP. MENSAL","CUSTO TOTAL","BDI (%)","PREÇO TOTAL","FONTE","REFERÊNCIA"]
[]
[null,null,null,null,null,"12311.01.09",89.34,0.1,10,{"$f":"G27*(1-H27)/(I27*12)","v":0.67005000000000003},{"$f":"J27*E27","v":0},{"$f":"BDI!$E$26","v":5.0700000000000002E-2},{"$f":"ROUND(K27*(1+L27),2)","v":0},"COTAÇÃO"]
[null,null,null,null,null,"12311.01.09",39,0.1,10,{"$f":"G28*(1-H28)/(I28*12)","v":0.29250000000000004},{"$f":"J28*E28","v":0},{"$f":"BDI!$E$26","v":5.0700000000000002E-2},{"$f":"ROUND(K28*(1+L28),2)","v":0},"COTAÇÃO"]
[null,null,null,null,null,"12311.01.09",22.08,0.1,10,0.1656,0,{"$f":"BDI!$E$26","v":5.0700000000000002E-2},0,"COTAÇÃO"]
[null,null,null,null,null,"12311.01.09",8.02,0.1,10,6.0150000000000002E-2,0,{"$f":"BDI!$E$26","v":5.0700000000000002E-2},0,"COTAÇÃO"]
[null,null,null,null,null,"12311.01.09",15.64,0.1,10,0.1173,0,{"$f":"BDI!$E$26","v":5.0700000000000002E-2},0,"COTAÇÃO"]
[null,null,null,null,null,"12311.01.09",7.63,0.1,10,5.7224999999999998E-2,0,{"$f":"BDI!$E$26","v":5.0700000000000002E-2},0,"COTAÇÃO"]
[null,null,null,null,null,"12311.01.09",21.48,0.1,10,0.16109999999999999,0,{"$f":"BDI!$E$26","v":5.0700000000000002E-2},0,"COTAÇÃO"]
[null,null,null,null,null,"12311.01.09",7.87,0.1,10,5.9025000000000001E-2,0,{"$f":"BDI!$E$26","v":5.0700000000000002E-2},0,"COTAÇÃO"]
[null,null,null,null,null,"12311.01.09",6.73,0.1,10,5.0475000000000006E-2,0,{"$f":"BDI!$E$26","v":5.0700000000000002E-2},0,"COTAÇÃO"]
[null,null,null,null,null,"12311.01.09",15.35,0.1,10,0.11512499999999999,0,{"$f":"BDI!$E$26","v":5.0700000000000002E-2},0,"COTAÇÃO"]
[null,null,null,null,null,"12311.01.09",12.86,0.1,10,9.6449999999999994E-2,0,{"$f":"BDI!$E$26","v":5.0700000000000002E-2},0,"COTAÇÃO"]
[null,null,null,null,null,"12311.01.09",10.119999999999999,0.1,10,7.5899999999999995E-2,0,{"$f":"BDI!$E$26","v":5.0700000000000002E-2},0,"COTAÇÃO"]
[null,null,null,null,null,"12311.01.09",61.31,0.1,10,0.45982500000000004,0,{"$f":"BDI!$E$26","v":5.0700000000000002E-2},0,"COTAÇÃO"]
[null,null,null,null,null,"12311.01.09",40.409999999999997,0.1,10,0.30307499999999998,0,{"$f":"BDI!$E$26","v":5.0700000000000002E-2},0,"COTAÇÃO"]
[null,null,null,null,null,"12311.01.09",120.53,0.1,10,0.90397500000000008,0,{"$f":"BDI!$E$26","v":5.0700000000000002E-2},0,"COTAÇÃO"]
[null,null,null,null,null,"12311.01.09",31.48,0.1,10,0.2361,0,{"$f":"BDI!$E$26","v":5.0700000000000002E-2},0,"COTAÇÃO"]
[null,null,null,null,null,"12311.01.09",191.93,0.1,10,1.4394750000000003,0,{"$f":"BDI!$E$26","v":5.0700000000000002E-2},0,"COTAÇÃO"]
[null,null,null,null,null,"12311.01.09",92.78,0.1,10,0.69585000000000008,0,{"$f":"BDI!$E$26","v":5.0700000000000002E-2},0,"COTAÇÃO"]
[null,null,null,null,null,"12311.01.09",36.01,0.1,10,0.27007500000000001,0,{"$f":"BDI!$E$26","v":5.0700000000000002E-2},0,"COTAÇÃO"]
[null,null,null,null,null,"12311.01.09",16.579999999999998,0.1,10,0.12434999999999999,0,{"$f":"BDI!$E$26","v":5.0700000000000002E-2},0,"COTAÇÃO"]
[null,null,null,null,null,"12311.01.09",57.93,0.1,10,0.434475,0,{"$f":"BDI!$E$26","v":5.0700000000000002E-2},0,"COTAÇÃO"]
[null,null,null,null,null,"12311.01.09",47.81,0.1,10,0.35857500000000003,0,{"$f":"BDI!$E$26","v":5.0700000000000002E-2},0,"COTAÇÃO"]
[null,null,null,null,null,"12311.01.09",31.18,0.1,10,0.23385,0,{"$f":"BDI!$E$26","v":5.0700000000000002E-2},0,"COTAÇÃO"]
[null,null,null,null,null,"12311.01.09",23.95,0.1,10,0.17962500000000001,0,{"$f":"BDI!$E$26","v":5.0700000000000002E-2},0,"COTAÇÃO"]
[null,null,null,null,null,"12311.01.09",35.04,0.1,10,0.26280000000000003,0,{"$f":"BDI!$E$26","v":5.0700000000000002E-2},0,"COTAÇÃO"]
[null,null,null,null,null,"12311.01.09",200.31,0.1,10,1.5023249999999999,0,{"$f":"BDI!$E$26","v":5.0700000000000002E-2},0,"COTAÇÃO"]
[null,null,null,null,null,"12311.01.09",79.59,0.1,10,0.59692500000000004,0,{"$f":"BDI!$E$26","v":5.0700000000000002E-2},0,"COTAÇÃO"]
[null,null,null,null,null,"12311.01.09",227.75,0.1,10,1.7081249999999999,0,{"$f":"BDI!$E$26","v":5.0700000000000002E-2},0,"COTAÇÃO"]
[null,null,null,null,null,"12311.01.09",127.59,0.1,10,0.95692500000000003,0,{"$f":"BDI!$E$26","v":5.0700000000000002E-2},0,"COTAÇÃO"]
[]
[]
[null,null,"PAGAMENTO DA MANUTENÇÃO"]
[null,null,"ITEM","DESCRIÇÃO",null,null,null,"K (calculado)","MENSAL DEPR.","% MAN X DEP","MENSAL MAN.","BDI (%)","PREÇO TOTAL"]
[]
[null,null,null,null,null,null,null,{"$f":"H68","v":0.42411600000000005},{"$f":"SUM(M27:M55)","v":0},{"$f":"H61","v":0.42411600000000005},{"$f":"I61*H61","v":0},{"$f":"L27","v":5.0700000000000002E-2},{"$f":"ROUND(K61*(1+L61),2)","v":0}]
[]
[null,null,null,null,"K1","K2","K3","K4"]
[null,null,null,null,0.85,1,0.8,1]
[null,null,null,null,"K5","K6","K7","K8"]
[null,null,null,null,1,0.6,0.5,1.1000000000000001]
[null,null,null,null,"K9","K10","K11","RESULTADO"]
[null,null,null,"* a descrição de cada coeficiente segue abaixo",1.5,0.9,1.4,{"$f":"E64*F64*G64*H64*E66*F66*G66*H66*E68*F68*G68","v":0.42411600000000005}]
[]
[]
[null,null,"MATERIAL DE CONSUMO ASSOCIADO"]
[null,null,"ITEM","DESCRIÇÃO",null,null,null,"QUANTID/ANO","UNIDADE","VALOR DE AQ.","MENSAL MAT","BDI (%)","PREÇO TOTAL"]
[]
[null,null,null,null,null,null,null,null,null,null,{"$f":"J74*H74/12","v":0},{"$f":"L61","v":5.0700000000000002E-2},{"$f":"ROUND(K74*(1+L74),2)","v":0}]
[]
[]
[null,null,"MATERIAL DE CONSUMO ASSOCIADO"]
[null,null,"ITEM","DESCRIÇÃO",null,null,null,null,null,null,null,null,"PREÇO TOTAL"]
[]
[null,null,1,"Componente DEPRECIAÇÃO - POR POSTO",null,null,null,null,null,null,null,null,{"$f":"I61","v":0}]
[null,null,2,"Componente MANUTENÇÃO - POR POSTO",null,null,null,null,null,null,null,null,{"$f":"M61","v":0}]
[null,null,3,"Componente MATERIAL DE CONSUMO ASSOCIADO - POR POSTO",null,null,null,null,null,null,null,null,{"$f":"M74","v":0}]
[]
[null,null,null,null,null,null,null,null,null,null,null,"SOMATÓRIO TOTAL MENSAL - POR POSTO",{"$f":"SUM(M79:M83)","v":0},null,null,null,null,{"$f":"IF(SUM(Q$15:Q$22)>0,$M84,0)","v":0},null,{"$f":"IF(SUM(S$15:S$22)>0,$M84,0)","v":0},null,{"$f":"IF(SUM(U$15:U$22)>0,$M84,0)","v":0},null,{"$f":"IF(SUM(W$15:W$22)>0,$M84,0)","v":0},null,{"$f":"IF(SUM(Y$15:Y$22)>0,$M84,0)","v":0},null,{"$f":"IF(SUM(AA$15:AA$22)>0,$M84,0)","v":0},null,{"$f":"IF(SUM(AC$15:AC$22)>0,$M84,0)","v":0},null,{"$f":"IF(SUM(AE$15:AE$22)>0,$M84,0)","v":0},null,{"$f":"IF(SUM(AG$15:AG$22)>0,$M84,0)","v":0},null,{"$f":"IF(SUM(AI$15:AI$22)>0,$M84,0)","v":0},null,{"$f":"IF(SUM(AK$15:AK$22)>0,$M84,0)","v":0},null,{"$f":"IF(SUM(AM$15:AM$22)>0,$M84,0)","v":0},null,{"$f":"IF(SUM(AO$15:AO$22)>0,$M84,0)","v":0},null,{"$f":"IF(SUM(AQ$15:AQ$22)>0,$M84,0)","v":0},null,{"$f":"IF(SUM(AS$15:AS$22)>0,$M84,0)","v":0},null,{"$f":"IF(SUM(AU$15:AU$22)>0,$M84,0)","v":0},null,{"$f":"IF(SUM(AW$15:AW$22)>0,$M84,0)","v":0},null,{"$f":"IF(SUM(AY$15:AY$22)>0,$M84,0)","v":0},null,{"$f":"IF(SUM(BA$15:BA$22)>0,$M84,0)","v":0},null,{"$f":"IF(SUM(BC$15:BC$22)>0,$M84,0)","v":0},null,{"$f":"IF(SUM(BE$15:BE$22)>0,$M84,0)","v":0},null,{"$f":"IF(SUM(BG$15:BG$22)>0,$M84,0)","v":0},null,{"$f":"IF(SUM(BI$15:BI$22)>0,$M84,0)","v":0},null,{"$f":"IF(SUM(BK$15:BK$22)>0,$M84,0)","v":0},null,{"$f":"IF(SUM(BM$15:BM$22)>0,$M84,0)","v":0},null,{"$f":"IF(SUM(BO$15:BO$22)>0,$M84,0)","v":0},null,{"$f":"IF(SUM(BQ$15:BQ$22)>0,$M84,0)","v":0},null,{"$f":"IF(SUM(BS$15:BS$22)>0,$M84,0)","v":0},null,{"$f":"IF(SUM(BU$15:BU$22)>0,$M84,0)","v":0},null,{"$f":"IF(SUM(BW$15:BW$22)>0,$M84,0)","v":0},null,{"$f":"IF(SUM(BY$15:BY$22)>0,$M84,0)","v":0},null,{"$f":"IF(SUM(CA$15:CA$22)>0,$M84,0)","v":0},null,{"$f":"IF(SUM(CC$15:CC$22)>0,$M84,0)","v":0},null,{"$f":"IF(SUM(CE$15:CE$22)>0,$M84,0)","v":0},null,{"$f":"IF(SUM(CG$15:CG$22)>0,$M84,0)","v":0},null,{"$f":"IF(SUM(CI$15:CI$22)>0,$M84,0)","v":0},null,{"$f":"IF(SUM(CK$15:CK$22)>0,$M84,0)","v":0},null,{"$f":"IF(SUM(CM$15:CM$22)>0,$M84,0)","v":0},null,{"$f":"IF(SUM(CO$15:CO$22)>0,$M84,0)","v":0},null,{"$f":"IF(SUM(CQ$15:CQ$22)>0,$M84,0)","v":0},null,{"$f":"IF(SUM(CS$15:CS$22)>0,$M84,0)","v":0},null,{"$f":"IF(SUM(CU$15:CU$22)>0,$M84,0)","v":0},null,{"$f":"IF(SUM(CW$15:CW$22)>0,$M84,0)","v":0},null,{"$f":"IF(SUM(CY$15:CY$22)>0,$M84,0)","v":0},null,{"$f":"IF(SUM(DA$15:DA$22)>0,$M84,0)","v":0},null,{"$f":"IF(SUM(DC$15:DC$22)>0,$M84,0)","v":0},null,{"$f":"IF(SUM(DE$15:DE$22)>0,$M84,0)","v":0},null,{"$f":"IF(SUM(DG$15:DG$22)>0,$M84,0)","v":0},null,{"$f":"IF(SUM(DI$15:DI$22)>0,$M84,0)","v":0},null,{"$f":"IF(SUM(DK$15:DK$22)>0,$M84,0)","v":0},null,{"$f":"IF(SUM(DM$15:DM$22)>0,$M84,0)","v":0},null,{"$f":"IF(SUM(DO$15:DO$22)>0,$M84,0)","v":0},null,{"$f":"IF(SUM(DQ$15:DQ$22)>0,$M84,0)","v":0},null,{"$f":"IF(SUM(DS$15:DS$22)>0,$M84,0)","v":0},null,{"$f":"IF(SUM(DU$15:DU$22)>0,$M84,0)","v":0},null,{"$f":"IF(SUM(DW$15:DW$22)>0,$M84,0)","v":0},null,{"$f":"IF(SUM(DY$15:DY$22)>0,$M84,0)","v":0},null,{"$f":"IF(SUM(EA$15:EA$22)>0,$M84,0)","v":0},null,{"$f":"IF(SUM(EC$15:EC$22)>0,$M84,0)","v":0},null,{"$f":"IF(SUM(EE$15:EE$22)>0,$M84,0)","v":0}]
[null,null,null,null,null,null,null,null,null,null,null,"SOMATÓRIO TOTAL ANUAL - POR POSTO",{"$f":"M84*12","v":0}]
[]
[]
[null,null,"MATERIAL DE CONSUMO ASSOCIADO"]
[null,null,"MEMÓRIA DE CÁLCULO DO COEFICIENTE DE CORRELAÇÃO MANUTENÇÃO X DEPRECIAÇÃO (K)"]
[]
[null,null,"JUSTIFICATIVAS",null,"TIPO","K1",null,"Condições de Trab","K4",null,"Tempo Vida (anos)","K6",null,"Temperatura","K8"]
[null,null,null,null,"Guindaste",0.5,null,"Em espera",0.4,null,1,0.6,null,"Muito quente (> 40º C)",1.3]
[null,null,"K1","Considerado o valor médio de 0,85","Caminhão-comum",0.8,null,"Leves",0.8,null,2,0.7,null,"Quente (30º a 40º C)",1.1000000000000001]
[null,null,"K2","Considerado o operador médio","Fora-de-estrada",1,null,"Médias",1,null,3,0.8,null,"Médio (10º a 30º C)",1]
[null,null,"K3","Consideradas ferramentas de primeira qualidade","Carregadeira",1,null,"Pesadas",1.4,null,4,0.9,null,"Frio (< 10º C)",1.2]
[null,null,"K4","Há todo o tipo de trabalho, foi considerado o valor médio","Escavadeira",1.4,null,"Severas",2,null,5,1]
[null,null,"K5","Considerando manutenção normal","Motoescrêiper",1.1000000000000001,null,null,null,null,6,1,null,"Ritmo de Trabalho","K9"]
[null,null,"K6","Equipamentos novos","Trator de esteira",1.2,null,"Manutenção","K5",null,7,1,null,"Folgado",0.9]
[null,null,"K7","220h por mês, 252 dias por ano",null,null,null,"Excelente",0.6,null,8,1.2,null,"Médio ",1]
[null,null,"K8","Clima quente, acima de 30º C","Qualid do Operador","K2",null,"Boa",0.8,null,9,1.3,null,"Com pressa",1.5]
[null,null,"K9","Ritmo de trabalho usualmente com pressa","Excelente",0.8,null,"Média",1,null,10,1.4]
[null,null,"K10","Considerado o operador médio","Boa",0.9,null,"Ruim ",1.5,null,11,2,null,"Conh do Serviço","K10"]
[null,null,"K11","Foi considerada a opção de aluguel a terceiros, ainda que a simulação seja dos custos do contratado, contudo a execução dos serviços é em local de terceiros","Média",1,null,"Inexistente",3,null,15,2,null,"Grande ",0.8]
[null,null,null,null,"Ruim",1.2,null,null,null,null,null,null,null,"Médio     ",0.9]
[null,null,null,null,"Péssima",2,null,"Horas de Uso ","K7",6000,1,null,null,"Pouco ",1]
[null,null,null,null,null,null,null,1000,0.5,8000,1.3]
[null,null,null,null,"Qualidade do Equip","K3",null,2000,0.5,10000,1.6,null,null,"Tipo do Serviço","K11"]
[null,null,null,null,"De primeira",0.8,null,3000,0.6,12000,1.9,null,null,"Mina ou Pedreira",0.8]
[null,null,null,null,"Média",1,null,4000,0.7,15000,2.2999999999999998,null,null,"Construção Geral",1]
[null,null,null,null,"Ruim",1.5,null,5000,0.9,20000,3,null,null,"Aluguel a Terceiros",1.4]
[]
[null,null,null,null,"Fonte: "]
[null,null,null,null,"MATTOS, Aldo Dórea. Como preparar orçamentos de obras. São Paulo: Pini, 2006. 281 p., il"]