{"text_format":"1","workbook":"xlsx","n_sheets":24,"sheets":["GUIA PARA PREENCHIMENTO","MODELO PROPOSTA","Remunerações","Resumo","1","2","3","4","5","Dados Gerais","Encargos Sociais","BDI","Uniformes","EPI","Não Rel - EPI","Equip Rel","Não Rel - Depr","Não Rel - Mat Consumo","SREP","Não Rel - Mat Cons Durável","Não Rel - Serviços","Not. Demanda","Mat Cons","Mat Perm"],"not_rendered":{"charts":0,"images":9,"macros":1,"external_links":0,"defined_names":29,"comments":0,"pivot_tables":0},"unopened":[],"bounds":{"document_bytes":16777216,"sheet_cells":100000,"rows_first":2000,"rows_last":500,"rows_between":2000,"halvings":0,"cell_chars":16384,"cell_head_chars":4096},"cells_cut":0,"cells_raw":0,"read":"whole","date_system":"1900"}

{"sheet":"GUIA PARA PREENCHIMENTO","index":0,"n_rows":5,"n_cols":1,"rows_kept":5,"cut":false,"hidden":false,"merged":[]}
["GUIA PARA PREENCHIMENTO"]
[]
["1 - Preencher apenas as guias azuis:"]
[]
["2 - Recomendamos preencher somente as células com fundo azul claro. As demais possuem fórmulas e sugerimos não alterá-las."]

{"sheet":"MODELO PROPOSTA","index":1,"n_rows":68,"n_cols":2,"rows_kept":68,"cut":false,"hidden":false,"merged":[[9,1,9,9],[1,1,1,9],[4,1,4,9],[6,1,6,9],[7,1,7,9],[8,1,8,9],[25,1,25,4],[25,5,25,9],[10,1,10,9],[11,1,11,9],[12,1,12,9],[14,1,14,9],[15,1,15,9],[16,1,16,2],[17,1,18,9],[19,1,19,9],[21,1,21,9],[22,1,22,9],[23,1,23,9],[26,1,26,4],[26,5,26,9],[27,1,27,4],[27,5,27,9],[28,1,28,4],[28,5,28,9],[29,1,29,4],[29,5,29,9],[30,1,30,4],[30,5,30,9],[31,1,31,4],[31,5,31,9],[38,1,38,9],[41,1,41,9],[43,1,43,9],[44,1,44,9],[45,1,45,9],[33,1,33,9],[34,6,34,10],[35,1,35,9],[36,1,36,9],[37,1,37,9],[58,1,58,4],[58,5,58,9],[47,1,47,9],[49,1,49,9],[50,1,50,9],[51,1,51,9],[53,1,53,9],[55,1,55,9],[56,1,56,4],[56,5,56,9],[57,1,57,4],[57,5,57,9],[59,1,59,9],[62,1,62,9],[63,1,63,9],[64,1,64,9],[67,1,67,9]]}
[]
[null,"MODELO DA PROPOSTA COMPLETA"]
[]
[null,"."]
[null,"I – FORMALIZAÇÃO"]
[]
[null,"PREGÃO ELETRÔNICO N. 98/2023"]
[null,"OBJETO: Prestação de serviços continuados de bombeiro civil (brigada de incêndio) na área de segurança contra incêndio, pânico, abandono de edificações, formação de brigada voluntária, primeiros socorros e desenvolvimento e implantação de política prevencionista de segurança contra incêndio para atuação nas edificações da Câmara dos Deputados, incluindo Centro de Gestão e Armazenamento de Materiais (CEAM) e Complexo Avançado (CETEC-NORTE e CEFOR), pelo período de trinta meses. "]
[null,"LICITANTE: _____________________________________________________"]
[null,"CNPJ: ________________________________________________________"]
[null,"ENDEREÇO COMPLETO: _________________________________________"]
[null,"TELEFONE:_____________________________________________________"]
[null,"E-MAIL: ________________________________________________________"]
[]
[null,"Apresentamos nossa proposta para o item único da presente licitação, de acordo com as disposições do Edital."]
[null,"Decorre do conteúdo da presente proposta a explicitação do seguinte PREÇO DE JULGAMENTO (GLOBAL) PARA O ITEM PARA O PERÍODO DE TRINTA MESES:"]
[null,{"$f":"Resumo!H86","v":25425687.880319998}]
[null,{"$f":"Extenso_Valor(B17)","v":{"$error":"#NAME?"}}]
[]
[null,"(por extenso)"]
[]
[null,"No valor proposto estão incluídos todos os custos e todas as despesas, diretas e indiretas, para a execução dos serviços objeto da licitação, em conformidade com as especificações e demais condições e exigências constantes do Edital."]
[null,"Informamos que eventuais rubricas dispostas em Acordo ou Convenção Coletiva de Trabalho que não se relacionem ao custo direto da venda do serviço, tais como “Participação nos Resultados” e “Abono substitutivo de Participação nos Resultados”, serão consideradas nos custos indiretos da proposta."]
[null,"O prazo de validade da presente proposta é de ______ (por extenso) dias. (observado o disposto no Título 11 do Edital)."]
[]
[null,"Convenção coletiva de trabalho ou a norma coletiva a que estamos obrigados:"]
[null,"Data-Base:"]
[null,"Número do Registro SRT:"]
[null,"Regime de tributação da empresa:"]
[null,"Empresa é beneficiada pela desoneração da folha de pagamento instituída pela Lei n. 12.546, de 2001, alterada pela Lei n. 13.161, de 2015?"]
[null,"Empresa adere ao PAT (Programa de Alimentação do Trabalhador)?"]
[null,"(Se adere ao PAT): Os valores do auxílio-alimentação apresentados na presente proposta correspondem somente aos efetivamente pagos pela empresa aos empregados?"]
[]
[null,"DECLARAÇÕES"]
[]
[null,"A SEREM PRESTADAS SOMENTE NA HIPÓTESE DE LICITANTE MICROEMPRESA OU EMPRESA DE PEQUENO PORTE, EM CONFORMIDADE COM OS ARTIGOS 17, 18, 30 E 31 DA LEI COMPLEMENTAR N. 123, de 2006, E O ACÓRDÃO TCU 2798/2010-PLENÁRIO"]
[null,"Declaramos que:"]
[null,"a)   em se tratando dos serviços vedados descritos no artigo 17 da Lei Complementar n. 123, de 2006, notadamente os descritos no inciso XII (cessão ou locação de mão de obra), ressalvados os serviços listados nos parágrafos 5o-B a 5o-E do artigo 18 da referida Lei, a proposta apresentada não contempla qualquer benefício tributário referente ao SIMPLES NACIONAL, conforme os subitens 5.7 e 5.8 do Edital;"]
[null,"b)   na hipótese de contratação desta Microempresa ou Empresa de Pequeno Porte inscrita no SIMPLES NACIONAL e executora de atividade vedada, ficamos sujeitos à exclusão obrigatória no SIMPLES NACIONAL a contar do mês seguinte ao da contratação, em consequência do que dispõem o artigo 17, inciso XII e o artigo 31, inciso II da Lei Complementar n, 123, de 2006, devendo entregar à Câmara dos Deputados, à título de comprovação, cópia de ofício – com comprovante de entrega e recebimento, que comunique a assinatura do contrato de prestação de serviços mediante cessão de mão de obra e encaminhado pela contratada à Receita Federal do Brasil até o último dia útil do mês subsequente ao da contratação, consoante artigo 30, § 1º, inciso II da Lei Complementar n. 123, de 2006."]
[]
[]
[null,"A SEREM PRESTADAS SOMENTE NA HIPÓTESE DE LICITANTE BENEFICIADA PELA DESONERAÇÃO DA FOLHA DE PAGAMENTO INSTITUÍDA PELA LEI N. 12.546, DE 2011, ALTERADA PELA LEI N. 13.161, DE 2015. "]
[]
[null,"Declaramos, sob as penas da Lei, que:"]
[null,"a)   recolhemos a contribuição previdenciária incidente sobre o valor da receita bruta, em substituição às contribuições previdenciárias incidentes sobre a folha de pagamento, previstas nos incisos I e III do caput do artigo 22 da Lei n. 8.212, de 24 de julho de 1991, na forma do caput do artigo 7º (ou 8º) da Lei n. 12.546, de 14 de dezembro de 2011, alterada pela Lei n. 13.161, de 31 de agosto de 2015;"]
[null,"b)   temos ciência que nossa manifestação, conforme alínea “a” anterior, será remetida à Receita Federal do Brasil e que, em caso de constatação de falsidade, estará sujeita às sanções administrativas cabíveis, sem prejuízo do encaminhamento dos documentos ao Ministério Público para apuração de eventual responsabilidade criminal desta declarante."]
[]
[null,"A SEREM PRESTADAS SOMENTE PARA A LICITANTE QUE SEJA A ATUAL TITULAR DO CONTRATO QUE SERÁ SUCEDIDO PELA CONTRATAÇÃO DECORRENTE DO PREGÃO EM EPÍGRAFE, NA HIPÓTESE DE HAVER SALÁRIO(S) PRATICADO(S) NO CONTRATO VIGENTE SUPERIOR(ES) AOS MÍNIMOS FIXADOS NO EDITAL E QUE TENHA OPTADO POR TOMAR COMO BASE EM SEUS LANCES E NA PRESENTE PROPOSTA DE PREÇOS SALÁRIO(S) FIXADO(S) NESTE EDITAL:"]
[]
[null,"Declaramos que:"]
[null,"a) estamos cientes de que deveremos apresentar à Câmara dos Deputados, no prazo improrrogável de 60 (sessenta) dias, contado da data de início da vigência do contrato, a convenção ou o acordo coletivo de trabalho, entabulado com a participação do sindicato dos trabalhadores, em que se autoriza a redução salarial, na forma do art. 7°, VI, da Constituição Federal, considerado, ainda, o disposto no subitem 10.11.2.1 Título 10 do Anexo n. 6 do Edital;"]
[null,"b) estamos cientes de que, na hipótese de não cumprirmos o disposto no teor da declaração da alínea anterior (“a”) e não logrado êxito na contratação de remanescente, sendo necessária a realização de nova licitação, caso participemos do certame, deveremos tomar como base em nossos lances e em nossa proposta de preços o(s) salário(s) maior(es), absorvendo ou acrescentando eventual diferença no BDI, sob pena de desclassificação."]
[]
[null,"É OBRIGATÓRIA A COMPROVAÇÃO A QUE SE REFERE O SUBITEM 5.9.4 DO TÍTULO 5 DO EDITAL."]
[]
[null,"DADOS PARA ASSINATURA DO CONTRATO"]
[null,"Nome do signatário"]
[null,"Cargo"]
[null,"Qualificação\n(CPF, naturalidade e domicílio)"]
[null,"OBS.: O signatário deve possuir poderes de administração estabelecidos em contrato social e/ou possuir procuração com poderes para assinar contratos em nome da empresa. \nA documentação comprobatória deverá ser encaminhada quando da assinatura do contrato."]
[]
[]
[null,"Brasília,     de                     de 2023."]
[]
[null,"Assinatura do representante legal da empresa"]
[]
[]
[null,"Nome do representante legal da empresa"]

{"sheet":"Remunerações","index":2,"n_rows":16,"n_cols":11,"rows_kept":16,"cut":false,"hidden":false,"merged":[[0,1,0,10]]}
[null,"QUADRO DE REMUNERAÇÕES"]
[]
[null,null,"ITEM","POSTO DE TRABALHO","QUANTIDADE","SALÁRIO","ADICIONAL DE PERICULOSIDADE","ADICIONAL DE INSALUBRIDADE","ADICIONAL NOTURNO","OUTROS","SALÁRIO COM ADICIONAIS"]
[null,null,null,"POSTO DE TRABALHO - EQUIPE DE TRABALHO"]
[null,null,1,{"$f":"HLOOKUP($C5,'Dados Gerais'!$D$5:$L$68,6)","v":"BOMBEIRO CIVIL MESTRE"},{"$f":"HLOOKUP($C5,'Dados Gerais'!$D$5:$L$68,10)","v":2},{"$f":"HLOOKUP($C5,'Dados Gerais'!$D$5:$L$68,8)","v":8161.0099999999993},{"$f":"HLOOKUP($C5,'Dados Gerais'!$D$5:$L$68,25)","v":2448.3000000000002},{"$f":"HLOOKUP($C5,'Dados Gerais'!$D$5:$L$68,31)","v":0},{"$f":"HLOOKUP($C5,'Dados Gerais'!$D$5:$L$68,46)","v":0},{"$f":"HLOOKUP($C5,'Dados Gerais'!$D$5:$L$68,33)","v":0},{"$f":"SUM(F5:J5)","v":10609.31}]
[null,null,2,{"$f":"HLOOKUP($C6,'Dados Gerais'!$D$5:$L$68,6)","v":"BOMBEIRO CIVIL LÍDER DIURNO"},{"$f":"HLOOKUP($C6,'Dados Gerais'!$D$5:$L$68,10)","v":2},{"$f":"HLOOKUP($C6,'Dados Gerais'!$D$5:$L$68,8)","v":4330.6000000000004},{"$f":"HLOOKUP($C6,'Dados Gerais'!$D$5:$L$68,25)","v":1299.18},{"$f":"HLOOKUP($C6,'Dados Gerais'!$D$5:$L$68,31)","v":0},{"$f":"HLOOKUP($C6,'Dados Gerais'!$D$5:$L$68,46)","v":0},{"$f":"HLOOKUP($C6,'Dados Gerais'!$D$5:$L$68,33)","v":0},{"$f":"SUM(F6:J6)","v":5629.7800000000007}]
[null,null,3,{"$f":"HLOOKUP($C7,'Dados Gerais'!$D$5:$L$68,6)","v":"BOMBEIRO CIVIL LÍDER NOTURNO"},{"$f":"HLOOKUP($C7,'Dados Gerais'!$D$5:$L$68,10)","v":2},{"$f":"HLOOKUP($C7,'Dados Gerais'!$D$5:$L$68,8)","v":4330.6000000000004},{"$f":"HLOOKUP($C7,'Dados Gerais'!$D$5:$L$68,25)","v":1299.18},{"$f":"HLOOKUP($C7,'Dados Gerais'!$D$5:$L$68,31)","v":0},{"$f":"HLOOKUP($C7,'Dados Gerais'!$D$5:$L$68,46)","v":763.54},{"$f":"HLOOKUP($C7,'Dados Gerais'!$D$5:$L$68,33)","v":0},6393.3200000000006]
[null,null,4,{"$f":"HLOOKUP($C8,'Dados Gerais'!$D$5:$L$68,6)","v":"BOMBEIRO CIVIL BÁSICO DIURNO"},{"$f":"HLOOKUP($C8,'Dados Gerais'!$D$5:$L$68,10)","v":36},{"$f":"HLOOKUP($C8,'Dados Gerais'!$D$5:$L$68,8)","v":3494.5399999999995},{"$f":"HLOOKUP($C8,'Dados Gerais'!$D$5:$L$68,25)","v":1048.3599999999999},{"$f":"HLOOKUP($C8,'Dados Gerais'!$D$5:$L$68,31)","v":0},{"$f":"HLOOKUP($C8,'Dados Gerais'!$D$5:$L$68,46)","v":0},{"$f":"HLOOKUP($C8,'Dados Gerais'!$D$5:$L$68,33)","v":0},4542.8999999999996]
[null,null,5,{"$f":"HLOOKUP($C9,'Dados Gerais'!$D$5:$L$68,6)","v":"BOMBEIRO CIVIL BÁSICO NOTURNO"},{"$f":"HLOOKUP($C9,'Dados Gerais'!$D$5:$L$68,10)","v":28},{"$f":"HLOOKUP($C9,'Dados Gerais'!$D$5:$L$68,8)","v":3494.5399999999995},{"$f":"HLOOKUP($C9,'Dados Gerais'!$D$5:$L$68,25)","v":1048.3599999999999},{"$f":"HLOOKUP($C9,'Dados Gerais'!$D$5:$L$68,31)","v":0},{"$f":"HLOOKUP($C9,'Dados Gerais'!$D$5:$L$68,46)","v":616.13},{"$f":"HLOOKUP($C9,'Dados Gerais'!$D$5:$L$68,33)","v":0},{"$f":"SUM(F9:J9)","v":5159.03}]
[]
[]
[]
[]
[]
[]
[null,null,null,"TOTAL DE POSTOS",{"$f":"SUM(E5:E15)","v":70}]

{"sheet":"Resumo","index":3,"n_rows":91,"n_cols":12,"rows_kept":91,"cut":false,"hidden":false,"merged":[[2,1,2,8],[28,1,28,8],[15,1,15,8],[65,3,65,7],[90,10,91,18],[63,10,64,18],[83,3,83,7],[53,3,53,7],[69,3,69,7],[75,3,75,7],[79,3,79,7],[81,10,82,18],[67,10,68,18]]}
[]
[]
[null,"RESUMO - TOTAIS MENSAIS - FATURA ORDINÁRIA (SEM O 13º E SEM OS ITENS SOB DEMANDA)"]
[]
[]
[null,null,"ITEM","POSTO DE TRABALHO","QUANTIDADE","PREÇO UNIT       (SEM O 13º)","DESTAQUE DO 13º","PREÇO POR EMPREGADO","PREÇO TOTAL (MENSAL)"]
[null,null,1,{"$f":"HLOOKUP(C7,'Dados Gerais'!$D$5:$BK$10,6)","v":"BOMBEIRO CIVIL MESTRE"},{"$f":"HLOOKUP(C7,'Dados Gerais'!$D$5:$BK$14,10)","v":2},{"$f":"'1'!$E$116","v":22731.114497999999},0,{"$f":"G7+F7","v":22731.114497999999},{"$f":"H7*E7","v":45462.228995999998}]
[null,null,2,{"$f":"HLOOKUP(C8,'Dados Gerais'!$D$5:$BK$10,6)","v":"BOMBEIRO CIVIL LÍDER DIURNO"},{"$f":"HLOOKUP(C8,'Dados Gerais'!$D$5:$BK$14,10)","v":2},{"$f":"'2'!$E$116","v":12329.3925},0,12329.3925,24658.785]
[null,null,3,{"$f":"HLOOKUP(C9,'Dados Gerais'!$D$5:$BK$10,6)","v":"BOMBEIRO CIVIL LÍDER NOTURNO"},{"$f":"HLOOKUP(C9,'Dados Gerais'!$D$5:$BK$14,10)","v":2},{"$f":"'3'!$E$115","v":13857.190480000003},0,13857.190480000003,27714.380960000006]
[null,null,4,{"$f":"HLOOKUP(C10,'Dados Gerais'!$D$5:$BK$10,6)","v":"BOMBEIRO CIVIL BÁSICO DIURNO"},{"$f":"HLOOKUP(C10,'Dados Gerais'!$D$5:$BK$14,10)","v":36},{"$f":"'4'!$E$115","v":10171.622593999999},0,10171.622593999999,366178.41338399996]
[null,null,5,{"$f":"HLOOKUP(C11,'Dados Gerais'!$D$5:$BK$10,6)","v":"BOMBEIRO CIVIL BÁSICO NOTURNO"},{"$f":"HLOOKUP(C11,'Dados Gerais'!$D$5:$BK$14,10)","v":28},{"$f":"'5'!$E$115","v":11404.451018000002},0,{"$f":"G11+F11","v":11404.451018000002},{"$f":"H11*E11","v":319324.62850400002}]
[]
[null,null,null,"TOTAL MENSAL - SALÁRIOS",null,null,null,null,{"$f":"SUM(I7:I12)","v":783338.43684400001}]
[]
[]
[null,"RESUMO - TOTAIS MENSAIS - DESTAQUE DO 13º SALÁRIO"]
[]
[]
[null,null,"ITEM","POSTO DE TRABALHO","QUANTIDADE","PREÇO UNIT       (SEM O 13º)","DESTAQUE DO 13º","PREÇO POR EMPREGADO","PREÇO TOTAL (MENSAL)"]
[null,null,1,{"$f":"HLOOKUP(C20,'Dados Gerais'!$D$5:$BK$10,6)","v":"BOMBEIRO CIVIL MESTRE"},{"$f":"HLOOKUP(C20,'Dados Gerais'!$D$5:$BK$14,10)","v":2},0,{"$f":"G33","v":1569.6999999999998},{"$f":"G20+F20","v":1569.6999999999998},{"$f":"H20*E20","v":3139.3999999999996}]
[null,null,2,{"$f":"HLOOKUP(C21,'Dados Gerais'!$D$5:$BK$10,6)","v":"BOMBEIRO CIVIL LÍDER DIURNO"},{"$f":"HLOOKUP(C21,'Dados Gerais'!$D$5:$BK$14,10)","v":2},0,{"$f":"G34","v":832.95999999999992},{"$f":"G21+F21","v":832.95999999999992},1665.9199999999998]
[null,null,3,{"$f":"HLOOKUP(C22,'Dados Gerais'!$D$5:$BK$10,6)","v":"BOMBEIRO CIVIL LÍDER NOTURNO"},{"$f":"HLOOKUP(C22,'Dados Gerais'!$D$5:$BK$14,10)","v":2},0,{"$f":"G35","v":897.4899999999999},897.4899999999999,1794.9799999999998]
[null,null,4,{"$f":"HLOOKUP(C23,'Dados Gerais'!$D$5:$BK$10,6)","v":"BOMBEIRO CIVIL BÁSICO DIURNO"},{"$f":"HLOOKUP(C23,'Dados Gerais'!$D$5:$BK$14,10)","v":36},0,{"$f":"G36","v":637.74},637.74,22958.639999999999]
[null,null,5,{"$f":"HLOOKUP(C24,'Dados Gerais'!$D$5:$BK$10,6)","v":"BOMBEIRO CIVIL BÁSICO NOTURNO"},{"$f":"HLOOKUP(C24,'Dados Gerais'!$D$5:$BK$14,10)","v":28},0,724.22,{"$f":"G24+F24","v":724.22},{"$f":"H24*E24","v":20278.16}]
[]
[null,null,null,"TOTAL MENSAL - DESTAQUE DO 13º",null,null,null,null,{"$f":"SUM(I20:I25)","v":49837.1}]
[]
[]
[null,"RESUMO - TOTAIS MENSAIS - FATURA ORDINÁRIA TOTAL"]
[]
[]
[null,null,"ITEM","POSTO DE TRABALHO","QUANTIDADE","PREÇO UNIT       (SEM O 13º)","DESTAQUE DO 13º","PREÇO POR EMPREGADO","PREÇO TOTAL (MENSAL)"]
[null,null,1,{"$f":"HLOOKUP(C33,'Dados Gerais'!$D$5:$BK$10,6)","v":"BOMBEIRO CIVIL MESTRE"},{"$f":"HLOOKUP(C33,'Dados Gerais'!$D$5:$BK$14,10)","v":2},{"$f":"F7","v":22731.114497999999},{"$f":"'1'!$E$117","v":1569.6999999999998},{"$f":"G33+F33","v":24300.814498},{"$f":"H33*E33","v":48601.628995999999},null,{"$f":"I33/$I$39","v":5.8333000486426846E-2},{"$f":"$I$52*K33","v":836.92645368145691}]
[null,null,2,{"$f":"HLOOKUP(C34,'Dados Gerais'!$D$5:$BK$10,6)","v":"BOMBEIRO CIVIL LÍDER DIURNO"},{"$f":"HLOOKUP(C34,'Dados Gerais'!$D$5:$BK$14,10)","v":2},{"$f":"F8","v":12329.3925},{"$f":"'2'!$E$117","v":832.95999999999992},13162.352499999999,26324.704999999998,null,{"$f":"I34/$I$39","v":3.1595628815166373E-2},{"$f":"$I$52*K34","v":453.3148878955019}]
[null,null,3,{"$f":"HLOOKUP(C35,'Dados Gerais'!$D$5:$BK$10,6)","v":"BOMBEIRO CIVIL LÍDER NOTURNO"},{"$f":"HLOOKUP(C35,'Dados Gerais'!$D$5:$BK$14,10)","v":2},{"$f":"F9","v":13857.190480000003},{"$f":"'3'!$E$116","v":897.4899999999999},14754.680480000003,29509.360960000005,null,{"$f":"I35/$I$39","v":3.5417939743861211E-2},{"$f":"$I$52*K35","v":508.15508304652627}]
[null,null,4,{"$f":"HLOOKUP(C36,'Dados Gerais'!$D$5:$BK$10,6)","v":"BOMBEIRO CIVIL BÁSICO DIURNO"},{"$f":"HLOOKUP(C36,'Dados Gerais'!$D$5:$BK$14,10)","v":36},{"$f":"F10","v":10171.622593999999},{"$f":"'4'!$E$116","v":637.74},10809.362593999998,389137.05338399997,null,{"$f":"I36/$I$39","v":0.46705290323095533},{"$f":"$I$52*K36","v":6700.9913209190345}]
[null,null,5,{"$f":"HLOOKUP(C37,'Dados Gerais'!$D$5:$BK$10,6)","v":"BOMBEIRO CIVIL BÁSICO NOTURNO"},{"$f":"HLOOKUP(C37,'Dados Gerais'!$D$5:$BK$14,10)","v":28},{"$f":"F11","v":11404.451018000002},{"$f":"'5'!$E$116","v":724.22},{"$f":"G37+F37","v":12128.671018000001},{"$f":"H37*E37","v":339602.78850400005},null,{"$f":"I37/$I$39","v":0.40760052772359029},{"$f":"$I$52*K37","v":5848.0047544574818}]
[]
[null,null,null,"TOTAL MENSAL - SALÁRIOS",null,null,null,null,{"$f":"SUM(I33:I38)","v":833175.53684399999}]
[]
[null,null,"ITEM","DESCRIÇÃO",null,null,null,null,"PREÇO TOTAL (MENSAL)"]
[null,null,"EQUIP","EQUIPAMENTOS NÃO RELACIONADOS DIRETAMENTE A UM POSTO DE TRABALHO",null,null,null,null,{"$f":"'Não Rel - Depr'!M70","v":0}]
[null,null,"HEXTRA","HORAS EXTRAS",null,null,null,null,{"$f":"'Não Rel - Depr'!M70","v":0}]
[null,null,"HNOT","ADICIONAL DE HORAS NOTURNAS (SOB DEMANDA)",null,null,null,null,0]
[null,null,"SREP","SISTEMA DE REGISTRO ELETRÔNICO DE PRESENÇA - SREP",null,null,null,null,{"$f":"SREP!$M$46","v":768.88}]
[null,null,"EPI - N.REL","EQUIPAMENTOS DE PROTEÇÃO INDIVIDUAL NÃO RELACIONADOS DIRETAMENTE A UM POSTO DE TRABALHO",null,null,null,null,{"$f":"'Não Rel - EPI'!K19","v":12813.213333333335}]
[null,null,"EQUIP - N.REL","EQUIPAMENTOS NÃO RELACIONADAS DIRETAMENTE A UM POSTO DE TRABALHO",null,null,null,null,{"$f":"'Não Rel - Depr'!M71","v":530.91}]
[null,null,"MAT ","MATERIAIS NÃO RELACIONADOS DIRETAMENTE A UM POSTO DE TRABALHO",null,null,null,null,{"$f":"'Não Rel - Mat Consumo'!L24","v":234.38916666666668}]
[null,null,"MAT CONS DURAVEL","MATERIAIS DE CONSUMO DURÁVEL NÃO RELACIONADOS DIRETAMENTE A UM POSTO DE TRABALHO",null,null,null,null,{"$f":"'Não Rel - Mat Cons Durável'!M37","v":0}]
[null,null,"EQ SOB DEMANDA","SERVIÇOS NÃO RELACIONADOS DIRETAMENTE A UM POSTO DE TRABALHO ",null,null,null,null,{"$f":"'Não Rel - Serviços'!K10","v":0}]
[]
[null,null,null,"TOTAL MENSAL",null,null,null,null,{"$f":"SUM(I42:I51)","v":14347.3925},null,{"$f":"(I52+I39)*12","v":10170275.152128}]
[]
[null,null,null,"TOTAL MENSAL - ITENS ORDINÁRIOS"]
[null,null,null,"DESCRIÇÃO",null,null,null,"VALOR"]
[null,null,null,"Postos de Trabalho - Inclusive 13º Salário",null,null,null,{"$f":"I39","v":833175.53684399999}]
[null,null,null,"Adicional de Horas Noturnas",null,null,null,{"$f":"I44","v":0}]
[null,null,null,"Sistema de Registro Eletrônico de Presença - SREP",null,null,null,{"$f":"I45","v":768.88}]
[null,null,null,"Equipamentos de Proteção Individual não relacionados diretamente a um posto de trabalho",null,null,null,{"$f":"I46","v":12813.213333333335}]
[null,null,null,"Equipamentos não relacionadas diretamente a um posto de trabalho",null,null,null,{"$f":"I47","v":530.91}]
[null,null,null,"Materiais de consumo não relacionados diretamente a um posto de trabalho",null,null,null,{"$f":"$I$48","v":234.38916666666668}]
[null,null,null,"Materiais de consumo duráveis não relacionados diretamente a um posto de trabalho",null,null,null,{"$f":"$I$49","v":0}]
[]
[null,null,null,null,null,null,"TOTAL MENSAL DA CONTRATAÇÃO",{"$f":"SUM(H56:H63)","v":847522.92934400006},null,null,{"$f":"Extenso_Valor(H64)","v":"oitocentos e quarenta e sete mil, quinhentos e vinte e dois reais e noventa e três centavos"}]
[]
[null,null,null,"TOTAL ANUAL - ITENS ORDINÁRIOS"]
[]
[null,null,null,null,null,null,"12 x TOTAL MENSAL",{"$f":"H64*12","v":10170275.152128},null,null,{"$f":"Extenso_Valor(H68)","v":"dez milhões, cento e setenta mil, duzentos e setenta e cinco reais e quinze centavos"}]
[]
[null,null,null,"TOTAL MENSAL - ITENS SOB DEMANDA"]
[null,null,null,"DESCRIÇÃO",null,null,null,"VALOR"]
[null,null,null,"Serviços não relacionados diretamente a um posto de trabalho - AQUISIÇÃO SOB DEMANDA",null,null,null,{"$f":"I50","v":0}]
[]
[null,null,null,null,null,null,"TOTAL MENSAL DA CONTRATAÇÃO",{"$f":"SUM(H72:H73)","v":0}]
[]
[null,null,null,"TOTAL ANUAL - ITENS SOB DEMANDA"]
[]
[null,null,null,null,null,null,"12 x TOTAL MENSAL",{"$f":"H74*12","v":0}]
[]
[null,null,null,"TOTAL ANUAL DA CONTRATAÇÃO"]
[]
[null,null,null,null,null,null,null,{"$f":"H78+H68","v":10170275.152128},null,null,{"$f":"Extenso_Valor(H82)","v":"dez milhões, cento e setenta mil, duzentos e setenta e cinco reais e quinze centavos"}]
[]
[null,null,null,"TOTAL GLOBAL DA CONTRATAÇÃO (30 MESES)"]
[]
[null,null,null,null,null,null,null,{"$f":"H82/12*30","v":25425687.880319998}]
[]
[]
[]
[]
[null,null,null,null,null,null,null,{"$f":"H64+H74","v":847522.92934400006},null,null,{"$f":"Extenso_Valor(H91)","v":"oitocentos e quarenta e sete mil, quinhentos e vinte e dois reais e noventa e três centavos"}]

{"sheet":"1","index":4,"n_rows":119,"n_cols":8,"rows_kept":119,"cut":false,"hidden":false,"merged":[[106,1,106,3],[1,1,1,5],[2,1,2,5],[7,1,7,3],[17,1,17,3],[4,1,4,2],[46,1,46,3],[56,1,56,3],[74,1,74,3],[83,1,83,3],[5,1,5,2],[39,3,39,5],[68,3,68,5]]}
[]
[null,"PLANILHA DE ESTIMATIVA DE CUSTOS"]
[]
[]
[null,1,null,{"$f":"HLOOKUP($B$5,'Dados Gerais'!$D$5:$BK$20,6)","v":"BOMBEIRO CIVIL MESTRE"},"QUANTIDADE",{"$f":"HLOOKUP($B$5,'Dados Gerais'!$D$5:$BK$20,10)","v":2}]
[null,"CCT",null,{"$f":"HLOOKUP($B$5,'Dados Gerais'!$D$5:$BK$20,15)","v":"SEAC/DF X SINDIBOMBEIROS/DF 2023/2023 Nº DF000140/2023"},"DATA-BASE",{"$f":"HLOOKUP($B$5,'Dados Gerais'!$D$5:$BK$20,16)","v":"2023-01-01"}]
[]
[null,"MÓDULO 1 - COMPOSIÇÃO DA REMUNERAÇÃO",null,null,null,"Valor"]
[null,null,"A","Salário-Base",null,{"$f":"HLOOKUP($B$5,'Dados Gerais'!$D$5:$BK$20,8)","v":8161.0099999999993}]
[null,null,"B","Adicional de Periculosidade",null,{"$f":"HLOOKUP($B$5,'Dados Gerais'!$D$5:$BK$37,25)","v":2448.3000000000002}]
[null,null,"C","Adicional de Insalubridade",null,{"$f":"HLOOKUP($B$5,'Dados Gerais'!$D$5:$BK$37,31)","v":0}]
[null,null,"D","Adicional Noturno",null,{"$f":"HLOOKUP($B$5,'Dados Gerais'!$D$5:$BK$50,46)","v":0},null,"* Nota 1 - O Módulo 1 refere-se ao valor mensal devido ao empregado pela prestação do serviço no período de 12 meses."]
[null,null,"E","Adicional de Hora Extra",null,{"$f":"HLOOKUP($B$5,'Dados Gerais'!$D$5:$BK$67,63)","v":0},null,"* Nota 2 - O adicional de hora extra no feriado trabalhado foi suprimido pela Lei 13.467/17"]
[null,null,"F","Outros (especificar)",null,{"$f":"HLOOKUP($B$5,'Dados Gerais'!$D$5:$BK$59,33)","v":0},null,"* Nota 3 - ART. 7º, § 2º, DA LEI Nº 605/49.Sendo mensalista o obreiro, o adicional noturno pago de forma fixa já é considerado integrado para os efeitos do pagamento do repouso semanal remunerado, nos termos do art. 7º, § 2º, da Lei nº 605/49."]
[]
[null,null,null,"TOTAL DA REMUNERAÇÃO",null,{"$f":"SUM(F9:F14)","v":10609.31}]
[]
[null,"MÓDULO 2 - ENCARGOS E BENEFÍCIOS ANUAIS, MENSAIS E DIÁRIOS",null,null,"Percentuais","Valor"]
[null,"Submódulo 2.1 - 13º Salário e Adicional de Férias"]
[null,null,"A","13º Salário - Calculado no Módulo 7 - Destacado",0,{"$f":"ROUND(E20*F$16,2)","v":0}]
[null,null,"B","Adicional de Férias",{"$f":"'Encargos Sociais'!E31","v":3.03030303030303E-2},{"$f":"ROUND(E21*F$16,2)","v":321.49},null,"* Nota 1 - Provisiona-se, mensalmente, o proporcional a 1/12 dos valores referentes a gratificação natalina, férias e adicional de férias."]
[null,null,null,null,null,null,null,"* Nota 2 - O adicional de férias contido no Submódulo 2.1 corresponde a 1/3 da remuneração que, por sua vez, é dividida por 12 contome Nota 1."]
[null,"Submódulo 2.2 - Encargos Previdenciários (GPS), Fundo de Garantia por Tempo de Serviço (FGTS) e Outras Contribuições"]
[null,null,"A",{"$f":"'Encargos Sociais'!D14","v":"INSS (art. 22, inciso I, Lei nº 8.212/91)"},{"$f":"'Encargos Sociais'!E14","v":0.2},{"$f":"ROUND(E24*($F$16+$F$41+$F$73),2)","v":2421.56}]
[null,null,"B",{"$f":"'Encargos Sociais'!D15","v":"Salário Educação (art. 3º, inciso I, Decreto nº 87.043/82)"},{"$f":"'Encargos Sociais'!E15","v":2.5000000000000001E-2},{"$f":"ROUND(E25*($F$16+$F$41+$F$73),2)","v":302.7}]
[null,null,"C",{"$f":"'Encargos Sociais'!D16","v":"SAT/RAT (art. 22, II, Lei 8.212/91 e Anexo V, Decreto 6.042/07) - Enquadramento 8011-1/01"},{"$f":"'Encargos Sociais'!E16","v":0.03},363.23]
[null,null,"D",{"$f":"'Encargos Sociais'!D17","v":"SESC ou SESI (art. 30, Lei nº 8.036/90 e art. 1º, Lei 8.154/90)"},{"$f":"'Encargos Sociais'!E17","v":1.4999999999999999E-2},181.62]
[null,null,"E",{"$f":"'Encargos Sociais'!D18","v":"SENAI ou SENAC (Decreto nº 2.318/86)"},{"$f":"'Encargos Sociais'!E18","v":0.01},121.08]
[null,null,"F",{"$f":"'Encargos Sociais'!D19","v":"SEBRAE (§ 3º, art. 8º, Lei 8.029/90, alterada pela Lei nº 8.154/90)"},{"$f":"'Encargos Sociais'!E19","v":6.0000000000000001E-3},72.650000000000006]
[null,null,"G",{"$f":"'Encargos Sociais'!D20","v":"INCRA (art. 1º, I, Decreto Lei 1.146/70 e Lei 7.787, de 30/06/89)"},{"$f":"'Encargos Sociais'!E20","v":2E-3},24.22,null,"* Nota 1 - Os percentuais dos encargos previdenciários, do FGTS e demais contribuições são estabelecidos por legislação vigente."]
[null,null,"H",{"$f":"'Encargos Sociais'!D21","v":"FGTS (Lei Complementar nº 110/01 e art. 30, Lei nº 8.036/90)"},{"$f":"'Encargos Sociais'!E21","v":0.08},968.63,null,"* Nota 2 - O SAT, a depender do grau de risco do serviço, irá variar entre 1%, para risco leve, de 2%, para risco médio, e de 3% para risco grave."]
[null,null,"I",{"$f":"'Encargos Sociais'!D22","v":"SECONCI (Convenções Coletivas de Trabalho da construção)"},{"$f":"'Encargos Sociais'!E22","v":0},0,null,"* Nota 3 - Os percentuais do Submódulo 2.2 incidem sobre o Módulo 1 e o Submódulo 2.1."]
[]
[null,"Submódulo 2.3 - Benefícios Mensais e Diários"]
[null,null,"A","Auxílio Transporte",null,{"$f":"HLOOKUP($B$5,'Dados Gerais'!$D$5:$BK$93,82)","v":0}]
[null,null,"B","Auxílio Alimentação",null,{"$f":"HLOOKUP($B$5,'Dados Gerais'!$D$5:$BK$93,89)","v":1134.1199999999999}]
[null,null,"C","Assistência Médica e Familiar",null,{"$f":"HLOOKUP($B$5,'Dados Gerais'!$D$5:$BK$101,97)","v":0}]
[null,null,"D","Outros (Seguro de vida e auxílio funeral e auxílio odontológico)",null,{"$f":"HLOOKUP($B$5,'Dados Gerais'!$D$5:$BK$118,114)","v":0},null,"* Nota 1 - O valor informado deverá ser o custo real do benefício (descontado o valor eventualmente pago pelo empregado)."]
[null,null,null,null,null,null,null,"* Nota 2 - Observar a previsão dos benefícios contidos em Acordos, Convenções e Dissídios Coletivos de Trabalho e o disposto no art. 6º da IN 5/2017"]
[null,null,null,"QUADRO-RESUMO DO MÓDULO 2"]
[null,null,null,"2.1 - 13º Salário, Férias e Adicional de Férias - 13º Destacado - Calculado no Módulo 7 ",{"$f":"SUM(E20:E21)","v":3.03030303030303E-2},{"$f":"F20+F21","v":321.49}]
[null,null,null,"2.2 - Encargos Previdenciários (GPS), Fundo de Garantia por Tempo de Serviço (FGTS) e Contribuições",{"$f":"SUM(E24:E32)","v":0.36800000000000005},{"$f":"SUM(F24:F32)","v":4455.6899999999996}]
[null,null,null,"2.3 - Benefícios Mensais e Diários",null,{"$f":"SUM(F35:F38)","v":1134.1199999999999}]
[]
[null,null,null,"TOTAL DOS ENCARGOS E BENEFÍCIOS",null,{"$f":"SUM(F41:F43)","v":5911.2999999999993}]
[]
[null,"MÓDULO 3 - PREVISÃO PARA RESCISÃO",null,null,"Percentuais","Valor"]
[null,null,"A",{"$f":"'Encargos Sociais'!D36","v":"Aviso Prévio Indenizado (Art. 7º, inciso XXI, da CF/1988 e arts. 477, 487, §1º, e 491 da CLT)"},{"$f":"'Encargos Sociais'!E36","v":8.3333333333333332E-3},{"$f":"ROUND(E48*$F$16,2)","v":88.41}]
[null,null,"B",{"$f":"'Encargos Sociais'!D37","v":"Incidência do FGTS sobre o Aviso Prévio Indenizado (Súmula 305 TST)"},{"$f":"'Encargos Sociais'!E37","v":6.6666666666666664E-4},7.07,null,"* Nota 1 - Adotou-se os parâmetros do estudo do STF (http://www.stf.jus.br/arquivo/cms/sobrestfestudosci/anexo/encargos_sociais_03102007.pdf), onde 5% do pessoal é demitido pelo empregador no decurso do contrato (para estes, considerou-se o aviso prévio indenizado). Desprezou-se as demissões por justa causa e os pedidos de demissão."]
[null,null,"C",{"$f":"'Encargos Sociais'!D38","v":"Multa do FGTS e Contribuição Social sobre o Aviso Prévio Indenizado (Art. 18, §1º, da Lei 8.036/1990 e art. 1º da LC nº 110/2001)"},{"$f":"'Encargos Sociais'!E38","v":7.7170666666666644E-3},81.87,null,"* Nota 2 - No cálculo do percentual, considerou-se 36 dias, correspondendo à metade da duração média dos contratos (2 anos)"]
[null,null,"D",{"$f":"'Encargos Sociais'!D39","v":"Aviso Prévio Trabalhado (Art. 488, parágrafo único, CLT)"},{"$f":"'Encargos Sociais'!E39","v":1.2037037037037035E-2},127.7,null,"* Nota 3 - Incide sobre a Remuneração + 13º salário (1/12) + Férias (1/12) + Adicional de Férias (1/36) x 50% multa (40% para o empregado e 10% de contribuição social) x 8% FGTS"]
[null,null,"E",{"$f":"'Encargos Sociais'!D40","v":"Incidência de GPS, FGTS e outras contribuições sobre o Aviso Prévio Trabalhado"},{"$f":"'Encargos Sociais'!E40","v":4.4296296296296288E-3},47,null,"* Nota 4 - Os 95% restantes do cálculo, a um prazo médio de contrato de 4 anos. Assim, calcula-se 7 dias para o 1º ano de contrato e mais 3 dias para os 3 anos seguintes."]
[null,null,"F",{"$f":"'Encargos Sociais'!D41","v":"Multa do FGTS e Contribuição Social sobre o Aviso Prévio Trabalhado"},{"$f":"'Encargos Sociais'!E41","v":3.0505155555555549E-2},323.64]
[]
[null,null,null,"TOTAL DE PREVISÃO PARA RESCISÃO",null,{"$f":"SUM(F48:F53)","v":675.69}]
[]
[null,"MÓDULO 4 - CUSTO DO PROFISSIONAL AUSENTE",null,null,"Percentuais","Valor"]
[null,"Submódulo 4.1 - Ausências Legais"]
[null,null,"A",{"$f":"'Encargos Sociais'!D25","v":"Férias (Arts. 129 e 130, inc. I, da CLT)"},{"$f":"'Encargos Sociais'!E25","v":9.0909090909090912E-2},{"$f":"ROUND(E59*$F$16,2)","v":964.48},null,"* Nota 1 - As alíneas “A” a “F” referem-se somente ao custo que será pago ao profissional ausente."]
[null,null,"B",{"$f":"'Encargos Sociais'!D26","v":"Ausências Legais (Arts. 131 e 473 da CLT)"},{"$f":"'Encargos Sociais'!E26","v":7.9365079365079361E-3},84.2,null,"* Nota 2 - Adotou-se a estimativa do SINAPI de 2 dias por ano."]
[null,null,"C",{"$f":"'Encargos Sociais'!D27","v":"Licença-Paternidade (Art. 7º, XIX, e art. 10, §1º, do ADCT, CF/1988 e Art. 1º, II, da Lei 11.770/2008)"},{"$f":"'Encargos Sociais'!E27","v":8.2777777777777776E-4},8.7799999999999994,null,"* Nota 3 - Utilizada a proporção de 50% para homens, 5 dias de afastamento, e a probabilidade de um trabalhador requerer a Licença Paternidade em 5,22%, conforme SINAPI (citando dados da PNAD 2015)"]
[null,null,"D",{"$f":"'Encargos Sociais'!D28","v":"Ausência por Acidente de Trabalho (Art. 131, III, da CLT)"},{"$f":"'Encargos Sociais'!E28","v":8.541666666666667E-4},9.06,null,"* Nota 4 - Utilzada a estatística de 1,96% dos contribuintes beneficiados com a emissão do auxílio, conforme Anuário Estatístico da Previdência Social. Afastamento de 15 dias a cargo da empresa."]
[null,null,"E",{"$f":"'Encargos Sociais'!D29","v":"Afastamento Maternidade (Art. 71 da Lei nº 8.213/1991)"},{"$f":"'Encargos Sociais'!E29","v":3.2925925925925922E-3},34.93,null,"* Nota 5 - Utilizada a proporção de 50% para mulheres, 180 dias de afastamento, e a probabilidade de uma trabalhadora requerer a Licença Maternidade em 4,91%, conforme SINAPI (citando dados do IBGE 2016)"]
[null,null,"F",{"$f":"'Encargos Sociais'!D30","v":"Auxílio Enfermidade - Doença (Art. 59 da Lei nº 8.213/1991)"},{"$f":"'Encargos Sociais'!E30","v":7.1222222222222225E-3},75.56,null,"* Nota 6 - Utilizada a estatística de 3,37% dos contribuintes beneficiados com o auxílio, conforme Anuário Estatístico da Previdência Social de 2015 (acrescidos de 2 dias ao ano, para os quais o trabalhador nem requer o benefício da Previdência - conforme SINAPI)"]
[]
[null,"Submódulo 4.2 - Intrajornada"]
[null,null,"A","Intervalo para repouso ou alimentação",{"$f":"'Encargos Sociais'!E33","v":0},{"$f":"ROUND(E67*$F$16,2)","v":0}]
[]
[null,null,null,"QUADRO-RESUMO DO MÓDULO 4",null,"Valor"]
[null,null,null,"4.1 - Ausências Legais",{"$f":"SUM(E59:E64)","v":0.11094235810485811},{"$f":"ROUND(E70*$F$16,2)","v":1177.02}]
[null,null,null,"4.2 - Intrajornada",{"$f":"E67","v":0},{"$f":"ROUND(E71*$F$16,2)","v":0}]
[]
[null,null,null,"TOTAL DE PREVISÃO PARA RESCISÃO E INTERVALO INTRAJORNADA",null,{"$f":"SUM(F70:F71)","v":1177.02}]
[]
[null,"MÓDULO 5 - INSUMOS DIVERSOS",null,null,null,"Valor"]
[null,null,"A","Uniformes - aquisição",null,{"$f":"ROUND(HLOOKUP($B$5,Uniformes!L4:EA73,3)/12,2)","v":86.25}]
[null,null,"B","Materiais de consumo relacionados ao posto - aquisição",null,{"$f":"ROUND(HLOOKUP(B5,'Mat Cons'!I11:DX13,3)/12,2)","v":0}]
[null,null,"C","Materiais permanentes relacionados ao posto - remuneração da sua depreciação / manutenção",null,{"$f":"HLOOKUP(B5,'Mat Perm'!Q11:EF13,3)","v":0}]
[null,null,"D","Equipamentos relacionados ao posto - remuneração da sua depreciação / manutenção",null,{"$f":"HLOOKUP(B5,'Equip Rel'!Q11:EF13,3)","v":0}]
[null,null,"E","Equipamentos de Proteção Individual - EPI - aquisição",null,{"$f":"ROUND(HLOOKUP(B5,EPI!J4:DY6,3)/12,2)","v":0}]
[]
[null,null,null,"TOTAL DE INSUMOS DIVERSOS",null,{"$f":"SUM(F76:F81)","v":86.25},null,"* Nota - Valores mensais por empregado"]
[]
[null,"MÓDULO 6 - CUSTOS INDIRETOS, TRIBUTOS E LUCRO - BDI",null,null,"Percentuais","Valor"]
[null,null,"A","Custos Indiretos",{"$f":"BDI!E6","v":3.1399999999999997E-2}]
[null,null,"A.1","Administração Central",{"$f":"BDI!E7","v":2.5999999999999999E-2}]
[null,null,"A.2","Seguros, Garantias e Riscos",{"$f":"BDI!E8","v":5.4000000000000003E-3}]
[null,null,"B","Lucro",{"$f":"BDI!E10","v":0.04}]
[null,null,"C","Tributos",{"$f":"SUM(E90:E91)","v":0.124}]
[null,null,"C.1","Tributos Federais (COFINS, PIS e CPRB)",{"$f":"BDI!E18","v":7.3999999999999996E-2}]
[null,null,"C.2","Tributos Distritais (ISS)",{"$f":"BDI!E23","v":0.05},null,null,"* Nota - Utilizou-se o indicado pelo Sindicato da Arquitetura e da Engenharia (Sinaenco, 2008, p. 22), que adota um percentual redutor de 20% no cálculo dos custos tributários relativos às contribuições PIS e COFINS"]
[null,null,"D","Despesas Financeiras",{"$f":"BDI!E13","v":5.6394995474364773E-3}]
[]
[null,null,null,"TOTAL DE BDI",{"$f":"BDI!E26","v":0.23139999999999999},{"$f":"E94*E102","v":4271.5444980000002}]
[]
[null,null,null,"QUADRO-RESUMO DO CUSTO MENSAL POR EMPREGADO - SEM O 13º","Valor"]
[null,null,null,"Módulo 1 - Composição da Remuneração",{"$f":"F16","v":10609.31}]
[null,null,null,"Módulo 2 - Encargos e Benefícios Anuais, Mensais e Diários",{"$f":"F45","v":5911.2999999999993}]
[null,null,null,"Módulo 3 - Provisão para Rescisão",{"$f":"F55","v":675.69}]
[null,null,null,"Módulo 4 - Custo de Reposição do Profissional Ausente",{"$f":"F73","v":1177.02}]
[null,null,null,"Módulo 5 - Insumos Diversos",{"$f":"F82","v":86.25}]
[null,null,null,"SUBTOTAL (A+B+C+D+E)",{"$f":"SUM(E97:E101)","v":18459.57}]
[null,null,null,"Módulo 6 - Custos Indiretos, Tributos e Lucro",{"$f":"F94","v":4271.5444980000002}]
[]
[null,null,null,"TOTAL DO POSTO",{"$f":"SUM(E102:E103)","v":22731.114497999999}]
[]
[null,"MÓDULO 7 - DESTAQUE DO MÓDULO 2 - 13º SALÁRIO",null,null,"Percentuais","Valor"]
[null,null,"A","13º Salário",{"$f":"'Encargos Sociais'!E32","v":8.3333333333333329E-2},{"$f":"ROUND(E108*F$16,2)","v":884.11}]
[null,null,"B","Encargos Sociais sobre o 13º Salário - Taxa calculada no SUBMÓDULO 2.2",{"$f":"SUM($E$24:$E$32)","v":0.36800000000000005},{"$f":"ROUND(E109*$F$108,2)","v":325.35000000000002},null,"* Nota 1 - Provisiona-se, mensalmente, o proporcional a 1/12 dos valores referentes a gratificação natalina e adicional de férias."]
[null,null,"C","Reincidência de férias sobre o 13º Salário",{"$f":"E59","v":9.0909090909090912E-2},{"$f":"ROUND(E110*$F$108,2)","v":80.37}]
[null,null,"D","BDI sobre o 13º Salário - Taxa calculada no MÓDULO 6",{"$f":"E94","v":0.23139999999999999},{"$f":"ROUND(E111*($F$108+$F$109),2)","v":279.87}]
[]
[null,null,null,"TOTAL DO DESTAQUE DO 13º SALÁRIO",null,{"$f":"SUM(F108:F111)","v":1569.6999999999998}]
[]
[null,null,null,"QUADRO-RESUMO DO CUSTO MENSAL POR EMPREGADO","Valor"]
[null,null,null,"Custo total - sem o 13º Salário",{"$f":"E105","v":22731.114497999999}]
[null,null,null,"Destaque do 13º Salário (valor mensal)",{"$f":"F113","v":1569.6999999999998}]
[]
[null,null,null,"TOTAL DO POSTO",{"$f":"E116+E117","v":24300.814498}]

{"sheet":"2","index":5,"n_rows":119,"n_cols":8,"rows_kept":119,"cut":false,"hidden":false,"merged":[[1,1,1,5],[2,1,2,5],[4,1,4,2],[5,1,5,2],[7,1,7,3],[17,1,17,3],[106,1,106,3],[39,3,39,5],[46,1,46,3],[56,1,56,3],[68,3,68,5],[74,1,74,3],[83,1,83,3]]}
[]
[null,"PLANILHA DE ESTIMATIVA DE CUSTOS"]
[]
[]
[null,2,null,{"$f":"HLOOKUP($B$5,'Dados Gerais'!$D$5:$BK$20,6)","v":"BOMBEIRO CIVIL LÍDER DIURNO"},"QUANTIDADE",{"$f":"HLOOKUP($B$5,'Dados Gerais'!$D$5:$BK$20,10)","v":2}]
[null,"CCT",null,{"$f":"HLOOKUP($B$5,'Dados Gerais'!$D$5:$BK$20,15)","v":"SEAC/DF X SINDIBOMBEIROS/DF 2023/2023 Nº DF000140/2023"},"DATA-BASE",{"$f":"HLOOKUP($B$5,'Dados Gerais'!$D$5:$BK$20,16)","v":"2023-01-01"}]
[]
[null,"MÓDULO 1 - COMPOSIÇÃO DA REMUNERAÇÃO",null,null,null,"Valor"]
[null,null,"A","Salário-Base",null,{"$f":"HLOOKUP($B$5,'Dados Gerais'!$D$5:$BK$20,8)","v":4330.6000000000004}]
[null,null,"B","Adicional de Periculosidade",null,{"$f":"HLOOKUP($B$5,'Dados Gerais'!$D$5:$BK$37,25)","v":1299.18}]
[null,null,"C","Adicional de Insalubridade",null,{"$f":"HLOOKUP($B$5,'Dados Gerais'!$D$5:$BK$37,31)","v":0}]
[null,null,"D","Adicional Noturno",null,{"$f":"HLOOKUP($B$5,'Dados Gerais'!$D$5:$BK$50,46)","v":0},null,"* Nota 1 - O Módulo 1 refere-se ao valor mensal devido ao empregado pela prestação do serviço no período de 12 meses."]
[null,null,"E","Adicional de Hora Extra",null,{"$f":"HLOOKUP($B$5,'Dados Gerais'!$D$5:$BK$67,63)","v":0},null,"* Nota 2 - O adicional de hora extra no feriado trabalhado foi suprimido pela Lei 13.467/17"]
[null,null,"F","Outros (especificar)",null,{"$f":"HLOOKUP($B$5,'Dados Gerais'!$D$5:$BK$59,33)","v":0},null,"* Nota 3 - ART. 7º, § 2º, DA LEI Nº 605/49.Sendo mensalista o obreiro, o adicional noturno pago de forma fixa já é considerado integrado para os efeitos do pagamento do repouso semanal remunerado, nos termos do art. 7º, § 2º, da Lei nº 605/49."]
[]
[null,null,null,"TOTAL DA REMUNERAÇÃO",null,{"$f":"SUM(F9:F14)","v":5629.7800000000007}]
[]
[null,"MÓDULO 2 - ENCARGOS E BENEFÍCIOS ANUAIS, MENSAIS E DIÁRIOS",null,null,"Percentuais","Valor"]
[null,"Submódulo 2.1 - 13º Salário e Adicional de Férias"]
[null,null,"A","13º Salário - Calculado no Módulo 7 - Destacado",0,{"$f":"ROUND(E20*F$16,2)","v":0}]
[null,null,"B","Adicional de Férias",{"$f":"'Encargos Sociais'!E31","v":3.03030303030303E-2},{"$f":"ROUND(E21*F$16,2)","v":170.6},null,"* Nota 1 - Provisiona-se, mensalmente, o proporcional a 1/12 dos valores referentes a gratificação natalina, férias e adicional de férias."]
[null,null,null,null,null,null,null,"* Nota 2 - O adicional de férias contido no Submódulo 2.1 corresponde a 1/3 da remuneração que, por sua vez, é dividida por 12 contome Nota 1."]
[null,"Submódulo 2.2 - Encargos Previdenciários (GPS), Fundo de Garantia por Tempo de Serviço (FGTS) e Outras Contribuições"]
[null,null,"A",{"$f":"'Encargos Sociais'!D14","v":"INSS (art. 22, inciso I, Lei nº 8.212/91)"},{"$f":"'Encargos Sociais'!E14","v":0.2},{"$f":"ROUND(E24*($F$16+$F$41+$F$73),2)","v":1284.99}]
[null,null,"B",{"$f":"'Encargos Sociais'!D15","v":"Salário Educação (art. 3º, inciso I, Decreto nº 87.043/82)"},{"$f":"'Encargos Sociais'!E15","v":2.5000000000000001E-2},{"$f":"ROUND(E25*($F$16+$F$41+$F$73),2)","v":160.62}]
[null,null,"C",{"$f":"'Encargos Sociais'!D16","v":"SAT/RAT (art. 22, II, Lei 8.212/91 e Anexo V, Decreto 6.042/07) - Enquadramento 8011-1/01"},{"$f":"'Encargos Sociais'!E16","v":0.03},192.75]
[null,null,"D",{"$f":"'Encargos Sociais'!D17","v":"SESC ou SESI (art. 30, Lei nº 8.036/90 e art. 1º, Lei 8.154/90)"},{"$f":"'Encargos Sociais'!E17","v":1.4999999999999999E-2},96.37]
[null,null,"E",{"$f":"'Encargos Sociais'!D18","v":"SENAI ou SENAC (Decreto nº 2.318/86)"},{"$f":"'Encargos Sociais'!E18","v":0.01},64.25]
[null,null,"F",{"$f":"'Encargos Sociais'!D19","v":"SEBRAE (§ 3º, art. 8º, Lei 8.029/90, alterada pela Lei nº 8.154/90)"},{"$f":"'Encargos Sociais'!E19","v":6.0000000000000001E-3},38.549999999999997]
[null,null,"G",{"$f":"'Encargos Sociais'!D20","v":"INCRA (art. 1º, I, Decreto Lei 1.146/70 e Lei 7.787, de 30/06/89)"},{"$f":"'Encargos Sociais'!E20","v":2E-3},12.85,null,"* Nota 1 - Os percentuais dos encargos previdenciários, do FGTS e demais contribuições são estabelecidos por legislação vigente."]
[null,null,"H",{"$f":"'Encargos Sociais'!D21","v":"FGTS (Lei Complementar nº 110/01 e art. 30, Lei nº 8.036/90)"},{"$f":"'Encargos Sociais'!E21","v":0.08},514,null,"* Nota 2 - O SAT, a depender do grau de risco do serviço, irá variar entre 1%, para risco leve, de 2%, para risco médio, e de 3% para risco grave."]
[null,null,"I",{"$f":"'Encargos Sociais'!D22","v":"SECONCI (Convenções Coletivas de Trabalho da construção)"},{"$f":"'Encargos Sociais'!E22","v":0},0,null,"* Nota 3 - Os percentuais do Submódulo 2.2 incidem sobre o Módulo 1 e o Submódulo 2.1."]
[]
[null,"Submódulo 2.3 - Benefícios Mensais e Diários"]
[null,null,"A","Auxílio Transporte",null,{"$f":"HLOOKUP($B$5,'Dados Gerais'!$D$5:$BK$93,82)","v":0}]
[null,null,"B","Auxílio Alimentação",null,{"$f":"HLOOKUP($B$5,'Dados Gerais'!$D$5:$BK$93,89)","v":676.11}]
[null,null,"C","Assistência Médica e Familiar",null,{"$f":"HLOOKUP($B$5,'Dados Gerais'!$D$5:$BK$101,97)","v":0}]
[null,null,"D","Outros (Seguro de vida e auxílio funeral e auxílio odontológico)",null,{"$f":"HLOOKUP($B$5,'Dados Gerais'!$D$5:$BK$118,114)","v":0},null,"* Nota 1 - O valor informado deverá ser o custo real do benefício (descontado o valor eventualmente pago pelo empregado)."]
[null,null,null,null,null,null,null,"* Nota 2 - Observar a previsão dos benefícios contidos em Acordos, Convenções e Dissídios Coletivos de Trabalho e o disposto no art. 6º da IN 5/2017"]
[null,null,null,"QUADRO-RESUMO DO MÓDULO 2"]
[null,null,null,"2.1 - 13º Salário, Férias e Adicional de Férias - 13º Destacado - Calculado no Módulo 7 ",{"$f":"SUM(E20:E21)","v":3.03030303030303E-2},{"$f":"F20+F21","v":170.6}]
[null,null,null,"2.2 - Encargos Previdenciários (GPS), Fundo de Garantia por Tempo de Serviço (FGTS) e Contribuições",{"$f":"SUM(E24:E32)","v":0.36800000000000005},{"$f":"SUM(F24:F32)","v":2364.38}]
[null,null,null,"2.3 - Benefícios Mensais e Diários",null,{"$f":"SUM(F35:F38)","v":676.11}]
[]
[null,null,null,"TOTAL DOS ENCARGOS E BENEFÍCIOS",null,{"$f":"SUM(F41:F43)","v":3211.09}]
[]
[null,"MÓDULO 3 - PREVISÃO PARA RESCISÃO",null,null,"Percentuais","Valor"]
[null,null,"A",{"$f":"'Encargos Sociais'!D36","v":"Aviso Prévio Indenizado (Art. 7º, inciso XXI, da CF/1988 e arts. 477, 487, §1º, e 491 da CLT)"},{"$f":"'Encargos Sociais'!E36","v":8.3333333333333332E-3},{"$f":"ROUND(E48*$F$16,2)","v":46.91}]
[null,null,"B",{"$f":"'Encargos Sociais'!D37","v":"Incidência do FGTS sobre o Aviso Prévio Indenizado (Súmula 305 TST)"},{"$f":"'Encargos Sociais'!E37","v":6.6666666666666664E-4},3.75,null,"* Nota 1 - Adotou-se os parâmetros do estudo do STF (http://www.stf.jus.br/arquivo/cms/sobrestfestudosci/anexo/encargos_sociais_03102007.pdf), onde 5% do pessoal é demitido pelo empregador no decurso do contrato (para estes, considerou-se o aviso prévio indenizado). Desprezou-se as demissões por justa causa e os pedidos de demissão."]
[null,null,"C",{"$f":"'Encargos Sociais'!D38","v":"Multa do FGTS e Contribuição Social sobre o Aviso Prévio Indenizado (Art. 18, §1º, da Lei 8.036/1990 e art. 1º da LC nº 110/2001)"},{"$f":"'Encargos Sociais'!E38","v":7.7170666666666644E-3},43.45,null,"* Nota 2 - No cálculo do percentual, considerou-se 36 dias, correspondendo à metade da duração média dos contratos (2 anos)"]
[null,null,"D",{"$f":"'Encargos Sociais'!D39","v":"Aviso Prévio Trabalhado (Art. 488, parágrafo único, CLT)"},{"$f":"'Encargos Sociais'!E39","v":1.2037037037037035E-2},67.77,null,"* Nota 3 - Incide sobre a Remuneração + 13º salário (1/12) + Férias (1/12) + Adicional de Férias (1/36) x 50% multa (40% para o empregado e 10% de contribuição social) x 8% FGTS"]
[null,null,"E",{"$f":"'Encargos Sociais'!D40","v":"Incidência de GPS, FGTS e outras contribuições sobre o Aviso Prévio Trabalhado"},{"$f":"'Encargos Sociais'!E40","v":4.4296296296296288E-3},24.94,null,"* Nota 4 - Os 95% restantes do cálculo, a um prazo médio de contrato de 4 anos. Assim, calcula-se 7 dias para o 1º ano de contrato e mais 3 dias para os 3 anos seguintes."]
[null,null,"F",{"$f":"'Encargos Sociais'!D41","v":"Multa do FGTS e Contribuição Social sobre o Aviso Prévio Trabalhado"},{"$f":"'Encargos Sociais'!E41","v":3.0505155555555549E-2},171.74]
[]
[null,null,null,"TOTAL DE PREVISÃO PARA RESCISÃO",null,{"$f":"SUM(F48:F53)","v":358.56}]
[]
[null,"MÓDULO 4 - CUSTO DO PROFISSIONAL AUSENTE",null,null,"Percentuais","Valor"]
[null,"Submódulo 4.1 - Ausências Legais"]
[null,null,"A",{"$f":"'Encargos Sociais'!D25","v":"Férias (Arts. 129 e 130, inc. I, da CLT)"},{"$f":"'Encargos Sociais'!E25","v":9.0909090909090912E-2},{"$f":"ROUND(E59*$F$16,2)","v":511.8},null,"* Nota 1 - As alíneas “A” a “F” referem-se somente ao custo que será pago ao profissional ausente."]
[null,null,"B",{"$f":"'Encargos Sociais'!D26","v":"Ausências Legais (Arts. 131 e 473 da CLT)"},{"$f":"'Encargos Sociais'!E26","v":7.9365079365079361E-3},44.68,null,"* Nota 2 - Adotou-se a estimativa do SINAPI de 2 dias por ano."]
[null,null,"C",{"$f":"'Encargos Sociais'!D27","v":"Licença-Paternidade (Art. 7º, XIX, e art. 10, §1º, do ADCT, CF/1988 e Art. 1º, II, da Lei 11.770/2008)"},{"$f":"'Encargos Sociais'!E27","v":8.2777777777777776E-4},4.66,null,"* Nota 3 - Utilizada a proporção de 50% para homens, 5 dias de afastamento, e a probabilidade de um trabalhador requerer a Licença Paternidade em 5,22%, conforme SINAPI (citando dados da PNAD 2015)"]
[null,null,"D",{"$f":"'Encargos Sociais'!D28","v":"Ausência por Acidente de Trabalho (Art. 131, III, da CLT)"},{"$f":"'Encargos Sociais'!E28","v":8.541666666666667E-4},4.8099999999999996,null,"* Nota 4 - Utilzada a estatística de 1,96% dos contribuintes beneficiados com a emissão do auxílio, conforme Anuário Estatístico da Previdência Social. Afastamento de 15 dias a cargo da empresa."]
[null,null,"E",{"$f":"'Encargos Sociais'!D29","v":"Afastamento Maternidade (Art. 71 da Lei nº 8.213/1991)"},{"$f":"'Encargos Sociais'!E29","v":3.2925925925925922E-3},18.54,null,"* Nota 5 - Utilizada a proporção de 50% para mulheres, 180 dias de afastamento, e a probabilidade de uma trabalhadora requerer a Licença Maternidade em 4,91%, conforme SINAPI (citando dados do IBGE 2016)"]
[null,null,"F",{"$f":"'Encargos Sociais'!D30","v":"Auxílio Enfermidade - Doença (Art. 59 da Lei nº 8.213/1991)"},{"$f":"'Encargos Sociais'!E30","v":7.1222222222222225E-3},40.1,null,"* Nota 6 - Utilizada a estatística de 3,37% dos contribuintes beneficiados com o auxílio, conforme Anuário Estatístico da Previdência Social de 2015 (acrescidos de 2 dias ao ano, para os quais o trabalhador nem requer o benefício da Previdência - conforme SINAPI)"]
[]
[null,"Submódulo 4.2 - Intrajornada"]
[null,null,"A","Intervalo para repouso ou alimentação",{"$f":"'Encargos Sociais'!E33","v":0},{"$f":"ROUND(E67*$F$16,2)","v":0}]
[]
[null,null,null,"QUADRO-RESUMO DO MÓDULO 4",null,"Valor"]
[null,null,null,"4.1 - Ausências Legais",{"$f":"SUM(E59:E64)","v":0.11094235810485811},{"$f":"ROUND(E70*$F$16,2)","v":624.58000000000004}]
[null,null,null,"4.2 - Intrajornada",{"$f":"E67","v":0},{"$f":"ROUND(E71*$F$16,2)","v":0}]
[]
[null,null,null,"TOTAL DE PREVISÃO PARA RESCISÃO E INTERVALO INTRAJORNADA",null,{"$f":"SUM(F70:F71)","v":624.58000000000004}]
[]
[null,"MÓDULO 5 - INSUMOS DIVERSOS",null,null,null,"Valor"]
[null,null,"A","Uniformes - aquisição",null,{"$f":"ROUND(HLOOKUP($B$5,Uniformes!L4:EA73,3)/12,2)","v":106.57}]
[null,null,"B","Materiais de consumo relacionados ao posto - aquisição",null,{"$f":"ROUND(HLOOKUP(B5,'Mat Cons'!I11:DX13,3)/12,2)","v":0}]
[null,null,"C","Materiais permanentes relacionados ao posto - remuneração da sua depreciação / manutenção",null,{"$f":"HLOOKUP(B5,'Mat Perm'!Q11:EF13,3)","v":0}]
[null,null,"D","Equipamentos relacionados ao posto - remuneração da sua depreciação / manutenção",null,{"$f":"HLOOKUP(B5,'Equip Rel'!Q11:EF13,3)","v":0}]
[null,null,"E","Equipamentos de Proteção Individual - EPI - aquisição",null,{"$f":"ROUND(HLOOKUP(B5,EPI!J4:DY6,3)/12,2)","v":81.92}]
[]
[null,null,null,"TOTAL DE INSUMOS DIVERSOS",null,{"$f":"SUM(F76:F81)","v":188.49},null,"* Nota - Valores mensais por empregado"]
[]
[null,"MÓDULO 6 - CUSTOS INDIRETOS, TRIBUTOS E LUCRO - BDI",null,null,"Percentuais","Valor"]
[null,null,"A","Custos Indiretos",{"$f":"BDI!E6","v":3.1399999999999997E-2}]
[null,null,"A.1","Administração Central",{"$f":"BDI!E7","v":2.5999999999999999E-2}]
[null,null,"A.2","Seguros, Garantias e Riscos",{"$f":"BDI!E8","v":5.4000000000000003E-3}]
[null,null,"B","Lucro",{"$f":"BDI!E10","v":0.04}]
[null,null,"C","Tributos",{"$f":"SUM(E90:E91)","v":0.124}]
[null,null,"C.1","Tributos Federais (COFINS, PIS e CPRB)",{"$f":"BDI!E18","v":7.3999999999999996E-2}]
[null,null,"C.2","Tributos Distritais (ISS)",{"$f":"BDI!E23","v":0.05},null,null,"* Nota - Utilizou-se o indicado pelo Sindicato da Arquitetura e da Engenharia (Sinaenco, 2008, p. 22), que adota um percentual redutor de 20% no cálculo dos custos tributários relativos às contribuições PIS e COFINS"]
[null,null,"D","Despesas Financeiras",{"$f":"BDI!E13","v":5.6394995474364773E-3}]
[]
[null,null,null,"TOTAL DE BDI",{"$f":"BDI!E26","v":0.23139999999999999},{"$f":"E94*E102","v":2316.8924999999999}]
[]
[null,null,null,"QUADRO-RESUMO DO CUSTO MENSAL POR EMPREGADO - SEM O 13º","Valor"]
[null,null,null,"Módulo 1 - Composição da Remuneração",{"$f":"F16","v":5629.7800000000007}]
[null,null,null,"Módulo 2 - Encargos e Benefícios Anuais, Mensais e Diários",{"$f":"F45","v":3211.09}]
[null,null,null,"Módulo 3 - Provisão para Rescisão",{"$f":"F55","v":358.56}]
[null,null,null,"Módulo 4 - Custo de Reposição do Profissional Ausente",{"$f":"F73","v":624.58000000000004}]
[null,null,null,"Módulo 5 - Insumos Diversos",{"$f":"F82","v":188.49}]
[null,null,null,"SUBTOTAL (A+B+C+D+E)",{"$f":"SUM(E97:E101)","v":10012.5}]
[null,null,null,"Módulo 6 - Custos Indiretos, Tributos e Lucro",{"$f":"F94","v":2316.8924999999999}]
[]
[null,null,null,"TOTAL DO POSTO",{"$f":"SUM(E102:E103)","v":12329.3925}]
[]
[null,"MÓDULO 7 - DESTAQUE DO MÓDULO 2 - 13º SALÁRIO",null,null,"Percentuais","Valor"]
[null,null,"A","13º Salário",{"$f":"'Encargos Sociais'!E32","v":8.3333333333333329E-2},{"$f":"ROUND(E108*F$16,2)","v":469.15}]
[null,null,"B","Encargos Sociais sobre o 13º Salário - Taxa calculada no SUBMÓDULO 2.2",{"$f":"SUM($E$24:$E$32)","v":0.36800000000000005},{"$f":"ROUND(E109*$F$108,2)","v":172.65},null,"* Nota 1 - Provisiona-se, mensalmente, o proporcional a 1/12 dos valores referentes a gratificação natalina e adicional de férias."]
[null,null,"C","Reincidência de férias sobre o 13º Salário",{"$f":"E59","v":9.0909090909090912E-2},{"$f":"ROUND(E110*$F$108,2)","v":42.65}]
[null,null,"D","BDI sobre o 13º Salário - Taxa calculada no MÓDULO 6",{"$f":"E94","v":0.23139999999999999},{"$f":"ROUND(E111*($F$108+$F$109),2)","v":148.51}]
[]
[null,null,null,"TOTAL DO DESTAQUE DO 13º SALÁRIO",null,{"$f":"SUM(F108:F111)","v":832.95999999999992}]
[]
[null,null,null,"QUADRO-RESUMO DO CUSTO MENSAL POR EMPREGADO","Valor"]
[null,null,null,"Custo total - sem o 13º Salário",{"$f":"E105","v":12329.3925}]
[null,null,null,"Destaque do 13º Salário (valor mensal)",{"$f":"F113","v":832.95999999999992}]
[]
[null,null,null,"TOTAL DO POSTO",{"$f":"E116+E117","v":13162.352499999999}]

{"sheet":"3","index":6,"n_rows":118,"n_cols":8,"rows_kept":118,"cut":false,"hidden":false,"merged":[[1,1,1,5],[2,1,2,5],[4,1,4,2],[5,1,5,2],[7,1,7,3],[17,1,17,3],[106,1,106,3],[39,3,39,5],[46,1,46,3],[56,1,56,3],[68,3,68,5],[74,1,74,3],[83,1,83,3]]}
[]
[null,"PLANILHA DE ESTIMATIVA DE CUSTOS"]
[]
[]
[null,3,null,{"$f":"HLOOKUP($B$5,'Dados Gerais'!$D$5:$BK$20,6)","v":"BOMBEIRO CIVIL LÍDER NOTURNO"},"QUANTIDADE",{"$f":"HLOOKUP($B$5,'Dados Gerais'!$D$5:$BK$20,10)","v":2}]
[null,"CCT",null,{"$f":"HLOOKUP($B$5,'Dados Gerais'!$D$5:$BK$20,15)","v":"SEAC/DF X SINDIBOMBEIROS/DF 2023/2023 Nº DF000140/2023"},"DATA-BASE",{"$f":"HLOOKUP($B$5,'Dados Gerais'!$D$5:$BK$20,16)","v":"2023-01-01"}]
[]
[null,"MÓDULO 1 - COMPOSIÇÃO DA REMUNERAÇÃO",null,null,null,"Valor"]
[null,null,"A","Salário-Base",null,{"$f":"HLOOKUP($B$5,'Dados Gerais'!$D$5:$BK$20,8)","v":4330.6000000000004}]
[null,null,"B","Adicional de Periculosidade",null,{"$f":"HLOOKUP($B$5,'Dados Gerais'!$D$5:$BK$37,25)","v":1299.18}]
[null,null,"C","Adicional de Insalubridade",null,{"$f":"HLOOKUP($B$5,'Dados Gerais'!$D$5:$BK$37,31)","v":0}]
[null,null,"D","Adicional Noturno",null,{"$f":"HLOOKUP($B$5,'Dados Gerais'!$D$5:$BK$50,46)","v":763.54},null,"* Nota 1 - O Módulo 1 refere-se ao valor mensal devido ao empregado pela prestação do serviço no período de 12 meses."]
[null,null,"E","Adicional de Hora Extra",null,{"$f":"HLOOKUP($B$5,'Dados Gerais'!$D$5:$BK$67,63)","v":0},null,"* Nota 2 - O adicional de hora extra no feriado trabalhado foi suprimido pela Lei 13.467/17"]
[null,null,"F","Outros (especificar)",null,{"$f":"HLOOKUP($B$5,'Dados Gerais'!$D$5:$BK$59,33)","v":0},null,"* Nota 3 - ART. 7º, § 2º, DA LEI Nº 605/49.Sendo mensalista o obreiro, o adicional noturno pago de forma fixa já é considerado integrado para os efeitos do pagamento do repouso semanal remunerado, nos termos do art. 7º, § 2º, da Lei nº 605/49."]
[]
[null,null,null,"TOTAL DA REMUNERAÇÃO",null,{"$f":"SUM(F9:F14)","v":6393.3200000000006}]
[]
[null,"MÓDULO 2 - ENCARGOS E BENEFÍCIOS ANUAIS, MENSAIS E DIÁRIOS",null,null,"Percentuais","Valor"]
[null,"Submódulo 2.1 - 13º Salário e Adicional de Férias"]
[null,null,"A","13º Salário - Calculado no Módulo 7 - Destacado",0,{"$f":"ROUND(E20*F$16,2)","v":0}]
[null,null,"B","Adicional de Férias",{"$f":"'Encargos Sociais'!E31","v":3.03030303030303E-2},{"$f":"ROUND(E21*F$16,2)","v":193.74},null,"* Nota 1 - Provisiona-se, mensalmente, o proporcional a 1/12 dos valores referentes a gratificação natalina, férias e adicional de férias."]
[null,null,null,null,null,null,null,"* Nota 2 - O adicional de férias contido no Submódulo 2.1 corresponde a 1/3 da remuneração que, por sua vez, é dividida por 12 contome Nota 1."]
[null,"Submódulo 2.2 - Encargos Previdenciários (GPS), Fundo de Garantia por Tempo de Serviço (FGTS) e Outras Contribuições"]
[null,null,"A",{"$f":"'Encargos Sociais'!D14","v":"INSS (art. 22, inciso I, Lei nº 8.212/91)"},{"$f":"'Encargos Sociais'!E14","v":0.2},{"$f":"ROUND(E24*($F$16+$F$41+$F$73),2)","v":1459.27}]
[null,null,"B",{"$f":"'Encargos Sociais'!D15","v":"Salário Educação (art. 3º, inciso I, Decreto nº 87.043/82)"},{"$f":"'Encargos Sociais'!E15","v":2.5000000000000001E-2},{"$f":"ROUND(E25*($F$16+$F$41+$F$73),2)","v":182.41}]
[null,null,"C",{"$f":"'Encargos Sociais'!D16","v":"SAT/RAT (art. 22, II, Lei 8.212/91 e Anexo V, Decreto 6.042/07) - Enquadramento 8011-1/01"},{"$f":"'Encargos Sociais'!E16","v":0.03},218.89]
[null,null,"D",{"$f":"'Encargos Sociais'!D17","v":"SESC ou SESI (art. 30, Lei nº 8.036/90 e art. 1º, Lei 8.154/90)"},{"$f":"'Encargos Sociais'!E17","v":1.4999999999999999E-2},109.45]
[null,null,"E",{"$f":"'Encargos Sociais'!D18","v":"SENAI ou SENAC (Decreto nº 2.318/86)"},{"$f":"'Encargos Sociais'!E18","v":0.01},72.959999999999994]
[null,null,"F",{"$f":"'Encargos Sociais'!D19","v":"SEBRAE (§ 3º, art. 8º, Lei 8.029/90, alterada pela Lei nº 8.154/90)"},{"$f":"'Encargos Sociais'!E19","v":6.0000000000000001E-3},43.78]
[null,null,"G",{"$f":"'Encargos Sociais'!D20","v":"INCRA (art. 1º, I, Decreto Lei 1.146/70 e Lei 7.787, de 30/06/89)"},{"$f":"'Encargos Sociais'!E20","v":2E-3},14.59,null,"* Nota 1 - Os percentuais dos encargos previdenciários, do FGTS e demais contribuições são estabelecidos por legislação vigente."]
[null,null,"H",{"$f":"'Encargos Sociais'!D21","v":"FGTS (Lei Complementar nº 110/01 e art. 30, Lei nº 8.036/90)"},{"$f":"'Encargos Sociais'!E21","v":0.08},583.71,null,"* Nota 2 - O SAT, a depender do grau de risco do serviço, irá variar entre 1%, para risco leve, de 2%, para risco médio, e de 3% para risco grave."]
[null,null,"I",{"$f":"'Encargos Sociais'!D22","v":"SECONCI (Convenções Coletivas de Trabalho da construção)"},{"$f":"'Encargos Sociais'!E22","v":0},0,null,"* Nota 3 - Os percentuais do Submódulo 2.2 incidem sobre o Módulo 1 e o Submódulo 2.1."]
[]
[null,"Submódulo 2.3 - Benefícios Mensais e Diários"]
[null,null,"A","Auxílio Transporte",null,{"$f":"HLOOKUP($B$5,'Dados Gerais'!$D$5:$BK$93,82)","v":0}]
[null,null,"B","Auxílio Alimentação",null,{"$f":"HLOOKUP($B$5,'Dados Gerais'!$D$5:$BK$93,89)","v":676.11}]
[null,null,"C","Assistência Médica e Familiar",null,{"$f":"HLOOKUP($B$5,'Dados Gerais'!$D$5:$BK$101,97)","v":0}]
[null,null,"D","Outros (Seguro de vida e auxílio funeral e auxílio odontológico)",null,{"$f":"HLOOKUP($B$5,'Dados Gerais'!$D$5:$BK$118,114)","v":0},null,"* Nota 1 - O valor informado deverá ser o custo real do benefício (descontado o valor eventualmente pago pelo empregado)."]
[null,null,null,null,null,null,null,"* Nota 2 - Observar a previsão dos benefícios contidos em Acordos, Convenções e Dissídios Coletivos de Trabalho e o disposto no art. 6º da IN 5/2017"]
[null,null,null,"QUADRO-RESUMO DO MÓDULO 2"]
[null,null,null,"2.1 - 13º Salário, Férias e Adicional de Férias - 13º Destacado - Calculado no Módulo 7 ",{"$f":"SUM(E20:E21)","v":3.03030303030303E-2},{"$f":"F20+F21","v":193.74}]
[null,null,null,"2.2 - Encargos Previdenciários (GPS), Fundo de Garantia por Tempo de Serviço (FGTS) e Contribuições",{"$f":"SUM(E24:E32)","v":0.36800000000000005},{"$f":"SUM(F24:F32)","v":2685.0600000000004}]
[null,null,null,"2.3 - Benefícios Mensais e Diários",null,{"$f":"SUM(F35:F38)","v":676.11}]
[]
[null,null,null,"TOTAL DOS ENCARGOS E BENEFÍCIOS",null,{"$f":"SUM(F41:F43)","v":3554.9100000000003}]
[]
[null,"MÓDULO 3 - PREVISÃO PARA RESCISÃO",null,null,"Percentuais","Valor"]
[null,null,"A",{"$f":"'Encargos Sociais'!D36","v":"Aviso Prévio Indenizado (Art. 7º, inciso XXI, da CF/1988 e arts. 477, 487, §1º, e 491 da CLT)"},{"$f":"'Encargos Sociais'!E36","v":8.3333333333333332E-3},{"$f":"ROUND(E48*$F$16,2)","v":53.28}]
[null,null,"B",{"$f":"'Encargos Sociais'!D37","v":"Incidência do FGTS sobre o Aviso Prévio Indenizado (Súmula 305 TST)"},{"$f":"'Encargos Sociais'!E37","v":6.6666666666666664E-4},4.26,null,"* Nota 1 - Adotou-se os parâmetros do estudo do STF (http://www.stf.jus.br/arquivo/cms/sobrestfestudosci/anexo/encargos_sociais_03102007.pdf), onde 5% do pessoal é demitido pelo empregador no decurso do contrato (para estes, considerou-se o aviso prévio indenizado). Desprezou-se as demissões por justa causa e os pedidos de demissão."]
[null,null,"C",{"$f":"'Encargos Sociais'!D38","v":"Multa do FGTS e Contribuição Social sobre o Aviso Prévio Indenizado (Art. 18, §1º, da Lei 8.036/1990 e art. 1º da LC nº 110/2001)"},{"$f":"'Encargos Sociais'!E38","v":7.7170666666666644E-3},49.34,null,"* Nota 2 - No cálculo do percentual, considerou-se 36 dias, correspondendo à metade da duração média dos contratos (2 anos)"]
[null,null,"D",{"$f":"'Encargos Sociais'!D39","v":"Aviso Prévio Trabalhado (Art. 488, parágrafo único, CLT)"},{"$f":"'Encargos Sociais'!E39","v":1.2037037037037035E-2},76.959999999999994,null,"* Nota 3 - Incide sobre a Remuneração + 13º salário (1/12) + Férias (1/12) + Adicional de Férias (1/36) x 50% multa (40% para o empregado e 10% de contribuição social) x 8% FGTS"]
[null,null,"E",{"$f":"'Encargos Sociais'!D40","v":"Incidência de GPS, FGTS e outras contribuições sobre o Aviso Prévio Trabalhado"},{"$f":"'Encargos Sociais'!E40","v":4.4296296296296288E-3},28.32,null,"* Nota 4 - Os 95% restantes do cálculo, a um prazo médio de contrato de 4 anos. Assim, calcula-se 7 dias para o 1º ano de contrato e mais 3 dias para os 3 anos seguintes."]
[null,null,"F",{"$f":"'Encargos Sociais'!D41","v":"Multa do FGTS e Contribuição Social sobre o Aviso Prévio Trabalhado"},{"$f":"'Encargos Sociais'!E41","v":3.0505155555555549E-2},195.03]
[]
[null,null,null,"TOTAL DE PREVISÃO PARA RESCISÃO",null,{"$f":"SUM(F48:F53)","v":407.18999999999994}]
[]
[null,"MÓDULO 4 - CUSTO DO PROFISSIONAL AUSENTE",null,null,"Percentuais","Valor"]
[null,"Submódulo 4.1 - Ausências Legais"]
[null,null,"A",{"$f":"'Encargos Sociais'!D25","v":"Férias (Arts. 129 e 130, inc. I, da CLT)"},{"$f":"'Encargos Sociais'!E25","v":9.0909090909090912E-2},{"$f":"ROUND(E59*$F$16,2)","v":581.21},null,"* Nota 1 - As alíneas “A” a “F” referem-se somente ao custo que será pago ao profissional ausente."]
[null,null,"B",{"$f":"'Encargos Sociais'!D26","v":"Ausências Legais (Arts. 131 e 473 da CLT)"},{"$f":"'Encargos Sociais'!E26","v":7.9365079365079361E-3},50.74,null,"* Nota 2 - Adotou-se a estimativa do SINAPI de 2 dias por ano."]
[null,null,"C",{"$f":"'Encargos Sociais'!D27","v":"Licença-Paternidade (Art. 7º, XIX, e art. 10, §1º, do ADCT, CF/1988 e Art. 1º, II, da Lei 11.770/2008)"},{"$f":"'Encargos Sociais'!E27","v":8.2777777777777776E-4},5.29,null,"* Nota 3 - Utilizada a proporção de 50% para homens, 5 dias de afastamento, e a probabilidade de um trabalhador requerer a Licença Paternidade em 5,22%, conforme SINAPI (citando dados da PNAD 2015)"]
[null,null,"D",{"$f":"'Encargos Sociais'!D28","v":"Ausência por Acidente de Trabalho (Art. 131, III, da CLT)"},{"$f":"'Encargos Sociais'!E28","v":8.541666666666667E-4},5.46,null,"* Nota 4 - Utilzada a estatística de 1,96% dos contribuintes beneficiados com a emissão do auxílio, conforme Anuário Estatístico da Previdência Social. Afastamento de 15 dias a cargo da empresa."]
[null,null,"E",{"$f":"'Encargos Sociais'!D29","v":"Afastamento Maternidade (Art. 71 da Lei nº 8.213/1991)"},{"$f":"'Encargos Sociais'!E29","v":3.2925925925925922E-3},21.05,null,"* Nota 5 - Utilizada a proporção de 50% para mulheres, 180 dias de afastamento, e a probabilidade de uma trabalhadora requerer a Licença Maternidade em 4,91%, conforme SINAPI (citando dados do IBGE 2016)"]
[null,null,"F",{"$f":"'Encargos Sociais'!D30","v":"Auxílio Enfermidade - Doença (Art. 59 da Lei nº 8.213/1991)"},{"$f":"'Encargos Sociais'!E30","v":7.1222222222222225E-3},45.53,null,"* Nota 6 - Utilizada a estatística de 3,37% dos contribuintes beneficiados com o auxílio, conforme Anuário Estatístico da Previdência Social de 2015 (acrescidos de 2 dias ao ano, para os quais o trabalhador nem requer o benefício da Previdência - conforme SINAPI)"]
[]
[null,"Submódulo 4.2 - Intrajornada"]
[null,null,"A","Intervalo para repouso ou alimentação",{"$f":"'Encargos Sociais'!E33","v":0},{"$f":"ROUND(E67*$F$16,2)","v":0}]
[]
[null,null,null,"QUADRO-RESUMO DO MÓDULO 4",null,"Valor"]
[null,null,null,"4.1 - Ausências Legais",{"$f":"SUM(E59:E64)","v":0.11094235810485811},{"$f":"ROUND(E70*$F$16,2)","v":709.29}]
[null,null,null,"4.2 - Intrajornada",{"$f":"E67","v":0},{"$f":"ROUND(E71*$F$16,2)","v":0}]
[]
[null,null,null,"TOTAL DE PREVISÃO PARA RESCISÃO E INTERVALO INTRAJORNADA",null,{"$f":"SUM(F70:F71)","v":709.29}]
[]
[null,"MÓDULO 5 - INSUMOS DIVERSOS",null,null,null,"Valor"]
[null,null,"A","Uniformes - aquisição",null,{"$f":"ROUND(HLOOKUP($B$5,Uniformes!L4:EA6,3)/12,2)","v":106.57}]
[null,null,"B","Materiais de consumo relacionados ao posto - aquisição",null,{"$f":"ROUND(HLOOKUP(B5,'Mat Cons'!I11:DX13,3)/12,2)","v":0}]
[null,null,"C","Materiais permanentes relacionados ao posto - remuneração da sua depreciação / manutenção",null,{"$f":"HLOOKUP(B5,'Mat Perm'!Q11:EF13,3)","v":0}]
[null,null,"D","Equipamentos relacionados ao posto - remuneração da sua depreciação / manutenção",null,{"$f":"HLOOKUP(B5,'Equip Rel'!Q11:EF13,3)","v":0}]
[null,null,"E","Equipamentos de Proteção Individual - EPI - aquisição",null,{"$f":"ROUND(HLOOKUP(B5,EPI!J4:DY6,3)/12,2)","v":81.92}]
[]
[null,null,null,"TOTAL DE INSUMOS DIVERSOS",null,{"$f":"SUM(F76:F81)","v":188.49},null,"* Nota - Valores mensais por empregado"]
[]
[null,"MÓDULO 6 - CUSTOS INDIRETOS, TRIBUTOS E LUCRO - BDI",null,null,"Percentuais","Valor"]
[null,null,"A","Custos Indiretos",{"$f":"BDI!E6","v":3.1399999999999997E-2}]
[null,null,"A.1","Administração Central",{"$f":"BDI!E7","v":2.5999999999999999E-2}]
[null,null,"A.2","Seguros, Garantias e Riscos",{"$f":"BDI!E8","v":5.4000000000000003E-3}]
[null,null,"B","Lucro",{"$f":"BDI!E10","v":0.04}]
[null,null,"C","Tributos",{"$f":"SUM(E90:E91)","v":0.124}]
[null,null,"C.1","Tributos Federais (COFINS, PIS e CPRB)",{"$f":"BDI!E18","v":7.3999999999999996E-2}]
[null,null,"C.2","Tributos Distritais (ISS)",{"$f":"BDI!E23","v":0.05},null,null,"* Nota - Utilizou-se o indicado pelo Sindicato da Arquitetura e da Engenharia (Sinaenco, 2008, p. 22), que adota um percentual redutor de 20% no cálculo dos custos tributários relativos às contribuições PIS e COFINS"]
[null,null,"D","Despesas Financeiras",{"$f":"BDI!E13","v":5.6394995474364773E-3}]
[]
[null,null,null,"TOTAL DE BDI",{"$f":"BDI!E26","v":0.23139999999999999},{"$f":"E94*E102","v":2603.9904800000004}]
[]
[null,null,null,"QUADRO-RESUMO DO CUSTO MENSAL POR EMPREGADO - SEM O 13º","Valor"]
[null,null,null,"Módulo 1 - Composição da Remuneração",{"$f":"F16","v":6393.3200000000006}]
[null,null,null,"Módulo 2 - Encargos e Benefícios Anuais, Mensais e Diários",{"$f":"F45","v":3554.9100000000003}]
[null,null,null,"Módulo 3 - Provisão para Rescisão",{"$f":"F55","v":407.18999999999994}]
[null,null,null,"Módulo 4 - Custo de Reposição do Profissional Ausente",{"$f":"F73","v":709.29}]
[null,null,null,"Módulo 5 - Insumos Diversos",{"$f":"F82","v":188.49}]
[null,null,null,"SUBTOTAL (A+B+C+D+E)",{"$f":"SUM(E97:E101)","v":11253.200000000003}]
[null,null,null,"Módulo 6 - Custos Indiretos, Tributos e Lucro",{"$f":"F94","v":2603.9904800000004}]
[]
[null,null,null,"TOTAL DO POSTO",{"$f":"SUM(E102:E103)","v":13857.190480000003}]
[]
[null,"MÓDULO 7 - DESTAQUE DO MÓDULO 2 - 13º SALÁRIO",null,null,"Percentuais","Valor"]
[null,null,"A","13º Salário",{"$f":"'Encargos Sociais'!E32","v":8.3333333333333329E-2},{"$f":"ROUND(E108*F$16,2)","v":532.78}]
[null,null,"B","Encargos Sociais sobre o 13º Salário - Taxa calculada no SUBMÓDULO 2.2",{"$f":"SUM($E$24:$E$32)","v":0.36800000000000005},{"$f":"ROUND(E109*$F$108,2)","v":196.06},null,"* Nota 1 - Provisiona-se, mensalmente, o proporcional a 1/12 dos valores referentes a gratificação natalina e adicional de férias."]
[null,null,"C","BDI sobre o 13º Salário - Taxa calculada no MÓDULO 6",{"$f":"E94","v":0.23139999999999999},{"$f":"ROUND(E110*($F$108+$F$109),2)","v":168.65}]
[]
[null,null,null,"TOTAL DO DESTAQUE DO 13º SALÁRIO",null,{"$f":"SUM(F108:F110)","v":897.4899999999999}]
[]
[null,null,null,"QUADRO-RESUMO DO CUSTO MENSAL POR EMPREGADO","Valor"]
[null,null,null,"Custo total - sem o 13º Salário",{"$f":"E105","v":13857.190480000003}]
[null,null,null,"Destaque do 13º Salário (valor mensal)",{"$f":"F112","v":897.4899999999999}]
[]
[null,null,null,"TOTAL DO POSTO",{"$f":"E115+E116","v":14754.680480000003}]

{"sheet":"4","index":7,"n_rows":118,"n_cols":8,"rows_kept":118,"cut":false,"hidden":false,"merged":[[1,1,1,5],[2,1,2,5],[4,1,4,2],[5,1,5,2],[7,1,7,3],[17,1,17,3],[106,1,106,3],[39,3,39,5],[46,1,46,3],[56,1,56,3],[68,3,68,5],[74,1,74,3],[83,1,83,3]]}
[]
[null,"PLANILHA DE ESTIMATIVA DE CUSTOS"]
[]
[]
[null,4,null,{"$f":"HLOOKUP($B$5,'Dados Gerais'!$D$5:$BK$20,6)","v":"BOMBEIRO CIVIL BÁSICO DIURNO"},"QUANTIDADE",{"$f":"HLOOKUP($B$5,'Dados Gerais'!$D$5:$BK$20,10)","v":36}]
[null,"CCT",null,{"$f":"HLOOKUP($B$5,'Dados Gerais'!$D$5:$BK$20,15)","v":"SEAC/DF X SINDIBOMBEIROS/DF 2023/2023 Nº DF000140/2023"},"DATA-BASE",{"$f":"HLOOKUP($B$5,'Dados Gerais'!$D$5:$BK$20,16)","v":"2023-01-01"}]
[]
[null,"MÓDULO 1 - COMPOSIÇÃO DA REMUNERAÇÃO",null,null,null,"Valor"]
[null,null,"A","Salário-Base",null,{"$f":"HLOOKUP($B$5,'Dados Gerais'!$D$5:$BK$20,8)","v":3494.5399999999995}]
[null,null,"B","Adicional de Periculosidade",null,{"$f":"HLOOKUP($B$5,'Dados Gerais'!$D$5:$BK$37,25)","v":1048.3599999999999}]
[null,null,"C","Adicional de Insalubridade",null,{"$f":"HLOOKUP($B$5,'Dados Gerais'!$D$5:$BK$37,31)","v":0}]
[null,null,"D","Adicional Noturno",null,{"$f":"HLOOKUP($B$5,'Dados Gerais'!$D$5:$BK$50,46)","v":0},null,"* Nota 1 - O Módulo 1 refere-se ao valor mensal devido ao empregado pela prestação do serviço no período de 12 meses."]
[null,null,"E","Adicional de Hora Extra",null,{"$f":"HLOOKUP($B$5,'Dados Gerais'!$D$5:$BK$67,63)","v":0},null,"* Nota 2 - O adicional de hora extra no feriado trabalhado foi suprimido pela Lei 13.467/17"]
[null,null,"F","Outros (especificar)",null,{"$f":"HLOOKUP($B$5,'Dados Gerais'!$D$5:$BK$59,33)","v":0},null,"* Nota 3 - ART. 7º, § 2º, DA LEI Nº 605/49.Sendo mensalista o obreiro, o adicional noturno pago de forma fixa já é considerado integrado para os efeitos do pagamento do repouso semanal remunerado, nos termos do art. 7º, § 2º, da Lei nº 605/49."]
[]
[null,null,null,"TOTAL DA REMUNERAÇÃO",null,{"$f":"SUM(F9:F14)","v":4542.8999999999996}]
[]
[null,"MÓDULO 2 - ENCARGOS E BENEFÍCIOS ANUAIS, MENSAIS E DIÁRIOS",null,null,"Percentuais","Valor"]
[null,"Submódulo 2.1 - 13º Salário e Adicional de Férias"]
[null,null,"A","13º Salário - Calculado no Módulo 7 - Destacado",0,{"$f":"ROUND(E20*F$16,2)","v":0}]
[null,null,"B","Adicional de Férias",{"$f":"'Encargos Sociais'!E31","v":3.03030303030303E-2},{"$f":"ROUND(E21*F$16,2)","v":137.66},null,"* Nota 1 - Provisiona-se, mensalmente, o proporcional a 1/12 dos valores referentes a gratificação natalina, férias e adicional de férias."]
[null,null,null,null,null,null,null,"* Nota 2 - O adicional de férias contido no Submódulo 2.1 corresponde a 1/3 da remuneração que, por sua vez, é dividida por 12 contome Nota 1."]
[null,"Submódulo 2.2 - Encargos Previdenciários (GPS), Fundo de Garantia por Tempo de Serviço (FGTS) e Outras Contribuições"]
[null,null,"A",{"$f":"'Encargos Sociais'!D14","v":"INSS (art. 22, inciso I, Lei nº 8.212/91)"},{"$f":"'Encargos Sociais'!E14","v":0.2},{"$f":"ROUND(E24*($F$16+$F$41+$F$73),2)","v":1036.9100000000001}]
[null,null,"B",{"$f":"'Encargos Sociais'!D15","v":"Salário Educação (art. 3º, inciso I, Decreto nº 87.043/82)"},{"$f":"'Encargos Sociais'!E15","v":2.5000000000000001E-2},{"$f":"ROUND(E25*($F$16+$F$41+$F$73),2)","v":129.61000000000001}]
[null,null,"C",{"$f":"'Encargos Sociais'!D16","v":"SAT/RAT (art. 22, II, Lei 8.212/91 e Anexo V, Decreto 6.042/07) - Enquadramento 8011-1/01"},{"$f":"'Encargos Sociais'!E16","v":0.03},155.54]
[null,null,"D",{"$f":"'Encargos Sociais'!D17","v":"SESC ou SESI (art. 30, Lei nº 8.036/90 e art. 1º, Lei 8.154/90)"},{"$f":"'Encargos Sociais'!E17","v":1.4999999999999999E-2},77.77]
[null,null,"E",{"$f":"'Encargos Sociais'!D18","v":"SENAI ou SENAC (Decreto nº 2.318/86)"},{"$f":"'Encargos Sociais'!E18","v":0.01},51.85]
[null,null,"F",{"$f":"'Encargos Sociais'!D19","v":"SEBRAE (§ 3º, art. 8º, Lei 8.029/90, alterada pela Lei nº 8.154/90)"},{"$f":"'Encargos Sociais'!E19","v":6.0000000000000001E-3},31.11]
[null,null,"G",{"$f":"'Encargos Sociais'!D20","v":"INCRA (art. 1º, I, Decreto Lei 1.146/70 e Lei 7.787, de 30/06/89)"},{"$f":"'Encargos Sociais'!E20","v":2E-3},10.37,null,"* Nota 1 - Os percentuais dos encargos previdenciários, do FGTS e demais contribuições são estabelecidos por legislação vigente."]
[null,null,"H",{"$f":"'Encargos Sociais'!D21","v":"FGTS (Lei Complementar nº 110/01 e art. 30, Lei nº 8.036/90)"},{"$f":"'Encargos Sociais'!E21","v":0.08},414.76,null,"* Nota 2 - O SAT, a depender do grau de risco do serviço, irá variar entre 1%, para risco leve, de 2%, para risco médio, e de 3% para risco grave."]
[null,null,"I",{"$f":"'Encargos Sociais'!D22","v":"SECONCI (Convenções Coletivas de Trabalho da construção)"},{"$f":"'Encargos Sociais'!E22","v":0},0,null,"* Nota 3 - Os percentuais do Submódulo 2.2 incidem sobre o Módulo 1 e o Submódulo 2.1."]
[]
[null,"Submódulo 2.3 - Benefícios Mensais e Diários"]
[null,null,"A","Auxílio Transporte",null,{"$f":"HLOOKUP($B$5,'Dados Gerais'!$D$5:$BK$93,82)","v":13.800000000000011}]
[null,null,"B","Auxílio Alimentação",null,{"$f":"HLOOKUP($B$5,'Dados Gerais'!$D$5:$BK$93,89)","v":676.11}]
[null,null,"C","Assistência Médica e Familiar",null,{"$f":"HLOOKUP($B$5,'Dados Gerais'!$D$5:$BK$101,97)","v":0}]
[null,null,"D","Outros (Seguro de vida e auxílio funeral e auxílio odontológico)",null,{"$f":"HLOOKUP($B$5,'Dados Gerais'!$D$5:$BK$118,114)","v":0},null,"* Nota 1 - O valor informado deverá ser o custo real do benefício (descontado o valor eventualmente pago pelo empregado)."]
[null,null,null,null,null,null,null,"* Nota 2 - Observar a previsão dos benefícios contidos em Acordos, Convenções e Dissídios Coletivos de Trabalho e o disposto no art. 6º da IN 5/2017"]
[null,null,null,"QUADRO-RESUMO DO MÓDULO 2"]
[null,null,null,"2.1 - 13º Salário, Férias e Adicional de Férias - 13º Destacado - Calculado no Módulo 7 ",{"$f":"SUM(E20:E21)","v":3.03030303030303E-2},{"$f":"F20+F21","v":137.66}]
[null,null,null,"2.2 - Encargos Previdenciários (GPS), Fundo de Garantia por Tempo de Serviço (FGTS) e Contribuições",{"$f":"SUM(E24:E32)","v":0.36800000000000005},{"$f":"SUM(F24:F32)","v":1907.9199999999996}]
[null,null,null,"2.3 - Benefícios Mensais e Diários",null,{"$f":"SUM(F35:F38)","v":689.91000000000008}]
[]
[null,null,null,"TOTAL DOS ENCARGOS E BENEFÍCIOS",null,{"$f":"SUM(F41:F43)","v":2735.49}]
[]
[null,"MÓDULO 3 - PREVISÃO PARA RESCISÃO",null,null,"Percentuais","Valor"]
[null,null,"A",{"$f":"'Encargos Sociais'!D36","v":"Aviso Prévio Indenizado (Art. 7º, inciso XXI, da CF/1988 e arts. 477, 487, §1º, e 491 da CLT)"},{"$f":"'Encargos Sociais'!E36","v":8.3333333333333332E-3},{"$f":"ROUND(E48*$F$16,2)","v":37.86}]
[null,null,"B",{"$f":"'Encargos Sociais'!D37","v":"Incidência do FGTS sobre o Aviso Prévio Indenizado (Súmula 305 TST)"},{"$f":"'Encargos Sociais'!E37","v":6.6666666666666664E-4},3.03,null,"* Nota 1 - As alíneas “A” a “F” referem-se somente ao custo que será pago ao profissional ausente."]
[null,null,"C",{"$f":"'Encargos Sociais'!D38","v":"Multa do FGTS e Contribuição Social sobre o Aviso Prévio Indenizado (Art. 18, §1º, da Lei 8.036/1990 e art. 1º da LC nº 110/2001)"},{"$f":"'Encargos Sociais'!E38","v":7.7170666666666644E-3},35.06,null,"* Nota 2 - No cálculo do percentual, considerou-se 36 dias, correspondendo à metade da duração média dos contratos (2 anos)"]
[null,null,"D",{"$f":"'Encargos Sociais'!D39","v":"Aviso Prévio Trabalhado (Art. 488, parágrafo único, CLT)"},{"$f":"'Encargos Sociais'!E39","v":1.2037037037037035E-2},54.68,null,"* Nota 3 - Incide sobre a Remuneração + 13º salário (1/12) + Férias (1/12) + Adicional de Férias (1/36) x 50% multa (40% para o empregado e 10% de contribuição social) x 8% FGTS"]
[null,null,"E",{"$f":"'Encargos Sociais'!D40","v":"Incidência de GPS, FGTS e outras contribuições sobre o Aviso Prévio Trabalhado"},{"$f":"'Encargos Sociais'!E40","v":4.4296296296296288E-3},20.12,null,"* Nota 4 - Os 95% restantes do cálculo, a um prazo médio de contrato de 4 anos. Assim, calcula-se 7 dias para o 1º ano de contrato e mais 3 dias para os 3 anos seguintes."]
[null,null,"F",{"$f":"'Encargos Sociais'!D41","v":"Multa do FGTS e Contribuição Social sobre o Aviso Prévio Trabalhado"},{"$f":"'Encargos Sociais'!E41","v":3.0505155555555549E-2},138.58000000000001]
[]
[null,null,null,"TOTAL DE PREVISÃO PARA RESCISÃO",null,{"$f":"SUM(F48:F53)","v":289.33000000000004}]
[]
[null,"MÓDULO 4 - CUSTO DO PROFISSIONAL AUSENTE",null,null,"Percentuais","Valor"]
[null,"Submódulo 4.1 - Ausências Legais"]
[null,null,"A",{"$f":"'Encargos Sociais'!D25","v":"Férias (Arts. 129 e 130, inc. I, da CLT)"},{"$f":"'Encargos Sociais'!E25","v":9.0909090909090912E-2},{"$f":"ROUND(E59*$F$16,2)","v":412.99},null,"* Nota 1 - As alíneas “A” a “F” referem-se somente ao custo que será pago ao repositor pelos dias \ntrabalhados quando da necessidade de substituir a mão de obra alocada na prestação do serviço."]
[null,null,"B",{"$f":"'Encargos Sociais'!D26","v":"Ausências Legais (Arts. 131 e 473 da CLT)"},{"$f":"'Encargos Sociais'!E26","v":7.9365079365079361E-3},36.049999999999997,null,"* Nota 2 - Adotou-se a estimativa do SINAPI de 2 dias por ano."]
[null,null,"C",{"$f":"'Encargos Sociais'!D27","v":"Licença-Paternidade (Art. 7º, XIX, e art. 10, §1º, do ADCT, CF/1988 e Art. 1º, II, da Lei 11.770/2008)"},{"$f":"'Encargos Sociais'!E27","v":8.2777777777777776E-4},3.76,null,"* Nota 3 - Utilizada a proporção de 50% para homens, 5 dias de afastamento, e a probabilidade de um trabalhador requerer a Licença Paternidade em 5,22%, conforme SINAPI (citando dados da PNAD 2015)"]
[null,null,"D",{"$f":"'Encargos Sociais'!D28","v":"Ausência por Acidente de Trabalho (Art. 131, III, da CLT)"},{"$f":"'Encargos Sociais'!E28","v":8.541666666666667E-4},3.88,null,"* Nota 4 - Utilzada a estatística de 1,96% dos contribuintes beneficiados com a emissão do auxílio, conforme Anuário Estatístico da Previdência Social. Afastamento de 15 dias a cargo da empresa."]
[null,null,"E",{"$f":"'Encargos Sociais'!D29","v":"Afastamento Maternidade (Art. 71 da Lei nº 8.213/1991)"},{"$f":"'Encargos Sociais'!E29","v":3.2925925925925922E-3},14.96,null,"* Nota 5 - Utilizada a proporção de 50% para mulheres, 180 dias de afastamento, e a probabilidade de uma trabalhadora requerer a Licença Maternidade em 4,91%, conforme SINAPI (citando dados do IBGE 2016)"]
[null,null,"F",{"$f":"'Encargos Sociais'!D30","v":"Auxílio Enfermidade - Doença (Art. 59 da Lei nº 8.213/1991)"},{"$f":"'Encargos Sociais'!E30","v":7.1222222222222225E-3},32.36,null,"* Nota 6 - Utilizada a estatística de 3,37% dos contribuintes beneficiados com o auxílio, conforme Anuário Estatístico da Previdência Social de 2015 (acrescidos de 2 dias ao ano, para os quais o trabalhador nem requer o benefício da Previdência - conforme SINAPI)"]
[]
[null,"Submódulo 4.2 - Intrajornada"]
[null,null,"A","Intervalo para repouso ou alimentação",{"$f":"'Encargos Sociais'!E33","v":0},{"$f":"ROUND(E67*$F$16,2)","v":0}]
[]
[null,null,null,"QUADRO-RESUMO DO MÓDULO 4",null,"Valor"]
[null,null,null,"4.1 - Ausências Legais",{"$f":"SUM(E59:E64)","v":0.11094235810485811},{"$f":"ROUND(E70*$F$16,2)","v":504}]
[null,null,null,"4.2 - Intrajornada",{"$f":"E67","v":0},{"$f":"ROUND(E71*$F$16,2)","v":0}]
[]
[null,null,null,"TOTAL DE PREVISÃO PARA RESCISÃO E INTERVALO INTRAJORNADA",null,{"$f":"SUM(F70:F71)","v":504}]
[]
[null,"MÓDULO 5 - INSUMOS DIVERSOS",null,null,null,"Valor"]
[null,null,"A","Uniformes - aquisição",null,{"$f":"ROUND(HLOOKUP($B$5,Uniformes!L4:EA6,3)/12,2)","v":106.57}]
[null,null,"B","Materiais de consumo relacionados ao posto - aquisição",null,{"$f":"ROUND(HLOOKUP(B5,'Mat Cons'!I11:DX13,3)/12,2)","v":0}]
[null,null,"C","Materiais permanentes relacionados ao posto - remuneração da sua depreciação / manutenção",null,{"$f":"HLOOKUP(B5,'Mat Perm'!Q11:EF13,3)","v":0}]
[null,null,"D","Equipamentos relacionados ao posto - remuneração da sua depreciação / manutenção",null,{"$f":"HLOOKUP(B5,'Equip Rel'!Q11:EF13,3)","v":0}]
[null,null,"E","Equipamentos de Proteção Individual - EPI - aquisição",null,{"$f":"ROUND(HLOOKUP(B5,EPI!J4:DY6,3)/12,2)","v":81.92}]
[]
[null,null,null,"TOTAL DE INSUMOS DIVERSOS",null,{"$f":"SUM(F76:F81)","v":188.49},null,"* Nota - Valores mensais por empregado"]
[]
[null,"MÓDULO 6 - CUSTOS INDIRETOS, TRIBUTOS E LUCRO - BDI",null,null,"Percentuais","Valor"]
[null,null,"A","Custos Indiretos",{"$f":"BDI!E6","v":3.1399999999999997E-2}]
[null,null,"A.1","Administração Central",{"$f":"BDI!E7","v":2.5999999999999999E-2}]
[null,null,"A.2","Seguros, Garantias e Riscos",{"$f":"BDI!E8","v":5.4000000000000003E-3}]
[null,null,"B","Lucro",{"$f":"BDI!E10","v":0.04}]
[null,null,"C","Tributos",{"$f":"SUM(E90:E91)","v":0.124}]
[null,null,"C.1","Tributos Federais (COFINS, PIS e CPRB)",{"$f":"BDI!E18","v":7.3999999999999996E-2}]
[null,null,"C.2","Tributos Distritais (ISS)",{"$f":"BDI!E23","v":0.05},null,null,"* Nota - Utilizou-se o indicado pelo Sindicato da Arquitetura e da Engenharia (Sinaenco, 2008, p. 22), que adota um percentual redutor de 20% no cálculo dos custos tributários relativos às contribuições PIS e COFINS"]
[null,null,"D","Despesas Financeiras",{"$f":"BDI!E13","v":5.6394995474364773E-3}]
[]
[null,null,null,"TOTAL DE BDI",{"$f":"BDI!E26","v":0.23139999999999999},{"$f":"E94*E102","v":1911.4125939999997}]
[]
[null,null,null,"QUADRO-RESUMO DO CUSTO MENSAL POR EMPREGADO - SEM O 13º","Valor"]
[null,null,null,"Módulo 1 - Composição da Remuneração",{"$f":"F16","v":4542.8999999999996}]
[null,null,null,"Módulo 2 - Encargos e Benefícios Anuais, Mensais e Diários",{"$f":"F45","v":2735.49}]
[null,null,null,"Módulo 3 - Provisão para Rescisão",{"$f":"F55","v":289.33000000000004}]
[null,null,null,"Módulo 4 - Custo de Reposição do Profissional Ausente",{"$f":"F73","v":504}]
[null,null,null,"Módulo 5 - Insumos Diversos",{"$f":"F82","v":188.49}]
[null,null,null,"SUBTOTAL (A+B+C+D+E)",{"$f":"SUM(E97:E101)","v":8260.2099999999991}]
[null,null,null,"Módulo 6 - Custos Indiretos, Tributos e Lucro",{"$f":"F94","v":1911.4125939999997}]
[]
[null,null,null,"TOTAL DO POSTO",{"$f":"SUM(E102:E103)","v":10171.622593999999}]
[]
[null,"MÓDULO 7 - DESTAQUE DO MÓDULO 2 - 13º SALÁRIO",null,null,"Percentuais","Valor"]
[null,null,"A","13º Salário",{"$f":"'Encargos Sociais'!E32","v":8.3333333333333329E-2},{"$f":"ROUND(E108*F$16,2)","v":378.58}]
[null,null,"B","Encargos Sociais sobre o 13º Salário - Taxa calculada no SUBMÓDULO 2.2",{"$f":"SUM($E$24:$E$32)","v":0.36800000000000005},{"$f":"ROUND(E109*$F$108,2)","v":139.32},null,"* Nota 1 - Provisiona-se, mensalmente, o proporcional a 1/12 dos valores referentes a gratificação natalina e adicional de férias."]
[null,null,"C","BDI sobre o 13º Salário - Taxa calculada no MÓDULO 6",{"$f":"E94","v":0.23139999999999999},{"$f":"ROUND(E110*($F$108+$F$109),2)","v":119.84}]
[]
[null,null,null,"TOTAL DO DESTAQUE DO 13º SALÁRIO",null,{"$f":"SUM(F108:F110)","v":637.74}]
[]
[null,null,null,"QUADRO-RESUMO DO CUSTO MENSAL POR EMPREGADO","Valor"]
[null,null,null,"Custo total - sem o 13º Salário",{"$f":"E105","v":10171.622593999999}]
[null,null,null,"Destaque do 13º Salário (valor mensal)",{"$f":"F112","v":637.74}]
[]
[null,null,null,"TOTAL DO POSTO",{"$f":"E115+E116","v":10809.362593999998}]

{"sheet":"5","index":8,"n_rows":118,"n_cols":8,"rows_kept":118,"cut":false,"hidden":false,"merged":[[106,1,106,3],[39,3,39,5],[46,1,46,3],[56,1,56,3],[68,3,68,5],[74,1,74,3],[83,1,83,3],[17,1,17,3],[1,1,1,5],[2,1,2,5],[4,1,4,2],[5,1,5,2],[7,1,7,3]]}
[]
[null,"PLANILHA DE ESTIMATIVA DE CUSTOS"]
[]
[]
[null,5,null,{"$f":"HLOOKUP($B$5,'Dados Gerais'!$D$5:$BK$20,6)","v":"BOMBEIRO CIVIL BÁSICO NOTURNO"},"QUANTIDADE",{"$f":"HLOOKUP($B$5,'Dados Gerais'!$D$5:$BK$20,10)","v":28}]
[null,"CCT",null,{"$f":"HLOOKUP($B$5,'Dados Gerais'!$D$5:$BK$20,15)","v":"SEAC/DF X SINDIBOMBEIROS/DF 2023/2023 Nº DF000140/2023"},"DATA-BASE",{"$f":"HLOOKUP($B$5,'Dados Gerais'!$D$5:$BK$20,16)","v":"2023-01-01"}]
[]
[null,"MÓDULO 1 - COMPOSIÇÃO DA REMUNERAÇÃO",null,null,null,"Valor"]
[null,null,"A","Salário-Base",null,{"$f":"HLOOKUP($B$5,'Dados Gerais'!$D$5:$BK$20,8)","v":3494.5399999999995}]
[null,null,"B","Adicional de Periculosidade",null,{"$f":"HLOOKUP($B$5,'Dados Gerais'!$D$5:$BK$37,25)","v":1048.3599999999999}]
[null,null,"C","Adicional de Insalubridade",null,{"$f":"HLOOKUP($B$5,'Dados Gerais'!$D$5:$BK$37,31)","v":0}]
[null,null,"D","Adicional Noturno",null,{"$f":"HLOOKUP($B$5,'Dados Gerais'!$D$5:$BK$50,46)","v":616.13},null,"* Nota 1 - O Módulo 1 refere-se ao valor mensal devido ao empregado pela prestação do serviço no período de 12 meses."]
[null,null,"E","Adicional de Hora Extra",null,{"$f":"HLOOKUP($B$5,'Dados Gerais'!$D$5:$BK$67,63)","v":0},null,"* Nota 2 - O adicional de hora extra no feriado trabalhado foi suprimido pela Lei 13.467/17"]
[null,null,"F","Outros (especificar)",null,{"$f":"HLOOKUP($B$5,'Dados Gerais'!$D$5:$BK$59,33)","v":0},null,"* Nota 3 - ART. 7º, § 2º, DA LEI Nº 605/49.Sendo mensalista o obreiro, o adicional noturno pago de forma fixa já é considerado integrado para os efeitos do pagamento do repouso semanal remunerado, nos termos do art. 7º, § 2º, da Lei nº 605/49."]
[]
[null,null,null,"TOTAL DA REMUNERAÇÃO",null,{"$f":"SUM(F9:F14)","v":5159.03}]
[]
[null,"MÓDULO 2 - ENCARGOS E BENEFÍCIOS ANUAIS, MENSAIS E DIÁRIOS",null,null,"Percentuais","Valor"]
[null,"Submódulo 2.1 - 13º Salário e Adicional de Férias"]
[null,null,"A","13º Salário - Calculado no Módulo 7 - Destacado",0,{"$f":"ROUND(E20*F$16,2)","v":0}]
[null,null,"B","Adicional de Férias",{"$f":"'Encargos Sociais'!E31","v":3.03030303030303E-2},{"$f":"ROUND(E21*F$16,2)","v":156.33000000000001},null,"* Nota 1 - Provisiona-se, mensalmente, o proporcional a 1/12 dos valores referentes a gratificação natalina, férias e adicional de férias."]
[null,null,null,null,null,null,null,"* Nota 2 - O adicional de férias contido no Submódulo 2.1 corresponde a 1/3 da remuneração que, por sua vez, é dividida por 12 contome Nota 1."]
[null,"Submódulo 2.2 - Encargos Previdenciários (GPS), Fundo de Garantia por Tempo de Serviço (FGTS) e Outras Contribuições"]
[null,null,"A",{"$f":"'Encargos Sociais'!D14","v":"INSS (art. 22, inciso I, Lei nº 8.212/91)"},{"$f":"'Encargos Sociais'!E14","v":0.2},{"$f":"ROUND(E24*($F$16+$F$41+$F$73),2)","v":1177.54}]
[null,null,"B",{"$f":"'Encargos Sociais'!D15","v":"Salário Educação (art. 3º, inciso I, Decreto nº 87.043/82)"},{"$f":"'Encargos Sociais'!E15","v":2.5000000000000001E-2},{"$f":"ROUND(E25*($F$16+$F$41+$F$73),2)","v":147.19}]
[null,null,"C",{"$f":"'Encargos Sociais'!D16","v":"SAT/RAT (art. 22, II, Lei 8.212/91 e Anexo V, Decreto 6.042/07) - Enquadramento 8011-1/01"},{"$f":"'Encargos Sociais'!E16","v":0.03},176.63]
[null,null,"D",{"$f":"'Encargos Sociais'!D17","v":"SESC ou SESI (art. 30, Lei nº 8.036/90 e art. 1º, Lei 8.154/90)"},{"$f":"'Encargos Sociais'!E17","v":1.4999999999999999E-2},88.32]
[null,null,"E",{"$f":"'Encargos Sociais'!D18","v":"SENAI ou SENAC (Decreto nº 2.318/86)"},{"$f":"'Encargos Sociais'!E18","v":0.01},58.88]
[null,null,"F",{"$f":"'Encargos Sociais'!D19","v":"SEBRAE (§ 3º, art. 8º, Lei 8.029/90, alterada pela Lei nº 8.154/90)"},{"$f":"'Encargos Sociais'!E19","v":6.0000000000000001E-3},35.33]
[null,null,"G",{"$f":"'Encargos Sociais'!D20","v":"INCRA (art. 1º, I, Decreto Lei 1.146/70 e Lei 7.787, de 30/06/89)"},{"$f":"'Encargos Sociais'!E20","v":2E-3},11.78,null,"* Nota 1 - Os percentuais dos encargos previdenciários, do FGTS e demais contribuições são estabelecidos por legislação vigente."]
[null,null,"H",{"$f":"'Encargos Sociais'!D21","v":"FGTS (Lei Complementar nº 110/01 e art. 30, Lei nº 8.036/90)"},{"$f":"'Encargos Sociais'!E21","v":0.08},471.02,null,"* Nota 2 - O SAT, a depender do grau de risco do serviço, irá variar entre 1%, para risco leve, de 2%, para risco médio, e de 3% para risco grave."]
[null,null,"I",{"$f":"'Encargos Sociais'!D22","v":"SECONCI (Convenções Coletivas de Trabalho da construção)"},{"$f":"'Encargos Sociais'!E22","v":0},0,null,"* Nota 3 - Os percentuais do Submódulo 2.2 incidem sobre o Módulo 1 e o Submódulo 2.1."]
[]
[null,"Submódulo 2.3 - Benefícios Mensais e Diários"]
[null,null,"A","Auxílio Transporte",null,{"$f":"HLOOKUP($B$5,'Dados Gerais'!$D$5:$BK$93,82)","v":13.800000000000011}]
[null,null,"B","Auxílio Alimentação",null,{"$f":"HLOOKUP($B$5,'Dados Gerais'!$D$5:$BK$93,89)","v":676.11}]
[null,null,"C","Assistência Médica e Familiar",null,{"$f":"HLOOKUP($B$5,'Dados Gerais'!$D$5:$BK$101,97)","v":0}]
[null,null,"D","Outros (Seguro de vida e auxílio funeral e auxílio odontológico)",null,{"$f":"HLOOKUP($B$5,'Dados Gerais'!$D$5:$BK$118,114)","v":0},null,"* Nota 1 - O valor informado deverá ser o custo real do benefício (descontado o valor eventualmente pago pelo empregado)."]
[null,null,null,null,null,null,null,"* Nota 2 - Observar a previsão dos benefícios contidos em Acordos, Convenções e Dissídios Coletivos de Trabalho e o disposto no art. 6º da IN 5/2017"]
[null,null,null,"QUADRO-RESUMO DO MÓDULO 2"]
[null,null,null,"2.1 - 13º Salário, Férias e Adicional de Férias - 13º Destacado - Calculado no Módulo 7 ",{"$f":"SUM(E20:E21)","v":3.03030303030303E-2},{"$f":"F20+F21","v":156.33000000000001}]
[null,null,null,"2.2 - Encargos Previdenciários (GPS), Fundo de Garantia por Tempo de Serviço (FGTS) e Contribuições",{"$f":"SUM(E24:E32)","v":0.36800000000000005},{"$f":"SUM(F24:F32)","v":2166.69}]
[null,null,null,"2.3 - Benefícios Mensais e Diários",null,{"$f":"SUM(F35:F38)","v":689.91000000000008}]
[]
[null,null,null,"TOTAL DOS ENCARGOS E BENEFÍCIOS",null,{"$f":"SUM(F41:F43)","v":3012.9300000000003}]
[]
[null,"MÓDULO 3 - PREVISÃO PARA RESCISÃO",null,null,"Percentuais","Valor"]
[null,null,"A",{"$f":"'Encargos Sociais'!D36","v":"Aviso Prévio Indenizado (Art. 7º, inciso XXI, da CF/1988 e arts. 477, 487, §1º, e 491 da CLT)"},{"$f":"'Encargos Sociais'!E36","v":8.3333333333333332E-3},{"$f":"ROUND(E48*$F$16,2)","v":42.99}]
[null,null,"B",{"$f":"'Encargos Sociais'!D37","v":"Incidência do FGTS sobre o Aviso Prévio Indenizado (Súmula 305 TST)"},{"$f":"'Encargos Sociais'!E37","v":6.6666666666666664E-4},3.44,null,"* Nota 1 - As alíneas “A” a “F” referem-se somente ao custo que será pago ao profissional ausente."]
[null,null,"C",{"$f":"'Encargos Sociais'!D38","v":"Multa do FGTS e Contribuição Social sobre o Aviso Prévio Indenizado (Art. 18, §1º, da Lei 8.036/1990 e art. 1º da LC nº 110/2001)"},{"$f":"'Encargos Sociais'!E38","v":7.7170666666666644E-3},39.81,null,"* Nota 2 - No cálculo do percentual, considerou-se 36 dias, correspondendo à metade da duração média dos contratos (2 anos)"]
[null,null,"D",{"$f":"'Encargos Sociais'!D39","v":"Aviso Prévio Trabalhado (Art. 488, parágrafo único, CLT)"},{"$f":"'Encargos Sociais'!E39","v":1.2037037037037035E-2},62.1,null,"* Nota 3 - Incide sobre a Remuneração + 13º salário (1/12) + Férias (1/12) + Adicional de Férias (1/36) x 50% multa (40% para o empregado e 10% de contribuição social) x 8% FGTS"]
[null,null,"E",{"$f":"'Encargos Sociais'!D40","v":"Incidência de GPS, FGTS e outras contribuições sobre o Aviso Prévio Trabalhado"},{"$f":"'Encargos Sociais'!E40","v":4.4296296296296288E-3},22.85,null,"* Nota 4 - Os 95% restantes do cálculo, a um prazo médio de contrato de 4 anos. Assim, calcula-se 7 dias para o 1º ano de contrato e mais 3 dias para os 3 anos seguintes."]
[null,null,"F",{"$f":"'Encargos Sociais'!D41","v":"Multa do FGTS e Contribuição Social sobre o Aviso Prévio Trabalhado"},{"$f":"'Encargos Sociais'!E41","v":3.0505155555555549E-2},157.38]
[]
[null,null,null,"TOTAL DE PREVISÃO PARA RESCISÃO",null,{"$f":"SUM(F48:F53)","v":328.57}]
[]
[null,"MÓDULO 4 - CUSTO DO PROFISSIONAL AUSENTE",null,null,"Percentuais","Valor"]
[null,"Submódulo 4.1 - Ausências Legais"]
[null,null,"A",{"$f":"'Encargos Sociais'!D25","v":"Férias (Arts. 129 e 130, inc. I, da CLT)"},{"$f":"'Encargos Sociais'!E25","v":9.0909090909090912E-2},{"$f":"ROUND(E59*$F$16,2)","v":469},null,"* Nota 1 - As alíneas “A” a “F” referem-se somente ao custo que será pago ao repositor pelos dias \ntrabalhados quando da necessidade de substituir a mão de obra alocada na prestação do serviço."]
[null,null,"B",{"$f":"'Encargos Sociais'!D26","v":"Ausências Legais (Arts. 131 e 473 da CLT)"},{"$f":"'Encargos Sociais'!E26","v":7.9365079365079361E-3},40.94,null,"* Nota 2 - Adotou-se a estimativa do SINAPI de 2 dias por ano."]
[null,null,"C",{"$f":"'Encargos Sociais'!D27","v":"Licença-Paternidade (Art. 7º, XIX, e art. 10, §1º, do ADCT, CF/1988 e Art. 1º, II, da Lei 11.770/2008)"},{"$f":"'Encargos Sociais'!E27","v":8.2777777777777776E-4},4.2699999999999996,null,"* Nota 3 - Utilizada a proporção de 50% para homens, 5 dias de afastamento, e a probabilidade de um trabalhador requerer a Licença Paternidade em 5,22%, conforme SINAPI (citando dados da PNAD 2015)"]
[null,null,"D",{"$f":"'Encargos Sociais'!D28","v":"Ausência por Acidente de Trabalho (Art. 131, III, da CLT)"},{"$f":"'Encargos Sociais'!E28","v":8.541666666666667E-4},4.41,null,"* Nota 4 - Utilzada a estatística de 1,96% dos contribuintes beneficiados com a emissão do auxílio, conforme Anuário Estatístico da Previdência Social. Afastamento de 15 dias a cargo da empresa."]
[null,null,"E",{"$f":"'Encargos Sociais'!D29","v":"Afastamento Maternidade (Art. 71 da Lei nº 8.213/1991)"},{"$f":"'Encargos Sociais'!E29","v":3.2925925925925922E-3},16.989999999999998,null,"* Nota 5 - Utilizada a proporção de 50% para mulheres, 180 dias de afastamento, e a probabilidade de uma trabalhadora requerer a Licença Maternidade em 4,91%, conforme SINAPI (citando dados do IBGE 2016)"]
[null,null,"F",{"$f":"'Encargos Sociais'!D30","v":"Auxílio Enfermidade - Doença (Art. 59 da Lei nº 8.213/1991)"},{"$f":"'Encargos Sociais'!E30","v":7.1222222222222225E-3},36.74,null,"* Nota 6 - Utilizada a estatística de 3,37% dos contribuintes beneficiados com o auxílio, conforme Anuário Estatístico da Previdência Social de 2015 (acrescidos de 2 dias ao ano, para os quais o trabalhador nem requer o benefício da Previdência - conforme SINAPI)"]
[]
[null,"Submódulo 4.2 - Intrajornada"]
[null,null,"A","Intervalo para repouso ou alimentação",{"$f":"'Encargos Sociais'!E33","v":0},{"$f":"ROUND(E67*$F$16,2)","v":0}]
[]
[null,null,null,"QUADRO-RESUMO DO MÓDULO 4",null,"Valor"]
[null,null,null,"4.1 - Ausências Legais",{"$f":"SUM(E59:E64)","v":0.11094235810485811},{"$f":"ROUND(E70*$F$16,2)","v":572.35}]
[null,null,null,"4.2 - Intrajornada",{"$f":"E67","v":0},{"$f":"ROUND(E71*$F$16,2)","v":0}]
[]
[null,null,null,"TOTAL DE PREVISÃO PARA RESCISÃO E INTERVALO INTRAJORNADA",null,{"$f":"SUM(F70:F71)","v":572.35}]
[]
[null,"MÓDULO 5 - INSUMOS DIVERSOS",null,null,null,"Valor"]
[null,null,"A","Uniformes - aquisição",null,{"$f":"ROUND(HLOOKUP($B$5,Uniformes!L4:EA6,3)/12,2)","v":106.57}]
[null,null,"B","Materiais de consumo relacionados ao posto - aquisição",null,{"$f":"ROUND(HLOOKUP(B5,'Mat Cons'!I11:DX13,3)/12,2)","v":0}]
[null,null,"C","Materiais permanentes relacionados ao posto - remuneração da sua depreciação / manutenção",null,{"$f":"HLOOKUP(B5,'Mat Perm'!Q11:EF13,3)","v":0}]
[null,null,"D","Equipamentos relacionados ao posto - remuneração da sua depreciação / manutenção",null,{"$f":"HLOOKUP(B5,'Equip Rel'!Q11:EF13,3)","v":0}]
[null,null,"E","Equipamentos de Proteção Individual - EPI - aquisição",null,{"$f":"ROUND(HLOOKUP(B5,EPI!J4:DY6,3)/12,2)","v":81.92}]
[]
[null,null,null,"TOTAL DE INSUMOS DIVERSOS",null,{"$f":"SUM(F76:F81)","v":188.49},null,"* Nota - Valores mensais por empregado"]
[]
[null,"MÓDULO 6 - CUSTOS INDIRETOS, TRIBUTOS E LUCRO - BDI",null,null,"Percentuais","Valor"]
[null,null,"A","Custos Indiretos",{"$f":"BDI!E6","v":3.1399999999999997E-2}]
[null,null,"A.1","Administração Central",{"$f":"BDI!E7","v":2.5999999999999999E-2}]
[null,null,"A.2","Seguros, Garantias e Riscos",{"$f":"BDI!E8","v":5.4000000000000003E-3}]
[null,null,"B","Lucro",{"$f":"BDI!E10","v":0.04}]
[null,null,"C","Tributos",{"$f":"SUM(E90:E91)","v":0.124}]
[null,null,"C.1","Tributos Federais (COFINS, PIS e CPRB)",{"$f":"BDI!E18","v":7.3999999999999996E-2}]
[null,null,"C.2","Tributos Distritais (ISS)",{"$f":"BDI!E23","v":0.05},null,null,"* Nota - Utilizou-se o indicado pelo Sindicato da Arquitetura e da Engenharia (Sinaenco, 2008, p. 22), que adota um percentual redutor de 20% no cálculo dos custos tributários relativos às contribuições PIS e COFINS"]
[null,null,"D","Despesas Financeiras",{"$f":"BDI!E13","v":5.6394995474364773E-3}]
[]
[null,null,null,"TOTAL DE BDI",{"$f":"BDI!E26","v":0.23139999999999999},{"$f":"E94*E102","v":2143.0810180000003}]
[]
[null,null,null,"QUADRO-RESUMO DO CUSTO MENSAL POR EMPREGADO - SEM O 13º","Valor"]
[null,null,null,"Módulo 1 - Composição da Remuneração",{"$f":"F16","v":5159.03}]
[null,null,null,"Módulo 2 - Encargos e Benefícios Anuais, Mensais e Diários",{"$f":"F45","v":3012.9300000000003}]
[null,null,null,"Módulo 3 - Provisão para Rescisão",{"$f":"F55","v":328.57}]
[null,null,null,"Módulo 4 - Custo de Reposição do Profissional Ausente",{"$f":"F73","v":572.35}]
[null,null,null,"Módulo 5 - Insumos Diversos",{"$f":"F82","v":188.49}]
[null,null,null,"SUBTOTAL (A+B+C+D+E)",{"$f":"SUM(E97:E101)","v":9261.3700000000008}]
[null,null,null,"Módulo 6 - Custos Indiretos, Tributos e Lucro",{"$f":"F94","v":2143.0810180000003}]
[]
[null,null,null,"TOTAL DO POSTO",{"$f":"SUM(E102:E103)","v":11404.451018000002}]
[]
[null,"MÓDULO 7 - DESTAQUE DO MÓDULO 2 - 13º SALÁRIO",null,null,"Percentuais","Valor"]
[null,null,"A","13º Salário",{"$f":"'Encargos Sociais'!E32","v":8.3333333333333329E-2},{"$f":"ROUND(E108*F$16,2)","v":429.92}]
[null,null,"B","Encargos Sociais sobre o 13º Salário - Taxa calculada no SUBMÓDULO 2.2",{"$f":"SUM($E$24:$E$32)","v":0.36800000000000005},{"$f":"ROUND(E109*$F$108,2)","v":158.21},null,"* Nota 1 - Provisiona-se, mensalmente, o proporcional a 1/12 dos valores referentes a gratificação natalina e adicional de férias."]
[null,null,"C","BDI sobre o 13º Salário - Taxa calculada no MÓDULO 6",{"$f":"E94","v":0.23139999999999999},{"$f":"ROUND(E110*($F$108+$F$109),2)","v":136.09}]
[]
[null,null,null,"TOTAL DO DESTAQUE DO 13º SALÁRIO",null,{"$f":"SUM(F108:F110)","v":724.22}]
[]
[null,null,null,"QUADRO-RESUMO DO CUSTO MENSAL POR EMPREGADO","Valor"]
[null,null,null,"Custo total - sem o 13º Salário",{"$f":"E105","v":11404.451018000002}]
[null,null,null,"Destaque do 13º Salário (valor mensal)",{"$f":"F112","v":724.22}]
[]
[null,null,null,"TOTAL DO POSTO",{"$f":"E115+E116","v":12128.671018000001}]

{"sheet":"Dados Gerais","index":9,"n_rows":118,"n_cols":63,"rows_kept":118,"cut":false,"hidden":false,"merged":[[2,1,2,2]]}
[]
[]
[null,"INFORMAÇÕES DE ENTRADA"]
[]
[null,null,null,1,2,3,4,5,null,null,null,null,10,11,12,13,14,15,16,17,18,19,20,21,22,23,24,25,26,27,28,29,30,31,32,33,34,35,36,37,38,39,40,41,42,43,44,45,46,47,48,49,50,51,52,53,54,55,56,57,58,59,60]
[null,"",null,"CARGO 1","CARGO 2","CARGO 3","CARGO 4","CARGO 5","CARGO 6","CARGO 7","CARGO 8","CARGO 9","CARGO 10","CARGO 11","CARGO 12","CARGO 13","CARGO 14","CARGO 15","CARGO 16","CARGO 17","CARGO 18","CARGO 19","CARGO 20","CARGO 21","CARGO 22","CARGO 23","CARGO 24","CARGO 25","CARGO 26","CARGO 27","CARGO 28","CARGO 29","CARGO 30","CARGO 31","CARGO 32","CARGO 33","CARGO 34","CARGO 35","CARGO 36","CARGO 37","CARGO 38","CARGO 39","CARGO 40","CARGO 41","CARGO 42","CARGO 43","CARGO 44","CARGO 45","CARGO 46","CARGO 47","CARGO 48","CARGO 49","CARGO 50","CARGO 51","CARGO 52","CARGO 53","CARGO 54","CARGO 55","CARGO 56","CARGO 57","CARGO 58","CARGO 59","CARGO 60"]
[null,"INFORMAÇÕES BÁSICAS"]
[]
[null,"DESCRIÇÃO DOS POSTOS DE SERVIÇO"]
[null,null,null,"BOMBEIRO CIVIL MESTRE","BOMBEIRO CIVIL LÍDER DIURNO","BOMBEIRO CIVIL LÍDER NOTURNO","BOMBEIRO CIVIL BÁSICO DIURNO","BOMBEIRO CIVIL BÁSICO NOTURNO"]
[null,"REMUNERAÇÕES"]
[null,null,null,8161.0099999999993,4330.6000000000004,4330.6000000000004,3494.5399999999995,3494.5399999999995]
[null,"QUANTIDADE DE POSTOS"]
[null,null,null,2,2,2,36,28]
[null,"JORNADA"]
[null,null,"HORAS",{"$f":"36*5","v":180},180,{"$f":"E16","v":180},180,180]
[null,null,"DIAS/MÊS",26,15.5,{"$f":"E17","v":15.5},15.5,15.5]
[null,"CCT UTILIZADA"]
[null,null,"SINDICATOS E REFERÊNCIA","SEAC/DF X SINDIBOMBEIROS/DF 2023/2023 Nº DF000140/2023",{"$f":"D19","v":"SEAC/DF X SINDIBOMBEIROS/DF 2023/2023 Nº DF000140/2023"},{"$f":"E19","v":"SEAC/DF X SINDIBOMBEIROS/DF 2023/2023 Nº DF000140/2023"},"SEAC/DF X SINDIBOMBEIROS/DF 2023/2023 Nº DF000140/2023","SEAC/DF X SINDIBOMBEIROS/DF 2023/2023 Nº DF000140/2023"]
[null,null,"DATA-BASE","2023-01-01",{"$f":"D20","v":"2023-01-01"},{"$f":"E20","v":"2023-01-01"},"2023-01-01","2023-01-01"]
[]
[null,"ADICIONAIS LEGAIS E GRATIFICAÇÕES"]
[]
[null,"PERICULOSIDADE (PERCENTUAL)"]
[null,null,null,0.3,0.3,0.3,0.3,0.3]
[null,"BASE DE CÁLCULO DO ADICIONAL DE PERICULOSIDADE (SALÁRIO BÁSICO)"]
[null,null,null,{"$f":"D12","v":8161.0099999999993},{"$f":"E12","v":4330.6000000000004},4330.6000000000004,3494.5399999999995,3494.5399999999995]
[null,"VALOR MENSAL DO ADICIONAL DE PERICULOSIDADE"]
[null,null,null,{"$f":"ROUND(D25*D12,2)","v":2448.3000000000002},{"$f":"ROUND(E25*E12,2)","v":1299.18},1299.18,1048.3599999999999,1048.3599999999999]
[null,"INSALUBRIDADE (PERCENTUAL)"]
[null,null,null,0,0,0,0,0]
[null,"BASE DE CÁLCULO DO ADICIONAL DE INSALUBRIDADE (SALÁRIO MÍNIMO LEGAL)"]
[null,null,null,1320,{"$f":"D33","v":1320},1320,1320,1320]
[null,"VALOR MENSAL DO ADICIONAL DE INSALUBRIDADE"]
[null,null,null,{"$f":"D31*D33","v":0},{"$f":"E31*E33","v":0},0,{"$f":"G31*G33","v":0},0]
[null,"GRATIFICAÇÃO - VALOR MENSAL (R$)"]
[null,null,null,0,0,0,0,0]
[]
[null,"ADICIONAL NOTURNO"]
[]
[null,"INCIDÊNCIA (PERCENTUAL CONFORME CCT)"]
[null,null,null,0.22500000000000001,{"$f":"D42","v":0.22500000000000001},0.22500000000000001,0.22500000000000001,0.22500000000000001]
[null,"HORAS REAIS POR DIA"]
[null,null,null,0,0,7,0,7]
[null,"HORAS FICTAS POR DIA"]
[null,null,null,{"$f":"D44*60/60","v":0},{"$f":"E44*60/60","v":0},7,0,7]
[null,"BASE DE CÁLCULO DO ADICIONAL NOTURNO (INCLUINDO ADICIONAIS E GRATIFICAÇÕES)"]
[null,null,null,{"$f":"D12+D29+D35+D37","v":10609.31},{"$f":"E12+E29+E35+E37","v":5629.7800000000007},{"$f":"F12+F29+F35+F37","v":5629.7800000000007},4542.8999999999996,4542.8999999999996]
[null,"VALOR MENSAL DO ADICIONAL NOTURNO (HORA NORMAL + HORA REDUZIDA) - POR POSTO"]
[null,null,null,{"$f":"ROUND(D46*D17*D42*D48/D16,2)","v":0},{"$f":"ROUND(E46*E17*E42*E48/E16,2)","v":0},{"$f":"ROUND(F46*F17*F42*F48/F16,2)","v":763.54},0,616.13]
[]
[null,"ADICIONAL DE HORA EXTRA"]
[]
[null,"INCIDÊNCIA (PERCENTUAL 1)"]
[null,null,null,0.5,0.5,0.5,0.5,0.5]
[null,"HORAS EXTRAS POR MÊS (PERCENTUAL 1)"]
[null,null,null,0,0,0,0,0]
[null,"VALOR MENSAL DO ADICIONAL DE HORAS EXTRAS (PERCENTUAL 1) - POR POSTO"]
[null,null,null,{"$f":"ROUND(D57*D55*D12/D16,2)","v":0},0,0,0,0]
[null,"INCIDÊNCIA (PERCENTUAL 2)"]
[null,null,null,1,1,1,1,1]
[null,"HORAS EXTRAS POR MÊS (PERCENTUAL 2)"]
[null,null,null,0,0,0,0,0]
[null,"VALOR MENSAL DO ADICIONAL DE HORAS EXTRAS (PERCENTUAL 2) - POR POSTO"]
[null,null,null,{"$f":"ROUND(D63*D61*D12/D16,2)","v":0},0,0,0,0]
[null,"TOTAL MENSAL DOS ADICIONAIS DE HORAS EXTRAS - POR POSTO"]
[null,null,null,{"$f":"D65+D59","v":0},0,0,0,0]
[]
[null,"BENEFÍCIOS COMUNS - AUXÍLIO TRANSPORTE"]
[]
[null,"DISTRIBUIÇÃO ESTIMADA DE PROCEDÊNCIA"]
[null,null,"Cidade-satélite",0.68,0.68,0.68,0.68,0.68]
[null,null,"Região do entorno",0.32,0.32,0.32,0.32,0.32]
[null,null,"Esplanada - apenas para os que vêm do entorno",{"$f":"D73","v":0.32},{"$f":"E73","v":0.32},{"$f":"F73","v":0.32},{"$f":"G73","v":0.32},0.32]
[null,"VALORES DOS VALES"]
[null,null,"Cidade-satélite",5.5,{"$f":"D76","v":5.5},5.5,{"$f":"F76","v":5.5},{"$f":"G76","v":5.5}]
[null,null,"Região do entorno",8.09,8.09,8.09,8.09,8.09]
[null,null,"Esplanada",2.75,2.75,2.75,2.75,2.75]
[null,"VALOR MENSAL BRUTO DE PAGAMENTO - POR POSTO"]
[null,null,null,{"$f":"ROUND((D72*D76+D73*D77+D74*D78)*2*D17,2)","v":374.86},{"$f":"ROUND((E72*E76+E73*E77+E74*E78)*2*E17,2)","v":223.47},{"$f":"ROUND((F72*F76+F73*F77+F74*F78)*2*F17,2)","v":223.47},{"$f":"ROUND((G72*G76+G73*G77+G74*G78)*2*G17,2)","v":223.47},223.47]
[null,"PERCENTUAL DE DESCONTO"]
[null,null,null,0.06,0.06,0.06,0.06,0.06]
[null,"VALOR MENSAL DO DESCONTO - POR POSTO"]
[null,null,null,{"$f":"ROUND(D82*D12,2)","v":489.66},{"$f":"ROUND(E82*E12,2)","v":259.83999999999997},{"$f":"ROUND(F82*F12,2)","v":259.83999999999997},209.67,209.67]
[null,"VALOR MENSAL LÍQUIDO DO VALE TRANSPORTE - POR POSTO"]
[null,null,null,{"$f":"IF(D80>D84,D80-D84,0)","v":0},0,{"$f":"IF(F80>F84,F80-F84,0)","v":0},13.800000000000011,13.800000000000011]
[null,null,null,{"$f":"D86*D14","v":0},2962.54,2962.54,2962.54,2962.54]
[null,"BENEFÍCIOS COMUNS - AUXÍLIO ALIMENTAÇÃO"]
[]
[null,null,"VALOR CCT",43.62,{"$f":"D90","v":43.62},43.62,43.62,43.62]
[null,null,"VALOR CD",35,35,35,35,35]
[null,"VALOR MENSAL DO AUXÍLIO ALIMENTAÇÃO - POR POSTO"]
[null,null,null,{"$f":"ROUND(LARGE(D90:D91,1)*D17,2)","v":1134.1199999999999},{"$f":"ROUND(LARGE(E90:E91,1)*E17,2)","v":676.11},{"$f":"ROUND(LARGE(F90:F91,1)*F17,2)","v":676.11},{"$f":"ROUND(LARGE(G90:G91,1)*G17,2)","v":676.11},676.11]
[null,null,null,{"$f":"D93*D14","v":2268.2399999999998},10339.56,10339.56,10339.56,10339.56]
[null,"BENEFÍCIOS ESPECIAIS - ASSISTÊNCIA MÉDICA E FAMILIAR"]
[]
[null,null,"OBRIGAÇÃO DE PAGTO","NÃO","NÃO","NÃO","NÃO","NÃO"]
[null,null,"VALOR CCT",0,0,0,0,0]
[null,null,"VALOR MERCADO",0,0,0,0,0]
[null,"VALOR MENSAL DO AUXÍLIO ESPECIAL - ASSISTÊNCIA MÉDICA E FAMILIAR - POR POSTO"]
[null,null,null,{"$f":"IF(D97=\"SIM\",ROUND(SMALL(D98:D99,1),2),0)","v":0},0,{"$f":"IF(F97=\"SIM\",ROUND(SMALL(F98:F99,1),2),0)","v":0},0,0]
[]
[null,"BENEFÍCIOS ESPECIAIS - SEGURO DE VIDA E AUXÍLIO-FUNERAL, AUX ODONT, AUX CRECHE"]
[]
[null,"SEGURO DE VIDA E AUXÍLIO FUNERAL"]
[null,null,"OBRIGAÇÃO DE PAGTO","NÃO","NÃO","NÃO","NÃO","NÃO"]
[null,null,"VALOR CCT",0,0,0,0,0]
[null,null,"VALOR MERCADO",0,0,0,0,0]
[null,"VALOR MENSAL DO AUXÍLIO ESPECIAL - SEGURO DE VIDA E AUXÍLIO FUNERAL - POR POSTO"]
[null,null,null,{"$f":"IF(D106=\"SIM\",ROUND(SMALL(D107:D108,1),2),0)","v":0},0,{"$f":"IF(F106=\"SIM\",ROUND(SMALL(F107:F108,1),2),0)","v":0},0,0]
[null,"AUXÍLIO ODONTOLÓGICO"]
[null,null,"OBRIGAÇÃO DE PAGTO","NÃO","NÃO","NÃO","NÃO","NÃO"]
[null,null,"VALOR CCT",0,0,0,0,0]
[null,null,"VALOR MERCADO",0,0,0,0,0]
[null,"VALOR MENSAL DO AUXÍLIO ODONTOLÓGICO - POR POSTO"]
[null,null,null,{"$f":"IF(D112=\"SIM\",ROUND(SMALL(D113:D114,1),2)*D17,0)","v":0},0,0,0,0]
[null,"TOTAL MENSAL DOS AUXÍLIOS ESPECIAIS - POR POSTO"]
[null,null,null,{"$f":"D116+D110","v":0},0,{"$f":"F116+F110","v":0},0,0]

{"sheet":"Encargos Sociais","index":10,"n_rows":46,"n_cols":7,"rows_kept":46,"cut":false,"hidden":false,"merged":[[2,1,2,3],[3,1,3,4]]}
[]
[]
[]
[null,"ENCARGOS SOCIAIS SOBRE A MÃO DE OBRA"]
[null,null,null,null,"Percentuais"]
[]
[null,"Referência:"]
[null,null,"SINAPI OUT/2018"]
[]
[null,"Categorias:"]
[null,null,"TODAS"]
[]
[null,"GRUPO A: Encargos Sociais Básicos - Previdenciários (GPS), Fundo de Garantia por Tempo de Serviço (FGTS) e Outras Contribuições",null,null,{"$f":"ROUND(SUM(E14:E22),4)","v":0.36799999999999999}]
[null,null,"A","INSS (art. 22, inciso I, Lei nº 8.212/91)",0.2]
[null,null,"B","Salário Educação (art. 3º, inciso I, Decreto nº 87.043/82)",2.5000000000000001E-2]
[null,null,"C","SAT/RAT (art. 22, II, Lei 8.212/91 e Anexo V, Decreto 6.042/07) - Enquadramento 8011-1/01",0.03]
[null,null,"D","SESC ou SESI (art. 30, Lei nº 8.036/90 e art. 1º, Lei 8.154/90)",1.4999999999999999E-2]
[null,null,"E","SENAI ou SENAC (Decreto nº 2.318/86)",0.01]
[null,null,"F","SEBRAE (§ 3º, art. 8º, Lei 8.029/90, alterada pela Lei nº 8.154/90)",6.0000000000000001E-3,null,"* Nota 1 - Os percentuais dos encargos previdenciários, do FGTS e demais contribuições são estabelecidos por legislação vigente."]
[null,null,"G","INCRA (art. 1º, I, Decreto Lei 1.146/70 e Lei 7.787, de 30/06/89)",2E-3,null,"* Nota 2 - O SAT, a depender do grau de risco do serviço, irá variar entre 1%, para risco leve, de 2%, para risco médio, e de 3% para risco grave."]
[null,null,"H","FGTS (Lei Complementar nº 110/01 e art. 30, Lei nº 8.036/90)",0.08,null,"* Nota 3 - Os percentuais do Submódulo 2.2 incidem sobre o Módulo 1, o Submódulo 2.1, o Módulo 3, o Módulo 4 e o Módulo 6."]
[null,null,"I","SECONCI (Convenções Coletivas de Trabalho da construção)",0]
[]
[null,"GRUPO B: Encargos Sociais Relacionados ao Custo do Profissional Ausente - Ausências Legais",null,null,{"$f":"ROUND(SUM(E25:E33),4)","v":0.22459999999999999}]
[null,null,"A","Férias (Arts. 129 e 130, inc. I, da CLT)",{"$f":"1/11","v":9.0909090909090912E-2},null,"* Nota 1 - As alíneas “A” a “F” referem-se  ao custo que será pago pela empresa ao profissional ausente (férias e ausências legais)"]
[null,null,"B","Ausências Legais (Arts. 131 e 473 da CLT)",{"$f":"2/252","v":7.9365079365079361E-3},null,"* Nota 2 - Adotou-se a estimativa do SINAPI de 2 dias por ano. Em 252 dias úteis por ano."]
[null,null,"C","Licença-Paternidade (Art. 7º, XIX, e art. 10, §1º, do ADCT, CF/1988 e Art. 1º, II, da Lei 11.770/2008)",{"$f":"(5/(30*12))*0.0596","v":8.2777777777777776E-4},null,"* Nota 3 - Utilizada a proporção de 50% para homens, 5 dias de afastamento, e a probabilidade de um trabalhador requerer a Licença Paternidade em 5,96%, conforme SINAPI (Anuário Estatístico da Previdência Social - 2017)"]
[null,null,"D","Ausência por Acidente de Trabalho (Art. 131, III, da CLT)",{"$f":"0.0205*15/360","v":8.541666666666667E-4},null,"* Nota 4 - Utilzada a estatística de 2,05% dos contribuintes beneficiados com a emissão do auxílio, conforme Anuário Estatístico da Previdência Social. Afastamento de 15 dias a cargo da empresa."]
[null,null,"E","Afastamento Maternidade (Art. 71 da Lei nº 8.213/1991)",{"$f":"0.0508*(120/360)*(30+30*4/3)/360","v":3.2925925925925922E-3},null,"* Nota 5 - Utilizada a estimativa de 120 dias de afastamento, e a probabilidade de uma trabalhadora requerer a Licença Maternidade em 5,08%, conforme SINAPI (citando dados do IBGE 2017) - A própria previdência paga o benefício pelos 120 dias, contudo o empregador arca com o 13º e com as férias"]
[null,null,"F","Auxílio Enfermidade - Doença (Art. 59 da Lei nº 8.213/1991)",{"$f":"((0.0376*15)+2)/360","v":7.1222222222222225E-3},null,"* Nota 6 - Utilizada a estatística de 3,76% dos contribuintes beneficiados com o auxílio, conforme Anuário Estatístico da Previdência Social de 2016 (acrescidos de 2 dias ao ano, para os quais o trabalhador nem requer o benefício da Previdência - conforme SINAPI)"]
[null,null,"G","Adicional de Férias (componente do Submódulo 2.1)",{"$f":"1/3*1/11","v":3.03030303030303E-2},null,"* Nota 7 - O adicional de férias contido no Submódulo 2.1 corresponde a 1/3 da remuneração que, por sua vez, é dividida por 11 contome Nota 1."]
[null,null,"H","13º Salário (destacado na planilha de custos)",{"$f":"1/12","v":8.3333333333333329E-2},null,"* Nota 8 - Provisiona-se, mensalmente, o proporcional a 1/12 dos valores referentes a gratificação natalina e adicional de férias."]
[null,null,"I","Intervalo para repouso ou alimentação (componente do Submódulo 4.2)",0]
[]
[null,"GRUPO C: Encargos Sociais Relacionados à Previsão para Rescisão Trabalhista",null,null,{"$f":"ROUND(SUM(E36:E41),4)","v":6.3700000000000007E-2}]
[null,null,"A","Aviso Prévio Indenizado (Art. 7º, inciso XXI, da CF/1988 e arts. 477, 487, §1º, e 491 da CLT)",{"$f":"0.1*30/360","v":8.3333333333333332E-3},null,"* Nota 1 - Considerou-se demissões de 10% por ano para substituições, a um prazo estimado de contrato de 3 anos. Aviso prévio - 1º ano 30 dias. Considerou-se os 10% demitidos sem justa causa e recebendo aviso indenizado."]
[null,null,"B","Incidência do FGTS sobre o Aviso Prévio Indenizado (Súmula 305 TST)",{"$f":"E21*E36","v":6.6666666666666664E-4}]
[null,null,"C","Multa do FGTS e Contribuição Social sobre o Aviso Prévio Indenizado (Art. 18, §1º, da Lei 8.036/1990 e art. 1º da LC nº 110/2001)",{"$f":"(1+1/12+1/12+1/36)*0.4*E21*0.2019","v":7.7170666666666644E-3},null,"* Nota 2 - Incide sobre a Remuneração + 13º salário (1/12) + Férias (1/12) + Adicional de Férias (1/36) x 40% multa para o empregador x 8% FGTS"]
[null,null,"D","Aviso Prévio Trabalhado (Art. 488, parágrafo único, CLT)",{"$f":"((7+2*3)*100%/360)/3","v":1.2037037037037035E-2},null,"* Nota 3 - Considerou-se demissões de 100% ao final do contrato, com um prazo médio estimado de 3 anos. Assim, calcula-se 7 dias para o 1º ano de contrato e mais 3 dias para os 2 anos seguintes. Total 13 dias."]
[null,null,"E","Incidência de GPS, FGTS e outras contribuições sobre o Aviso Prévio Trabalhado",{"$f":"E39*E13","v":4.4296296296296288E-3}]
[null,null,"F","Multa do FGTS e Contribuição Social sobre o Aviso Prévio Trabalhado",{"$f":"(1+1/12+1/12+1/36)*0.4*E21*(1-0.2019)","v":3.0505155555555549E-2},null,"* Nota 4 - Incide sobre a Remuneração + 13º salário (1/12) + Férias (1/12) + Adicional de Férias (1/36) x 40% multa para o empregador x 8% FGTS"]
[]
[null,"GRUPO D: Reincidências",null,null,{"$f":"ROUND(SUM(E44:E44),4)","v":8.2699999999999996E-2}]
[null,null,"A","Reincidência do Grupo A sobre o Grupo B",{"$f":"E13*E24","v":8.2652799999999998E-2}]
[]
[null,null,null,"SOMATÓRIO - ENCARGOS SOCIAIS SOBRE A MÃO DE OBRA",{"$f":"E43+E35+E24+E13","v":0.73899999999999999}]

{"sheet":"BDI","index":11,"n_rows":26,"n_cols":7,"rows_kept":26,"cut":false,"hidden":false,"merged":[[1,1,1,3],[2,1,2,4]]}
[]
[]
[null,"COMPOSIÇÃO DA TAXA DE CUSTOS INDIRETOS, TRIBUTOS E LUCRO - BDI"]
[null,"APLICAÇÃO: MÃO DE OBRA, 13º, MATERIAIS, EPC E EQUIPAMENTO DE REGISTRO DE FREQUÊNCIA",null,null,"Percentuais"]
[]
[null,"Custos Indiretos da Contratada",null,null,{"$f":"SUM(E7:E8)","v":3.1399999999999997E-2}]
[null,null,"A","Administração Central",2.5999999999999999E-2,null,"* Nota 1 - O Somatório da Administração Central com o Lucro deve ser inferior a 12%"]
[null,null,"B","Seguros, Garantias e Riscos",{"$f":"0.34%+0.2%","v":5.4000000000000003E-3},null,"* Nota 2 - O risco previsto para o porte do contrato majorado em mais 0,20% devido ao não pagamento dos insumos componentes do custo do posto quando da ausência do mesmo."]
[]
[null,"Lucro",null,null,{"$f":"SUM(E11:E11)","v":0.04}]
[null,null,"A","Lucro Real sobre os Custos Administrados",0.04]
[]
[null,"Despesas Financeiras",null,null,{"$f":"E14","v":5.6394995474364773E-3}]
[null,null,"A","Cálculo Baseado no Prazo para a Restituição dos Desembolsos Realizados pelo Contratado e na Taxa de Retorno Arbitrada",{"$f":"(1+E16)^(E15/252)-1","v":5.6394995474364773E-3},null,"* Nota 1 - DF = [(1+TR)^(DU/252)]/100"]
[null,null,"A.1","Dias Úteis Considerados",11,null,"* Nota 2 - Diferença de dias entre o desembolso, pelo contratado, e o pagamento, pela Câmara"]
[null,null,"A.2","Taxa de Retorno",0.13750000000000001,null,"* Nota 3 - A taxa sugerida é a meta da SELIC"]
[]
[null,"Impostos - Tributos Federais",null,null,{"$f":"SUM(E19:E21)","v":7.3999999999999996E-2}]
[null,null,"A","Contribuição para o Financiamento da Seguridade Social - COFINS",{"$f":"0.8*7.6%","v":6.08E-2},null,"* Nota 1 - Redução de 20% considerando as deduções permitidas em Lei, conforme SENGE, citado pelo TCU - Acórdão 2622/2013"]
[null,null,"B","Programa de Integração Social - PIS",{"$f":"0.8*1.65%","v":1.3200000000000002E-2},null,"* Nota 2 - Redução de 20% considerando as deduções permitidas em Lei, conforme SENGE, citado pelo TCU - Acórdão 2622/2013"]
[null,null,"C","Contribuição Previdenciária sobre a Receita Bruta - CPRB",0,null,"* Nota 3 - Lei 12.546/2011 - Verificar atualizações e setores beneficiados"]
[]
[null,"Impostos - Tributos Distritais",null,null,{"$f":"SUM(E24:E24)","v":0.05}]
[null,null,"A","Imposto sobre Serviço de Qualquer Natureza - ISS",0.05]
[]
[null,null,null,"SOMATÓRIO - ENCARGOS SOCIAIS SOBRE A MÃO DE OBRA",{"$f":"ROUND((((1+E6)*(1+E10)*(1+E13)/(1-E18-E23))-1),4)","v":0.23139999999999999},null,"* Nota 1 - [(1+AC+SGR)*(1+L)*(1+DF)/(1-CONFINS-PIS-CPRB-ISS)]-1"]

{"sheet":"Uniformes","index":12,"n_rows":76,"n_cols":131,"rows_kept":76,"cut":false,"hidden":false,"merged":[[2,1,2,3],[3,1,3,8],[13,2,17,2],[18,2,22,2],[35,2,43,2]]}
[]
[]
[]
[null,"UNIFORMES - AQUISIÇÃO",null,null,null,null,null,null,null,null,null,1,null,{"$f":"L4+1","v":2},null,{"$f":"N4+1","v":3},null,{"$f":"P4+1","v":4},null,{"$f":"R4+1","v":5},null,{"$f":"T4+1","v":6},null,{"$f":"V4+1","v":7},null,{"$f":"X4+1","v":8},null,{"$f":"Z4+1","v":9},null,{"$f":"AB4+1","v":10},null,{"$f":"AD4+1","v":11},null,{"$f":"AF4+1","v":12},null,{"$f":"AH4+1","v":13},null,{"$f":"AJ4+1","v":14},null,{"$f":"AL4+1","v":15},null,{"$f":"AN4+1","v":16},null,{"$f":"AP4+1","v":17},null,{"$f":"AR4+1","v":18},null,{"$f":"AT4+1","v":19},null,{"$f":"AV4+1","v":20},null,{"$f":"AX4+1","v":21},null,{"$f":"AZ4+1","v":22},null,{"$f":"BB4+1","v":23},null,{"$f":"BD4+1","v":24},null,{"$f":"BF4+1","v":25},null,{"$f":"BH4+1","v":26},null,{"$f":"BJ4+1","v":27},null,{"$f":"BL4+1","v":28},null,{"$f":"BN4+1","v":29},null,{"$f":"BP4+1","v":30},null,{"$f":"BR4+1","v":31},null,{"$f":"BT4+1","v":32},null,{"$f":"BV4+1","v":33},null,{"$f":"BX4+1","v":34},null,{"$f":"BZ4+1","v":35},null,{"$f":"CB4+1","v":36},null,{"$f":"CD4+1","v":37},null,{"$f":"CF4+1","v":38},null,{"$f":"CH4+1","v":39},null,{"$f":"CJ4+1","v":40},null,{"$f":"CL4+1","v":41},null,{"$f":"CN4+1","v":42},null,{"$f":"CP4+1","v":43},null,{"$f":"CR4+1","v":44},null,{"$f":"CT4+1","v":45},null,{"$f":"CV4+1","v":46},null,{"$f":"CX4+1","v":47},null,{"$f":"CZ4+1","v":48},null,{"$f":"DB4+1","v":49},null,{"$f":"DD4+1","v":50},null,{"$f":"DF4+1","v":51},null,{"$f":"DH4+1","v":52},null,{"$f":"DJ4+1","v":53},null,{"$f":"DL4+1","v":54},null,{"$f":"DN4+1","v":55},null,{"$f":"DP4+1","v":56},null,{"$f":"DR4+1","v":57},null,{"$f":"DT4+1","v":58},null,{"$f":"DV4+1","v":59},null,{"$f":"DX4+1","v":60}]
[]
[null,null,null,null,null,null,null,null,null,null,null,{"$f":"ROUND(SUM(M5:M92),2)","v":1035.02},null,{"$f":"ROUND(SUM(O5:O92),2)","v":1278.8800000000001},null,{"$f":"ROUND(SUM(Q5:Q92),2)","v":1278.8800000000001},null,{"$f":"ROUND(SUM(S5:S92),2)","v":1278.8800000000001},null,{"$f":"ROUND(SUM(U5:U92),2)","v":1278.8800000000001},null,{"$f":"ROUND(SUM(W5:W92),2)","v":0},null,{"$f":"ROUND(SUM(Y5:Y92),2)","v":0},null,{"$f":"ROUND(SUM(AA5:AA92),2)","v":0},null,{"$f":"ROUND(SUM(AC5:AC92),2)","v":0},null,{"$f":"ROUND(SUM(AE5:AE92),2)","v":0},null,{"$f":"ROUND(SUM(AG5:AG92),2)","v":0},null,{"$f":"ROUND(SUM(AI5:AI92),2)","v":0},null,{"$f":"ROUND(SUM(AK5:AK92),2)","v":0},null,{"$f":"ROUND(SUM(AM5:AM92),2)","v":0},null,{"$f":"ROUND(SUM(AO5:AO92),2)","v":0},null,{"$f":"ROUND(SUM(AQ5:AQ92),2)","v":0},null,{"$f":"ROUND(SUM(AS5:AS92),2)","v":0},null,{"$f":"ROUND(SUM(AU5:AU92),2)","v":0},null,{"$f":"ROUND(SUM(AW5:AW92),2)","v":0},null,{"$f":"ROUND(SUM(AY5:AY92),2)","v":0},null,{"$f":"ROUND(SUM(BA5:BA92),2)","v":0},null,{"$f":"ROUND(SUM(BC5:BC92),2)","v":0},null,{"$f":"ROUND(SUM(BE5:BE92),2)","v":0},null,{"$f":"ROUND(SUM(BG5:BG92),2)","v":0},null,{"$f":"ROUND(SUM(BI5:BI92),2)","v":0},null,{"$f":"ROUND(SUM(BK5:BK92),2)","v":0},null,{"$f":"ROUND(SUM(BM5:BM92),2)","v":0},null,{"$f":"ROUND(SUM(BO5:BO92),2)","v":0},null,{"$f":"ROUND(SUM(BQ5:BQ92),2)","v":0},null,{"$f":"ROUND(SUM(BS5:BS92),2)","v":0},null,{"$f":"ROUND(SUM(BU5:BU92),2)","v":0},null,{"$f":"ROUND(SUM(BW5:BW92),2)","v":0},null,{"$f":"ROUND(SUM(BY5:BY92),2)","v":0},null,{"$f":"ROUND(SUM(CA5:CA92),2)","v":0},null,{"$f":"ROUND(SUM(CC5:CC92),2)","v":0},null,{"$f":"ROUND(SUM(CE5:CE92),2)","v":0},null,{"$f":"ROUND(SUM(CG5:CG92),2)","v":0},null,{"$f":"ROUND(SUM(CI5:CI92),2)","v":0},null,{"$f":"ROUND(SUM(CK5:CK92),2)","v":0},null,{"$f":"ROUND(SUM(CM5:CM92),2)","v":0},null,{"$f":"ROUND(SUM(CO5:CO92),2)","v":0},null,{"$f":"ROUND(SUM(CQ5:CQ92),2)","v":0},null,{"$f":"ROUND(SUM(CS5:CS92),2)","v":0},null,{"$f":"ROUND(SUM(CU5:CU92),2)","v":0},null,{"$f":"ROUND(SUM(CW5:CW92),2)","v":0},null,{"$f":"ROUND(SUM(CY5:CY92),2)","v":0},null,{"$f":"ROUND(SUM(DA5:DA92),2)","v":0},null,{"$f":"ROUND(SUM(DC5:DC92),2)","v":0},null,{"$f":"ROUND(SUM(DE5:DE92),2)","v":0},null,{"$f":"ROUND(SUM(DG5:DG92),2)","v":0},null,{"$f":"ROUND(SUM(DI5:DI92),2)","v":0},null,{"$f":"ROUND(SUM(DK5:DK92),2)","v":0},null,{"$f":"ROUND(SUM(DM5:DM92),2)","v":0},null,{"$f":"ROUND(SUM(DO5:DO92),2)","v":0},null,{"$f":"ROUND(SUM(DQ5:DQ92),2)","v":0},null,{"$f":"ROUND(SUM(DS5:DS92),2)","v":0},null,{"$f":"ROUND(SUM(DU5:DU92),2)","v":0},null,{"$f":"ROUND(SUM(DW5:DW92),2)","v":0},null,{"$f":"ROUND(SUM(DY5:DY92),2)","v":0},null,{"$f":"ROUND(SUM(EA5:EA92),2)","v":0}]
[null,null,"CATEGORIAS",null,null,null,null,null,"QUANTIDADE"]
[null,null,null,null,null,null,null,null,null,null,null,{"$f":"IF($C8=L$4,1,0)","v":0}]
[null,null,1,{"$f":"HLOOKUP($C9,'Dados Gerais'!$D$5:$BK$10,6)","v":"BOMBEIRO CIVIL MESTRE"},null,null,null,null,{"$f":"HLOOKUP($C9,'Dados Gerais'!$D$5:$BK$14,10)","v":2},null,null,1,null,{"$f":"IF($C9=N$4,1,0)","v":0},null,{"$f":"IF($C9=P$4,1,0)","v":0},null,{"$f":"IF($C9=R$4,1,0)","v":0},null,{"$f":"IF($C9=T$4,1,0)","v":0},null,{"$f":"IF($C9=V$4,1,0)","v":0},null,{"$f":"IF($C9=X$4,1,0)","v":0},null,{"$f":"IF($C9=Z$4,1,0)","v":0},null,{"$f":"IF($C9=AB$4,1,0)","v":0},null,{"$f":"IF($C9=AD$4,1,0)","v":0},null,{"$f":"IF($C9=AF$4,1,0)","v":0},null,{"$f":"IF($C9=AH$4,1,0)","v":0},null,{"$f":"IF($C9=AJ$4,1,0)","v":0},null,{"$f":"IF($C9=AL$4,1,0)","v":0},null,{"$f":"IF($C9=AN$4,1,0)","v":0},null,{"$f":"IF($C9=AP$4,1,0)","v":0},null,{"$f":"IF($C9=AR$4,1,0)","v":0},null,{"$f":"IF($C9=AT$4,1,0)","v":0},null,{"$f":"IF($C9=AV$4,1,0)","v":0},null,{"$f":"IF($C9=AX$4,1,0)","v":0},null,{"$f":"IF($C9=AZ$4,1,0)","v":0},null,{"$f":"IF($C9=BB$4,1,0)","v":0},null,{"$f":"IF($C9=BD$4,1,0)","v":0},null,{"$f":"IF($C9=BF$4,1,0)","v":0},null,{"$f":"IF($C9=BH$4,1,0)","v":0},null,{"$f":"IF($C9=BJ$4,1,0)","v":0},null,{"$f":"IF($C9=BL$4,1,0)","v":0},null,{"$f":"IF($C9=BN$4,1,0)","v":0},null,{"$f":"IF($C9=BP$4,1,0)","v":0},null,{"$f":"IF($C9=BR$4,1,0)","v":0},null,{"$f":"IF($C9=BT$4,1,0)","v":0},null,{"$f":"IF($C9=BV$4,1,0)","v":0},null,{"$f":"IF($C9=BX$4,1,0)","v":0},null,{"$f":"IF($C9=BZ$4,1,0)","v":0},null,{"$f":"IF($C9=CB$4,1,0)","v":0},null,{"$f":"IF($C9=CD$4,1,0)","v":0},null,{"$f":"IF($C9=CF$4,1,0)","v":0},null,{"$f":"IF($C9=CH$4,1,0)","v":0},null,{"$f":"IF($C9=CJ$4,1,0)","v":0},null,{"$f":"IF($C9=CL$4,1,0)","v":0},null,{"$f":"IF($C9=CN$4,1,0)","v":0},null,{"$f":"IF($C9=CP$4,1,0)","v":0},null,{"$f":"IF($C9=CR$4,1,0)","v":0},null,{"$f":"IF($C9=CT$4,1,0)","v":0},null,{"$f":"IF($C9=CV$4,1,0)","v":0},null,{"$f":"IF($C9=CX$4,1,0)","v":0},null,{"$f":"IF($C9=CZ$4,1,0)","v":0},null,{"$f":"IF($C9=DB$4,1,0)","v":0},null,{"$f":"IF($C9=DD$4,1,0)","v":0},null,{"$f":"IF($C9=DF$4,1,0)","v":0},null,{"$f":"IF($C9=DH$4,1,0)","v":0},null,{"$f":"IF($C9=DJ$4,1,0)","v":0},null,{"$f":"IF($C9=DL$4,1,0)","v":0},null,{"$f":"IF($C9=DN$4,1,0)","v":0},null,{"$f":"IF($C9=DP$4,1,0)","v":0},null,{"$f":"IF($C9=DR$4,1,0)","v":0},null,{"$f":"IF($C9=DT$4,1,0)","v":0},null,{"$f":"IF($C9=DV$4,1,0)","v":0},null,{"$f":"IF($C9=DX$4,1,0)","v":0},null,{"$f":"IF($C9=DZ$4,1,0)","v":0}]
[null,null,null,null,null,null,null,null,null,null,null,0]
[]
[null,null,"ITEM","DESCRIÇÃO","QUANT ANUAL\nPOR POSTO","% ESTIMADO POR GÊNERO","Nº DE POSTOS","QUANT ANUAL\nTOTAL ESTIMADA","VALOR"]
[null,null,null,null,null,null,null,null,null,null,null,null,{"$f":"IF(SUM(L$27:L$32)>0,$E13*$I13,0)","v":0},null,{"$f":"IF(SUM(N$27:N$32)>0,$E13*$I13,0)","v":0},null,{"$f":"IF(SUM(P$27:P$32)>0,$E13*$I13,0)","v":0},null,{"$f":"IF(SUM(R$27:R$32)>0,$E13*$I13,0)","v":0},null,{"$f":"IF(SUM(T$27:T$32)>0,$E13*$I13,0)","v":0},null,{"$f":"IF(SUM(V$27:V$32)>0,$E13*$I13,0)","v":0},null,{"$f":"IF(SUM(X$27:X$32)>0,$E13*$I13,0)","v":0},null,{"$f":"IF(SUM(Z$27:Z$32)>0,$E13*$I13,0)","v":0},null,{"$f":"IF(SUM(AB$27:AB$32)>0,$E13*$I13,0)","v":0},null,{"$f":"IF(SUM(AD$27:AD$32)>0,$E13*$I13,0)","v":0},null,{"$f":"IF(SUM(AF$27:AF$32)>0,$E13*$I13,0)","v":0},null,{"$f":"IF(SUM(AH$27:AH$32)>0,$E13*$I13,0)","v":0},null,{"$f":"IF(SUM(AJ$27:AJ$32)>0,$E13*$I13,0)","v":0},null,{"$f":"IF(SUM(AL$27:AL$32)>0,$E13*$I13,0)","v":0},null,{"$f":"IF(SUM(AN$27:AN$32)>0,$E13*$I13,0)","v":0},null,{"$f":"IF(SUM(AP$27:AP$32)>0,$E13*$I13,0)","v":0},null,{"$f":"IF(SUM(AR$27:AR$32)>0,$E13*$I13,0)","v":0},null,{"$f":"IF(SUM(AT$27:AT$32)>0,$E13*$I13,0)","v":0},null,{"$f":"IF(SUM(AV$27:AV$32)>0,$E13*$I13,0)","v":0},null,{"$f":"IF(SUM(AX$27:AX$32)>0,$E13*$I13,0)","v":0},null,{"$f":"IF(SUM(AZ$27:AZ$32)>0,$E13*$I13,0)","v":0},null,{"$f":"IF(SUM(BB$27:BB$32)>0,$E13*$I13,0)","v":0},null,{"$f":"IF(SUM(BD$27:BD$32)>0,$E13*$I13,0)","v":0},null,{"$f":"IF(SUM(BF$27:BF$32)>0,$E13*$I13,0)","v":0},null,{"$f":"IF(SUM(BH$27:BH$32)>0,$E13*$I13,0)","v":0},null,{"$f":"IF(SUM(BJ$27:BJ$32)>0,$E13*$I13,0)","v":0},null,{"$f":"IF(SUM(BL$27:BL$32)>0,$E13*$I13,0)","v":0},null,{"$f":"IF(SUM(BN$27:BN$32)>0,$E13*$I13,0)","v":0},null,{"$f":"IF(SUM(BP$27:BP$32)>0,$E13*$I13,0)","v":0},null,{"$f":"IF(SUM(BR$27:BR$32)>0,$E13*$I13,0)","v":0},null,{"$f":"IF(SUM(BT$27:BT$32)>0,$E13*$I13,0)","v":0},null,{"$f":"IF(SUM(BV$27:BV$32)>0,$E13*$I13,0)","v":0},null,{"$f":"IF(SUM(BX$27:BX$32)>0,$E13*$I13,0)","v":0},null,{"$f":"IF(SUM(BZ$27:BZ$32)>0,$E13*$I13,0)","v":0},null,{"$f":"IF(SUM(CB$27:CB$32)>0,$E13*$I13,0)","v":0},null,{"$f":"IF(SUM(CD$27:CD$32)>0,$E13*$I13,0)","v":0},null,{"$f":"IF(SUM(CF$27:CF$32)>0,$E13*$I13,0)","v":0},null,{"$f":"IF(SUM(CH$27:CH$32)>0,$E13*$I13,0)","v":0},null,{"$f":"IF(SUM(CJ$27:CJ$32)>0,$E13*$I13,0)","v":0},null,{"$f":"IF(SUM(CL$27:CL$32)>0,$E13*$I13,0)","v":0},null,{"$f":"IF(SUM(CN$27:CN$32)>0,$E13*$I13,0)","v":0},null,{"$f":"IF(SUM(CP$27:CP$32)>0,$E13*$I13,0)","v":0},null,{"$f":"IF(SUM(CR$27:CR$32)>0,$E13*$I13,0)","v":0},null,{"$f":"IF(SUM(CT$27:CT$32)>0,$E13*$I13,0)","v":0},null,{"$f":"IF(SUM(CV$27:CV$32)>0,$E13*$I13,0)","v":0},null,{"$f":"IF(SUM(CX$27:CX$32)>0,$E13*$I13,0)","v":0},null,{"$f":"IF(SUM(CZ$27:CZ$32)>0,$E13*$I13,0)","v":0},null,{"$f":"IF(SUM(DB$27:DB$32)>0,$E13*$I13,0)","v":0},null,{"$f":"IF(SUM(DD$27:DD$32)>0,$E13*$I13,0)","v":0},null,{"$f":"IF(SUM(DF$27:DF$32)>0,$E13*$I13,0)","v":0},null,{"$f":"IF(SUM(DH$27:DH$32)>0,$E13*$I13,0)","v":0},null,{"$f":"IF(SUM(DJ$27:DJ$32)>0,$E13*$I13,0)","v":0},null,{"$f":"IF(SUM(DL$27:DL$32)>0,$E13*$I13,0)","v":0},null,{"$f":"IF(SUM(DN$27:DN$32)>0,$E13*$I13,0)","v":0},null,{"$f":"IF(SUM(DP$27:DP$32)>0,$E13*$I13,0)","v":0},null,{"$f":"IF(SUM(DR$27:DR$32)>0,$E13*$I13,0)","v":0},null,{"$f":"IF(SUM(DT$27:DT$32)>0,$E13*$I13,0)","v":0},null,{"$f":"IF(SUM(DV$27:DV$32)>0,$E13*$I13,0)","v":0},null,{"$f":"IF(SUM(DX$27:DX$32)>0,$E13*$I13,0)","v":0},null,{"$f":"IF(SUM(DZ$27:DZ$32)>0,$E13*$I13,0)","v":0}]
[null,null,"MASCULINO","Terno composto de 1(um) paletó e 1 (uma calça), confeccionados em tecido lã fria super 120, na cor preta, tamanho de acordo com o manequim do usuário, com forro cetim com elastano",2,{"$f":"(62-11)/62","v":0.82258064516129037},{"$f":"SUM($I$7:$I$10)","v":2},{"$f":"ROUND(E14*F14*G14,0)","v":3},242.45,null,null,null,{"$f":"IF(SUM(L$8:L$11)>0,$H14*$I14,0)/SUM($I$8:$I$11)","v":363.67499999999995},null,{"$f":"IF(SUM(N$8:N$11)>0,$H14*$I14,0)/SUM($I$8:$I$11)","v":0},null,{"$f":"IF(SUM(P$8:P$11)>0,$H14*$I14,0)/SUM($I$8:$I$11)","v":0},null,{"$f":"IF(SUM(R$8:R$11)>0,$H14*$I14,0)/SUM($I$8:$I$11)","v":0},null,{"$f":"IF(SUM(T$8:T$11)>0,$H14*$I14,0)/SUM($I$8:$I$11)","v":0},null,{"$f":"IF(SUM(V$27:V$32)>0,$H14*$I14,0)","v":0},null,{"$f":"IF(SUM(X$27:X$32)>0,$H14*$I14,0)","v":0},null,{"$f":"IF(SUM(Z$27:Z$32)>0,$H14*$I14,0)","v":0},null,{"$f":"IF(SUM(AB$27:AB$32)>0,$H14*$I14,0)","v":0},null,{"$f":"IF(SUM(AD$27:AD$32)>0,$H14*$I14,0)","v":0},null,{"$f":"IF(SUM(AF$27:AF$32)>0,$H14*$I14,0)","v":0},null,{"$f":"IF(SUM(AH$27:AH$32)>0,$H14*$I14,0)","v":0},null,{"$f":"IF(SUM(AJ$27:AJ$32)>0,$H14*$I14,0)","v":0},null,{"$f":"IF(SUM(AL$27:AL$32)>0,$H14*$I14,0)","v":0},null,{"$f":"IF(SUM(AN$27:AN$32)>0,$H14*$I14,0)","v":0},null,{"$f":"IF(SUM(AP$27:AP$32)>0,$H14*$I14,0)","v":0},null,{"$f":"IF(SUM(AR$27:AR$32)>0,$H14*$I14,0)","v":0},null,{"$f":"IF(SUM(AT$27:AT$32)>0,$H14*$I14,0)","v":0},null,{"$f":"IF(SUM(AV$27:AV$32)>0,$H14*$I14,0)","v":0},null,{"$f":"IF(SUM(AX$27:AX$32)>0,$H14*$I14,0)","v":0},null,{"$f":"IF(SUM(AZ$27:AZ$32)>0,$H14*$I14,0)","v":0},null,{"$f":"IF(SUM(BB$27:BB$32)>0,$H14*$I14,0)","v":0},null,{"$f":"IF(SUM(BD$27:BD$32)>0,$H14*$I14,0)","v":0},null,{"$f":"IF(SUM(BF$27:BF$32)>0,$H14*$I14,0)","v":0},null,{"$f":"IF(SUM(BH$27:BH$32)>0,$H14*$I14,0)","v":0},null,{"$f":"IF(SUM(BJ$27:BJ$32)>0,$H14*$I14,0)","v":0},null,{"$f":"IF(SUM(BL$27:BL$32)>0,$H14*$I14,0)","v":0},null,{"$f":"IF(SUM(BN$27:BN$32)>0,$H14*$I14,0)","v":0},null,{"$f":"IF(SUM(BP$27:BP$32)>0,$H14*$I14,0)","v":0},null,{"$f":"IF(SUM(BR$27:BR$32)>0,$H14*$I14,0)","v":0},null,{"$f":"IF(SUM(BT$27:BT$32)>0,$H14*$I14,0)","v":0},null,{"$f":"IF(SUM(BV$27:BV$32)>0,$H14*$I14,0)","v":0},null,{"$f":"IF(SUM(BX$27:BX$32)>0,$H14*$I14,0)","v":0},null,{"$f":"IF(SUM(BZ$27:BZ$32)>0,$H14*$I14,0)","v":0},null,{"$f":"IF(SUM(CB$27:CB$32)>0,$H14*$I14,0)","v":0},null,{"$f":"IF(SUM(CD$27:CD$32)>0,$H14*$I14,0)","v":0},null,{"$f":"IF(SUM(CF$27:CF$32)>0,$H14*$I14,0)","v":0},null,{"$f":"IF(SUM(CH$27:CH$32)>0,$H14*$I14,0)","v":0},null,{"$f":"IF(SUM(CJ$27:CJ$32)>0,$H14*$I14,0)","v":0},null,{"$f":"IF(SUM(CL$27:CL$32)>0,$H14*$I14,0)","v":0},null,{"$f":"IF(SUM(CN$27:CN$32)>0,$H14*$I14,0)","v":0},null,{"$f":"IF(SUM(CP$27:CP$32)>0,$H14*$I14,0)","v":0},null,{"$f":"IF(SUM(CR$27:CR$32)>0,$H14*$I14,0)","v":0},null,{"$f":"IF(SUM(CT$27:CT$32)>0,$H14*$I14,0)","v":0},null,{"$f":"IF(SUM(CV$27:CV$32)>0,$H14*$I14,0)","v":0},null,{"$f":"IF(SUM(CX$27:CX$32)>0,$H14*$I14,0)","v":0},null,{"$f":"IF(SUM(CZ$27:CZ$32)>0,$H14*$I14,0)","v":0},null,{"$f":"IF(SUM(DB$27:DB$32)>0,$H14*$I14,0)","v":0},null,{"$f":"IF(SUM(DD$27:DD$32)>0,$H14*$I14,0)","v":0},null,{"$f":"IF(SUM(DF$27:DF$32)>0,$H14*$I14,0)","v":0},null,{"$f":"IF(SUM(DH$27:DH$32)>0,$H14*$I14,0)","v":0},null,{"$f":"IF(SUM(DJ$27:DJ$32)>0,$H14*$I14,0)","v":0},null,{"$f":"IF(SUM(DL$27:DL$32)>0,$H14*$I14,0)","v":0},null,{"$f":"IF(SUM(DN$27:DN$32)>0,$H14*$I14,0)","v":0},null,{"$f":"IF(SUM(DP$27:DP$32)>0,$H14*$I14,0)","v":0},null,{"$f":"IF(SUM(DR$27:DR$32)>0,$H14*$I14,0)","v":0},null,{"$f":"IF(SUM(DT$27:DT$32)>0,$H14*$I14,0)","v":0},null,{"$f":"IF(SUM(DV$27:DV$32)>0,$H14*$I14,0)","v":0},null,{"$f":"IF(SUM(DX$27:DX$32)>0,$H14*$I14,0)","v":0},null,{"$f":"IF(SUM(DZ$27:DZ$32)>0,$H14*$I14,0)","v":0}]
[null,null,null,"Camisa social na cor branca em tecido 100% algodão, manga longa, com bolso, tamanho de acordo com o manequm do usuário",3,{"$f":"F14","v":0.82258064516129037},{"$f":"G14","v":2},{"$f":"ROUND(E15*F15*G15,0)","v":5},74,null,null,null,{"$f":"IF(SUM(L$8:L$11)>0,$H15*$I15,0)/SUM($I$8:$I$11)","v":185},null,0,null,{"$f":"IF(SUM(P$8:P$11)>0,$H15*$I15,0)/SUM($I$8:$I$11)","v":0},null,{"$f":"IF(SUM(R$8:R$11)>0,$H15*$I15,0)/SUM($I$8:$I$11)","v":0},null,{"$f":"IF(SUM(T$8:T$11)>0,$H15*$I15,0)/SUM($I$8:$I$11)","v":0},null,0,null,0,null,0,null,0,null,0,null,0,null,0,null,0,null,0,null,0,null,0,null,0,null,0,null,0,null,0,null,0,null,0,null,0,null,0,null,0,null,0,null,0,null,0,null,0,null,0,null,0,null,0,null,0,null,0,null,0,null,0,null,0,null,0,null,0,null,0,null,0,null,0,null,0,null,0,null,0,null,0,null,0,null,0,null,0,null,0,null,0,null,0,null,0,null,0,null,0,null,0,null,0,null,0,null,0,null,0]
[null,null,null,"Cinto social (100% Couro, Cor = Preto). Tamanho de acordo com o manequim do usuário",2,{"$f":"F15","v":0.82258064516129037},2,3,31.835000000000001,null,null,null,47.752499999999998,null,0,null,{"$f":"IF(SUM(P$8:P$11)>0,$H16*$I16,0)/SUM($I$8:$I$11)","v":0},null,{"$f":"IF(SUM(R$8:R$11)>0,$H16*$I16,0)/SUM($I$8:$I$11)","v":0},null,{"$f":"IF(SUM(T$8:T$11)>0,$H16*$I16,0)/SUM($I$8:$I$11)","v":0},null,0,null,0,null,0,null,0,null,0,null,0,null,0,null,0,null,0,null,0,null,0,null,0,null,0,null,0,null,0,null,0,null,0,null,0,null,0,null,0,null,0,null,0,null,0,null,0,null,0,null,0,null,0,null,0,null,0,null,0,null,0,null,0,null,0,null,0,null,0,null,0,null,0,null,0,null,0,null,0,null,0,null,0,null,0,null,0,null,0,null,0,null,0,null,0,null,0,null,0,null,0,null,0,null,0,null,0,null,0]
[null,null,null,"Sapato social na cor preta, em 100% couro, acolchoado, solado antiderrapante em borracha colado e costurado, reforço interno anterior e posterior, revestimento interno em couro, palmilha anti-stress, amortecedor de impacto",2,0.82258064516129037,2,3,132.35,null,null,null,198.52499999999998,null,0,null,{"$f":"IF(SUM(P$8:P$11)>0,$H17*$I17,0)/SUM($I$8:$I$11)","v":0},null,{"$f":"IF(SUM(R$8:R$11)>0,$H17*$I17,0)/SUM($I$8:$I$11)","v":0},null,{"$f":"IF(SUM(T$8:T$11)>0,$H17*$I17,0)/SUM($I$8:$I$11)","v":0},null,0,null,0,null,0,null,0,null,0,null,0,null,0,null,0,null,0,null,0,null,0,null,0,null,0,null,0,null,0,null,0,null,0,null,0,null,0,null,0,null,0,null,0,null,0,null,0,null,0,null,0,null,0,null,0,null,0,null,0,null,0,null,0,null,0,null,0,null,0,null,0,null,0,null,0,null,0,null,0,null,0,null,0,null,0,null,0,null,0,null,0,null,0,null,0,null,0,null,0,null,0,null,0,null,0,null,0,null,0]
[null,null,null,"Meia, em algodão e lycra, cano longo na cor preta",2,0.82258064516129037,2,3,9.4499999999999993,null,null,null,14.174999999999999,null,0,null,{"$f":"IF(SUM(P$8:P$11)>0,$H18*$I18,0)/SUM($I$8:$I$11)","v":0},null,{"$f":"IF(SUM(R$8:R$11)>0,$H18*$I18,0)/SUM($I$8:$I$11)","v":0},null,{"$f":"IF(SUM(T$8:T$11)>0,$H18*$I18,0)/SUM($I$8:$I$11)","v":0},null,0,null,0,null,0,null,0,null,0,null,0,null,0,null,0,null,0,null,0,null,0,null,0,null,0,null,0,null,0,null,0,null,0,null,0,null,0,null,0,null,0,null,0,null,0,null,0,null,0,null,0,null,0,null,0,null,0,null,0,null,0,null,0,null,0,null,0,null,0,null,0,null,0,null,0,null,0,null,0,null,0,null,0,null,0,null,0,null,0,null,0,null,0,null,0,null,0,null,0,null,0,null,0,null,0,null,0,null,0]
[null,null,"FEMININO","Terninho feminino composto de 1(um) blazer e 1 (um) calça confeccionados em tecido crepe de alfaiataria de 1º qualidade, na cor preta, tamanho de acordo com o manequim do usuário com forro cetim com elastano",{"$f":"E14","v":2},{"$f":"100%-F18","v":0.17741935483870963},{"$f":"G18","v":2},1,245.5,null,null,null,122.75,null,0,null,{"$f":"IF(SUM(P$8:P$11)>0,$H19*$I19,0)/SUM($I$8:$I$11)","v":0},null,{"$f":"IF(SUM(R$8:R$11)>0,$H19*$I19,0)/SUM($I$8:$I$11)","v":0},null,{"$f":"IF(SUM(T$8:T$11)>0,$H19*$I19,0)/SUM($I$8:$I$11)","v":0},null,0,null,0,null,0,null,0,null,0,null,0,null,0,null,0,null,0,null,0,null,0,null,0,null,0,null,0,null,0,null,0,null,0,null,0,null,0,null,0,null,0,null,0,null,0,null,0,null,0,null,0,null,0,null,0,null,0,null,0,null,0,null,0,null,0,null,0,null,0,null,0,null,0,null,0,null,0,null,0,null,0,null,0,null,0,null,0,null,0,null,0,null,0,null,0,null,0,null,0,null,0,null,0,null,0,null,0,null,0]
[null,null,null,"Blusa social feminina na cor branca, tecido em crepe, manga curta e gola em V, tamanho de acordo com o manequim do usuário",{"$f":"E15","v":3},{"$f":"F19","v":0.17741935483870963},2,1,75,null,null,null,37.5,null,0,null,{"$f":"IF(SUM(P$8:P$11)>0,$H20*$I20,0)/SUM($I$8:$I$11)","v":0},null,{"$f":"IF(SUM(R$8:R$11)>0,$H20*$I20,0)/SUM($I$8:$I$11)","v":0},null,{"$f":"IF(SUM(T$8:T$11)>0,$H20*$I20,0)/SUM($I$8:$I$11)","v":0},null,0,null,0,null,0,null,0,null,0,null,0,null,0,null,0,null,0,null,0,null,0,null,0,null,0,null,0,null,0,null,0,null,0,null,0,null,0,null,0,null,0,null,0,null,0,null,0,null,0,null,0,null,0,null,0,null,0,null,0,null,0,null,0,null,0,null,0,null,0,null,0,null,0,null,0,null,0,null,0,null,0,null,0,null,0,null,0,null,0,null,0,null,0,null,0,null,0,null,0,null,0,null,0,null,0,null,0,null,0]
[null,null,null,"Cinto social (100% Couro, Cor = Preto). Tamanho de acordo com o manequim do usuário",{"$f":"E16","v":2},{"$f":"F20","v":0.17741935483870963},2,1,{"$f":"I16","v":31.835000000000001},null,null,null,15.9175,null,0,null,{"$f":"IF(SUM(P$8:P$11)>0,$H21*$I21,0)/SUM($I$8:$I$11)","v":0},null,{"$f":"IF(SUM(R$8:R$11)>0,$H21*$I21,0)/SUM($I$8:$I$11)","v":0},null,{"$f":"IF(SUM(T$8:T$11)>0,$H21*$I21,0)/SUM($I$8:$I$11)","v":0},null,0,null,0,null,0,null,0,null,0,null,0,null,0,null,0,null,0,null,0,null,0,null,0,null,0,null,0,null,0,null,0,null,0,null,0,null,0,null,0,null,0,null,0,null,0,null,0,null,0,null,0,null,0,null,0,null,0,null,0,null,0,null,0,null,0,null,0,null,0,null,0,null,0,null,0,null,0,null,0,null,0,null,0,null,0,null,0,null,0,null,0,null,0,null,0,null,0,null,0,null,0,null,0,null,0,null,0,null,0]
[null,null,null,"Sapato social feminino, com tecnologia antistaffa, em couro bovino macio, forro em material tecnológico espumado respirante, palmilha em espuma de PU suave anti impacto respirante, solado em poliuretano gel flexível, altura de salto de 4,5 cm, cor preta",{"$f":"E16","v":2},{"$f":"F20","v":0.17741935483870963},2,1,90,null,null,null,45,null,0,null,{"$f":"IF(SUM(P$8:P$11)>0,$H22*$I22,0)/SUM($I$8:$I$11)","v":0},null,{"$f":"IF(SUM(R$8:R$11)>0,$H22*$I22,0)/SUM($I$8:$I$11)","v":0},null,{"$f":"IF(SUM(T$8:T$11)>0,$H22*$I22,0)/SUM($I$8:$I$11)","v":0},null,0,null,0,null,0,null,0,null,0,null,0,null,0,null,0,null,0,null,0,null,0,null,0,null,0,null,0,null,0,null,0,null,0,null,0,null,0,null,0,null,0,null,0,null,0,null,0,null,0,null,0,null,0,null,0,null,0,null,0,null,0,null,0,null,0,null,0,null,0,null,0,null,0,null,0,null,0,null,0,null,0,null,0,null,0,null,0,null,0,null,0,null,0,null,0,null,0,null,0,null,0,null,0,null,0,null,0,null,0]
[null,null,null,"Meia, em algodão e lycra, cano longo na cor preta",{"$f":"E17","v":2},{"$f":"F21","v":0.17741935483870963},2,1,{"$f":"I18","v":9.4499999999999993},null,null,null,4.7249999999999996,null,0,null,{"$f":"IF(SUM(P$8:P$11)>0,$H23*$I23,0)/SUM($I$8:$I$11)","v":0},null,{"$f":"IF(SUM(R$8:R$11)>0,$H23*$I23,0)/SUM($I$8:$I$11)","v":0},null,{"$f":"IF(SUM(T$8:T$11)>0,$H23*$I23,0)/SUM($I$8:$I$11)","v":0},null,0,null,0,null,0,null,0,null,0,null,0,null,0,null,0,null,0,null,0,null,0,null,0,null,0,null,0,null,0,null,0,null,0,null,0,null,0,null,0,null,0,null,0,null,0,null,0,null,0,null,0,null,0,null,0,null,0,null,0,null,0,null,0,null,0,null,0,null,0,null,0,null,0,null,0,null,0,null,0,null,0,null,0,null,0,null,0,null,0,null,0,null,0,null,0,null,0,null,0,null,0,null,0,null,0,null,0,null,0]
[null,null,null,null,null,null,null,null,null,null,null,null,{"$f":"IF(SUM(L$8:L$11)>0,$H24*$I24,0)/SUM($I$28:$I$31)","v":0},null,0,null,{"$f":"IF(SUM(P$8:P$11)>0,$H24*$I24,0)/SUM($I$28:$I$31)","v":0},null,{"$f":"IF(SUM(R$8:R$11)>0,$H24*$I24,0)/SUM($I$28:$I$31)","v":0},null,{"$f":"IF(SUM(T$8:T$11)>0,$H24*$I24,0)/SUM($I$28:$I$31)","v":0},null,{"$f":"IF(SUM(V$27:V$32)>0,$E24*$I24,0)","v":0},null,{"$f":"IF(SUM(X$27:X$32)>0,$E24*$I24,0)","v":0},null,{"$f":"IF(SUM(Z$27:Z$32)>0,$E24*$I24,0)","v":0},null,{"$f":"IF(SUM(AB$27:AB$32)>0,$E24*$I24,0)","v":0},null,{"$f":"IF(SUM(AD$27:AD$32)>0,$E24*$I24,0)","v":0},null,{"$f":"IF(SUM(AF$27:AF$32)>0,$E24*$I24,0)","v":0},null,{"$f":"IF(SUM(AH$27:AH$32)>0,$E24*$I24,0)","v":0},null,{"$f":"IF(SUM(AJ$27:AJ$32)>0,$E24*$I24,0)","v":0},null,{"$f":"IF(SUM(AL$27:AL$32)>0,$E24*$I24,0)","v":0},null,{"$f":"IF(SUM(AN$27:AN$32)>0,$E24*$I24,0)","v":0},null,{"$f":"IF(SUM(AP$27:AP$32)>0,$E24*$I24,0)","v":0},null,{"$f":"IF(SUM(AR$27:AR$32)>0,$E24*$I24,0)","v":0},null,{"$f":"IF(SUM(AT$27:AT$32)>0,$E24*$I24,0)","v":0},null,{"$f":"IF(SUM(AV$27:AV$32)>0,$E24*$I24,0)","v":0},null,{"$f":"IF(SUM(AX$27:AX$32)>0,$E24*$I24,0)","v":0},null,{"$f":"IF(SUM(AZ$27:AZ$32)>0,$E24*$I24,0)","v":0},null,{"$f":"IF(SUM(BB$27:BB$32)>0,$E24*$I24,0)","v":0},null,{"$f":"IF(SUM(BD$27:BD$32)>0,$E24*$I24,0)","v":0},null,{"$f":"IF(SUM(BF$27:BF$32)>0,$E24*$I24,0)","v":0},null,{"$f":"IF(SUM(BH$27:BH$32)>0,$E24*$I24,0)","v":0},null,{"$f":"IF(SUM(BJ$27:BJ$32)>0,$E24*$I24,0)","v":0},null,{"$f":"IF(SUM(BL$27:BL$32)>0,$E24*$I24,0)","v":0},null,{"$f":"IF(SUM(BN$27:BN$32)>0,$E24*$I24,0)","v":0},null,{"$f":"IF(SUM(BP$27:BP$32)>0,$E24*$I24,0)","v":0},null,{"$f":"IF(SUM(BR$27:BR$32)>0,$E24*$I24,0)","v":0},null,{"$f":"IF(SUM(BT$27:BT$32)>0,$E24*$I24,0)","v":0},null,{"$f":"IF(SUM(BV$27:BV$32)>0,$E24*$I24,0)","v":0},null,{"$f":"IF(SUM(BX$27:BX$32)>0,$E24*$I24,0)","v":0},null,{"$f":"IF(SUM(BZ$27:BZ$32)>0,$E24*$I24,0)","v":0},null,{"$f":"IF(SUM(CB$27:CB$32)>0,$E24*$I24,0)","v":0},null,{"$f":"IF(SUM(CD$27:CD$32)>0,$E24*$I24,0)","v":0},null,{"$f":"IF(SUM(CF$27:CF$32)>0,$E24*$I24,0)","v":0},null,{"$f":"IF(SUM(CH$27:CH$32)>0,$E24*$I24,0)","v":0},null,{"$f":"IF(SUM(CJ$27:CJ$32)>0,$E24*$I24,0)","v":0},null,{"$f":"IF(SUM(CL$27:CL$32)>0,$E24*$I24,0)","v":0},null,{"$f":"IF(SUM(CN$27:CN$32)>0,$E24*$I24,0)","v":0},null,{"$f":"IF(SUM(CP$27:CP$32)>0,$E24*$I24,0)","v":0},null,{"$f":"IF(SUM(CR$27:CR$32)>0,$E24*$I24,0)","v":0},null,{"$f":"IF(SUM(CT$27:CT$32)>0,$E24*$I24,0)","v":0},null,{"$f":"IF(SUM(CV$27:CV$32)>0,$E24*$I24,0)","v":0},null,{"$f":"IF(SUM(CX$27:CX$32)>0,$E24*$I24,0)","v":0},null,{"$f":"IF(SUM(CZ$27:CZ$32)>0,$E24*$I24,0)","v":0},null,{"$f":"IF(SUM(DB$27:DB$32)>0,$E24*$I24,0)","v":0},null,{"$f":"IF(SUM(DD$27:DD$32)>0,$E24*$I24,0)","v":0},null,{"$f":"IF(SUM(DF$27:DF$32)>0,$E24*$I24,0)","v":0},null,{"$f":"IF(SUM(DH$27:DH$32)>0,$E24*$I24,0)","v":0},null,{"$f":"IF(SUM(DJ$27:DJ$32)>0,$E24*$I24,0)","v":0},null,{"$f":"IF(SUM(DL$27:DL$32)>0,$E24*$I24,0)","v":0},null,{"$f":"IF(SUM(DN$27:DN$32)>0,$E24*$I24,0)","v":0},null,{"$f":"IF(SUM(DP$27:DP$32)>0,$E24*$I24,0)","v":0},null,{"$f":"IF(SUM(DR$27:DR$32)>0,$E24*$I24,0)","v":0},null,{"$f":"IF(SUM(DT$27:DT$32)>0,$E24*$I24,0)","v":0},null,{"$f":"IF(SUM(DV$27:DV$32)>0,$E24*$I24,0)","v":0},null,{"$f":"IF(SUM(DX$27:DX$32)>0,$E24*$I24,0)","v":0},null,{"$f":"IF(SUM(DZ$27:DZ$32)>0,$E24*$I24,0)","v":0}]
[]
[null,null,"CATEGORIAS",null,null,null,null,null,"QUANTIDADE"]
[null,null,null,null,null,null,null,null,null,null,null,{"$f":"IF($C27=L$4,1,0)","v":0}]
[null,null,2,{"$f":"HLOOKUP($C28,'Dados Gerais'!$D$5:$BK$10,6)","v":"BOMBEIRO CIVIL LÍDER DIURNO"},null,null,null,null,{"$f":"HLOOKUP($C28,'Dados Gerais'!$D$5:$BK$14,10)","v":2},null,null,0,null,{"$f":"IF($C28=N$4,1,0)","v":1},null,{"$f":"IF($C28=P$4,1,0)","v":0},null,{"$f":"IF($C28=R$4,1,0)","v":0},null,{"$f":"IF($C28=T$4,1,0)","v":0},null,{"$f":"IF($C28=V$4,1,0)","v":0},null,{"$f":"IF($C28=X$4,1,0)","v":0},null,{"$f":"IF($C28=Z$4,1,0)","v":0},null,{"$f":"IF($C28=AB$4,1,0)","v":0},null,{"$f":"IF($C28=AD$4,1,0)","v":0},null,{"$f":"IF($C28=AF$4,1,0)","v":0},null,{"$f":"IF($C28=AH$4,1,0)","v":0},null,{"$f":"IF($C28=AJ$4,1,0)","v":0},null,{"$f":"IF($C28=AL$4,1,0)","v":0},null,{"$f":"IF($C28=AN$4,1,0)","v":0},null,{"$f":"IF($C28=AP$4,1,0)","v":0},null,{"$f":"IF($C28=AR$4,1,0)","v":0},null,{"$f":"IF($C28=AT$4,1,0)","v":0},null,{"$f":"IF($C28=AV$4,1,0)","v":0},null,{"$f":"IF($C28=AX$4,1,0)","v":0},null,{"$f":"IF($C28=AZ$4,1,0)","v":0},null,{"$f":"IF($C28=BB$4,1,0)","v":0},null,{"$f":"IF($C28=BD$4,1,0)","v":0},null,{"$f":"IF($C28=BF$4,1,0)","v":0},null,{"$f":"IF($C28=BH$4,1,0)","v":0},null,{"$f":"IF($C28=BJ$4,1,0)","v":0},null,{"$f":"IF($C28=BL$4,1,0)","v":0},null,{"$f":"IF($C28=BN$4,1,0)","v":0},null,{"$f":"IF($C28=BP$4,1,0)","v":0},null,{"$f":"IF($C28=BR$4,1,0)","v":0},null,{"$f":"IF($C28=BT$4,1,0)","v":0},null,{"$f":"IF($C28=BV$4,1,0)","v":0},null,{"$f":"IF($C28=BX$4,1,0)","v":0},null,{"$f":"IF($C28=BZ$4,1,0)","v":0},null,{"$f":"IF($C28=CB$4,1,0)","v":0},null,{"$f":"IF($C28=CD$4,1,0)","v":0},null,{"$f":"IF($C28=CF$4,1,0)","v":0},null,{"$f":"IF($C28=CH$4,1,0)","v":0},null,{"$f":"IF($C28=CJ$4,1,0)","v":0},null,{"$f":"IF($C28=CL$4,1,0)","v":0},null,{"$f":"IF($C28=CN$4,1,0)","v":0},null,{"$f":"IF($C28=CP$4,1,0)","v":0},null,{"$f":"IF($C28=CR$4,1,0)","v":0},null,{"$f":"IF($C28=CT$4,1,0)","v":0},null,{"$f":"IF($C28=CV$4,1,0)","v":0},null,{"$f":"IF($C28=CX$4,1,0)","v":0},null,{"$f":"IF($C28=CZ$4,1,0)","v":0},null,{"$f":"IF($C28=DB$4,1,0)","v":0},null,{"$f":"IF($C28=DD$4,1,0)","v":0},null,{"$f":"IF($C28=DF$4,1,0)","v":0},null,{"$f":"IF($C28=DH$4,1,0)","v":0},null,{"$f":"IF($C28=DJ$4,1,0)","v":0},null,{"$f":"IF($C28=DL$4,1,0)","v":0},null,{"$f":"IF($C28=DN$4,1,0)","v":0},null,{"$f":"IF($C28=DP$4,1,0)","v":0},null,{"$f":"IF($C28=DR$4,1,0)","v":0},null,{"$f":"IF($C28=DT$4,1,0)","v":0},null,{"$f":"IF($C28=DV$4,1,0)","v":0},null,{"$f":"IF($C28=DX$4,1,0)","v":0},null,{"$f":"IF($C28=DZ$4,1,0)","v":0}]
[null,null,3,{"$f":"HLOOKUP($C29,'Dados Gerais'!$D$5:$BK$10,6)","v":"BOMBEIRO CIVIL LÍDER NOTURNO"},null,null,null,null,{"$f":"HLOOKUP($C29,'Dados Gerais'!$D$5:$BK$14,10)","v":2},null,null,{"$f":"IF($C29=L$4,1,0)","v":0},null,0,null,1,null,0,null,0,null,0,null,0,null,0,null,0,null,0,null,0,null,0,null,0,null,0,null,0,null,0,null,0,null,0,null,0,null,0,null,0,null,0,null,0,null,0,null,0,null,0,null,0,null,0,null,0,null,0,null,0,null,0,null,0,null,0,null,0,null,0,null,0,null,0,null,0,null,0,null,0,null,0,null,0,null,0,null,0,null,0,null,0,null,0,null,0,null,0,null,0,null,0,null,0,null,0,null,0,null,0,null,0,null,0,null,0,null,0]
[null,null,4,{"$f":"HLOOKUP($C30,'Dados Gerais'!$D$5:$BK$10,6)","v":"BOMBEIRO CIVIL BÁSICO DIURNO"},null,null,null,null,{"$f":"HLOOKUP($C30,'Dados Gerais'!$D$5:$BK$14,10)","v":36},null,null,{"$f":"IF($C30=L$4,1,0)","v":0},null,0,null,0,null,1,null,0,null,0,null,0,null,0,null,0,null,0,null,0,null,0,null,0,null,0,null,0,null,0,null,0,null,0,null,0,null,0,null,0,null,0,null,0,null,0,null,0,null,0,null,0,null,0,null,0,null,0,null,0,null,0,null,0,null,0,null,0,null,0,null,0,null,0,null,0,null,0,null,0,null,0,null,0,null,0,null,0,null,0,null,0,null,0,null,0,null,0,null,0,null,0,null,0,null,0,null,0,null,0,null,0,null,0,null,0,null,0]
[null,null,5,{"$f":"HLOOKUP($C31,'Dados Gerais'!$D$5:$BK$10,6)","v":"BOMBEIRO CIVIL BÁSICO NOTURNO"},null,null,null,null,{"$f":"HLOOKUP($C31,'Dados Gerais'!$D$5:$BK$14,10)","v":28},null,null,{"$f":"IF($C31=L$4,1,0)","v":0},null,0,null,0,null,0,null,1,null,0,null,0,null,0,null,0,null,0,null,0,null,0,null,0,null,0,null,0,null,0,null,0,null,0,null,0,null,0,null,0,null,0,null,0,null,0,null,0,null,0,null,0,null,0,null,0,null,0,null,0,null,0,null,0,null,0,null,0,null,0,null,0,null,0,null,0,null,0,null,0,null,0,null,0,null,0,null,0,null,0,null,0,null,0,null,0,null,0,null,0,null,0,null,0,null,0,null,0,null,0,null,0,null,0,null,0,null,0]
[null,null,null,null,null,null,null,null,null,null,null,0]
[]
[null,null,"ITEM","DESCRIÇÃO","QUANT ANUAL\nPOR POSTO",null,"Nº DE POSTOS","QUANT ANUAL\nTOTAL ESTIMADA","VALOR"]
[null,null,null,null,null,null,null,null,null,null,null,null,{"$f":"IF(SUM(L$27:L$32)>0,$E35*$I35,0)","v":0},null,{"$f":"IF(SUM(N$27:N$32)>0,$E35*$I35,0)","v":0},null,{"$f":"IF(SUM(P$27:P$32)>0,$E35*$I35,0)","v":0},null,{"$f":"IF(SUM(R$27:R$32)>0,$E35*$I35,0)","v":0},null,{"$f":"IF(SUM(T$27:T$32)>0,$E35*$I35,0)","v":0},null,{"$f":"IF(SUM(V$27:V$32)>0,$E35*$I35,0)","v":0},null,{"$f":"IF(SUM(X$27:X$32)>0,$E35*$I35,0)","v":0},null,{"$f":"IF(SUM(Z$27:Z$32)>0,$E35*$I35,0)","v":0},null,{"$f":"IF(SUM(AB$27:AB$32)>0,$E35*$I35,0)","v":0},null,{"$f":"IF(SUM(AD$27:AD$32)>0,$E35*$I35,0)","v":0},null,{"$f":"IF(SUM(AF$27:AF$32)>0,$E35*$I35,0)","v":0},null,{"$f":"IF(SUM(AH$27:AH$32)>0,$E35*$I35,0)","v":0},null,{"$f":"IF(SUM(AJ$27:AJ$32)>0,$E35*$I35,0)","v":0},null,{"$f":"IF(SUM(AL$27:AL$32)>0,$E35*$I35,0)","v":0},null,{"$f":"IF(SUM(AN$27:AN$32)>0,$E35*$I35,0)","v":0},null,{"$f":"IF(SUM(AP$27:AP$32)>0,$E35*$I35,0)","v":0},null,{"$f":"IF(SUM(AR$27:AR$32)>0,$E35*$I35,0)","v":0},null,{"$f":"IF(SUM(AT$27:AT$32)>0,$E35*$I35,0)","v":0},null,{"$f":"IF(SUM(AV$27:AV$32)>0,$E35*$I35,0)","v":0},null,{"$f":"IF(SUM(AX$27:AX$32)>0,$E35*$I35,0)","v":0},null,{"$f":"IF(SUM(AZ$27:AZ$32)>0,$E35*$I35,0)","v":0},null,{"$f":"IF(SUM(BB$27:BB$32)>0,$E35*$I35,0)","v":0},null,{"$f":"IF(SUM(BD$27:BD$32)>0,$E35*$I35,0)","v":0},null,{"$f":"IF(SUM(BF$27:BF$32)>0,$E35*$I35,0)","v":0},null,{"$f":"IF(SUM(BH$27:BH$32)>0,$E35*$I35,0)","v":0},null,{"$f":"IF(SUM(BJ$27:BJ$32)>0,$E35*$I35,0)","v":0},null,{"$f":"IF(SUM(BL$27:BL$32)>0,$E35*$I35,0)","v":0},null,{"$f":"IF(SUM(BN$27:BN$32)>0,$E35*$I35,0)","v":0},null,{"$f":"IF(SUM(BP$27:BP$32)>0,$E35*$I35,0)","v":0},null,{"$f":"IF(SUM(BR$27:BR$32)>0,$E35*$I35,0)","v":0},null,{"$f":"IF(SUM(BT$27:BT$32)>0,$E35*$I35,0)","v":0},null,{"$f":"IF(SUM(BV$27:BV$32)>0,$E35*$I35,0)","v":0},null,{"$f":"IF(SUM(BX$27:BX$32)>0,$E35*$I35,0)","v":0},null,{"$f":"IF(SUM(BZ$27:BZ$32)>0,$E35*$I35,0)","v":0},null,{"$f":"IF(SUM(CB$27:CB$32)>0,$E35*$I35,0)","v":0},null,{"$f":"IF(SUM(CD$27:CD$32)>0,$E35*$I35,0)","v":0},null,{"$f":"IF(SUM(CF$27:CF$32)>0,$E35*$I35,0)","v":0},null,{"$f":"IF(SUM(CH$27:CH$32)>0,$E35*$I35,0)","v":0},null,{"$f":"IF(SUM(CJ$27:CJ$32)>0,$E35*$I35,0)","v":0},null,{"$f":"IF(SUM(CL$27:CL$32)>0,$E35*$I35,0)","v":0},null,{"$f":"IF(SUM(CN$27:CN$32)>0,$E35*$I35,0)","v":0},null,{"$f":"IF(SUM(CP$27:CP$32)>0,$E35*$I35,0)","v":0},null,{"$f":"IF(SUM(CR$27:CR$32)>0,$E35*$I35,0)","v":0},null,{"$f":"IF(SUM(CT$27:CT$32)>0,$E35*$I35,0)","v":0},null,{"$f":"IF(SUM(CV$27:CV$32)>0,$E35*$I35,0)","v":0},null,{"$f":"IF(SUM(CX$27:CX$32)>0,$E35*$I35,0)","v":0},null,{"$f":"IF(SUM(CZ$27:CZ$32)>0,$E35*$I35,0)","v":0},null,{"$f":"IF(SUM(DB$27:DB$32)>0,$E35*$I35,0)","v":0},null,{"$f":"IF(SUM(DD$27:DD$32)>0,$E35*$I35,0)","v":0},null,{"$f":"IF(SUM(DF$27:DF$32)>0,$E35*$I35,0)","v":0},null,{"$f":"IF(SUM(DH$27:DH$32)>0,$E35*$I35,0)","v":0},null,{"$f":"IF(SUM(DJ$27:DJ$32)>0,$E35*$I35,0)","v":0},null,{"$f":"IF(SUM(DL$27:DL$32)>0,$E35*$I35,0)","v":0},null,{"$f":"IF(SUM(DN$27:DN$32)>0,$E35*$I35,0)","v":0},null,{"$f":"IF(SUM(DP$27:DP$32)>0,$E35*$I35,0)","v":0},null,{"$f":"IF(SUM(DR$27:DR$32)>0,$E35*$I35,0)","v":0},null,{"$f":"IF(SUM(DT$27:DT$32)>0,$E35*$I35,0)","v":0},null,{"$f":"IF(SUM(DV$27:DV$32)>0,$E35*$I35,0)","v":0},null,{"$f":"IF(SUM(DX$27:DX$32)>0,$E35*$I35,0)","v":0},null,{"$f":"IF(SUM(DZ$27:DZ$32)>0,$E35*$I35,0)","v":0}]
[null,null,"UNISEX","Gandola - Características: Tecido Rip-Stop, padrão estipulado e aprovado pelo CBMDF para a Câmara dos Deputados",2,null,{"$f":"SUM($I$28:$I$31)","v":68},{"$f":"ROUNDUP(E36*G36,0)","v":136},197.5,null,null,null,{"$f":"IF(SUM(L$27:L$32)>0,$H36*$I36,0)/SUM($I$28:$I$31)","v":0},null,{"$f":"IF(SUM(N$27:N$32)>0,$H36*$I36,0)/SUM($I$28:$I$31)","v":395},null,{"$f":"IF(SUM(P$27:P$32)>0,$H36*$I36,0)/SUM($I$28:$I$31)","v":395},null,{"$f":"IF(SUM(R$27:R$32)>0,$H36*$I36,0)/SUM($I$28:$I$31)","v":395},null,{"$f":"IF(SUM(T$27:T$32)>0,$H36*$I36,0)/SUM($I$28:$I$31)","v":395},null,{"$f":"IF(SUM(V$27:V$32)>0,$H36*$I36,0)","v":0},null,{"$f":"IF(SUM(X$27:X$32)>0,$H36*$I36,0)","v":0},null,{"$f":"IF(SUM(Z$27:Z$32)>0,$H36*$I36,0)","v":0},null,{"$f":"IF(SUM(AB$27:AB$32)>0,$H36*$I36,0)","v":0},null,{"$f":"IF(SUM(AD$27:AD$32)>0,$H36*$I36,0)","v":0},null,{"$f":"IF(SUM(AF$27:AF$32)>0,$H36*$I36,0)","v":0},null,{"$f":"IF(SUM(AH$27:AH$32)>0,$H36*$I36,0)","v":0},null,{"$f":"IF(SUM(AJ$27:AJ$32)>0,$H36*$I36,0)","v":0},null,{"$f":"IF(SUM(AL$27:AL$32)>0,$H36*$I36,0)","v":0},null,{"$f":"IF(SUM(AN$27:AN$32)>0,$H36*$I36,0)","v":0},null,{"$f":"IF(SUM(AP$27:AP$32)>0,$H36*$I36,0)","v":0},null,{"$f":"IF(SUM(AR$27:AR$32)>0,$H36*$I36,0)","v":0},null,{"$f":"IF(SUM(AT$27:AT$32)>0,$H36*$I36,0)","v":0},null,{"$f":"IF(SUM(AV$27:AV$32)>0,$H36*$I36,0)","v":0},null,{"$f":"IF(SUM(AX$27:AX$32)>0,$H36*$I36,0)","v":0},null,{"$f":"IF(SUM(AZ$27:AZ$32)>0,$H36*$I36,0)","v":0},null,{"$f":"IF(SUM(BB$27:BB$32)>0,$H36*$I36,0)","v":0},null,{"$f":"IF(SUM(BD$27:BD$32)>0,$H36*$I36,0)","v":0},null,{"$f":"IF(SUM(BF$27:BF$32)>0,$H36*$I36,0)","v":0},null,{"$f":"IF(SUM(BH$27:BH$32)>0,$H36*$I36,0)","v":0},null,{"$f":"IF(SUM(BJ$27:BJ$32)>0,$H36*$I36,0)","v":0},null,{"$f":"IF(SUM(BL$27:BL$32)>0,$H36*$I36,0)","v":0},null,{"$f":"IF(SUM(BN$27:BN$32)>0,$H36*$I36,0)","v":0},null,{"$f":"IF(SUM(BP$27:BP$32)>0,$H36*$I36,0)","v":0},null,{"$f":"IF(SUM(BR$27:BR$32)>0,$H36*$I36,0)","v":0},null,{"$f":"IF(SUM(BT$27:BT$32)>0,$H36*$I36,0)","v":0},null,{"$f":"IF(SUM(BV$27:BV$32)>0,$H36*$I36,0)","v":0},null,{"$f":"IF(SUM(BX$27:BX$32)>0,$H36*$I36,0)","v":0},null,{"$f":"IF(SUM(BZ$27:BZ$32)>0,$H36*$I36,0)","v":0},null,{"$f":"IF(SUM(CB$27:CB$32)>0,$H36*$I36,0)","v":0},null,{"$f":"IF(SUM(CD$27:CD$32)>0,$H36*$I36,0)","v":0},null,{"$f":"IF(SUM(CF$27:CF$32)>0,$H36*$I36,0)","v":0},null,{"$f":"IF(SUM(CH$27:CH$32)>0,$H36*$I36,0)","v":0},null,{"$f":"IF(SUM(CJ$27:CJ$32)>0,$H36*$I36,0)","v":0},null,{"$f":"IF(SUM(CL$27:CL$32)>0,$H36*$I36,0)","v":0},null,{"$f":"IF(SUM(CN$27:CN$32)>0,$H36*$I36,0)","v":0},null,{"$f":"IF(SUM(CP$27:CP$32)>0,$H36*$I36,0)","v":0},null,{"$f":"IF(SUM(CR$27:CR$32)>0,$H36*$I36,0)","v":0},null,{"$f":"IF(SUM(CT$27:CT$32)>0,$H36*$I36,0)","v":0},null,{"$f":"IF(SUM(CV$27:CV$32)>0,$H36*$I36,0)","v":0},null,{"$f":"IF(SUM(CX$27:CX$32)>0,$H36*$I36,0)","v":0},null,{"$f":"IF(SUM(CZ$27:CZ$32)>0,$H36*$I36,0)","v":0},null,{"$f":"IF(SUM(DB$27:DB$32)>0,$H36*$I36,0)","v":0},null,{"$f":"IF(SUM(DD$27:DD$32)>0,$H36*$I36,0)","v":0},null,{"$f":"IF(SUM(DF$27:DF$32)>0,$H36*$I36,0)","v":0},null,{"$f":"IF(SUM(DH$27:DH$32)>0,$H36*$I36,0)","v":0},null,{"$f":"IF(SUM(DJ$27:DJ$32)>0,$H36*$I36,0)","v":0},null,{"$f":"IF(SUM(DL$27:DL$32)>0,$H36*$I36,0)","v":0},null,{"$f":"IF(SUM(DN$27:DN$32)>0,$H36*$I36,0)","v":0},null,{"$f":"IF(SUM(DP$27:DP$32)>0,$H36*$I36,0)","v":0},null,{"$f":"IF(SUM(DR$27:DR$32)>0,$H36*$I36,0)","v":0},null,{"$f":"IF(SUM(DT$27:DT$32)>0,$H36*$I36,0)","v":0},null,{"$f":"IF(SUM(DV$27:DV$32)>0,$H36*$I36,0)","v":0},null,{"$f":"IF(SUM(DX$27:DX$32)>0,$H36*$I36,0)","v":0},null,{"$f":"IF(SUM(DZ$27:DZ$32)>0,$H36*$I36,0)","v":0}]
[null,null,null,"Calça - Características: Tecido Rip-Stop, padrão estipulado e aprovado pelo CBMDF para a Câmara dos Deputados",2,null,68,{"$f":"ROUNDUP(E37*G37,0)","v":136},127.575,null,null,null,{"$f":"IF(SUM(L$27:L$32)>0,$H37*$I37,0)/SUM($I$28:$I$31)","v":0},null,{"$f":"IF(SUM(N$27:N$32)>0,$H37*$I37,0)/SUM($I$28:$I$31)","v":255.15},null,255.15,null,{"$f":"IF(SUM(R$27:R$32)>0,$H37*$I37,0)/SUM($I$28:$I$31)","v":255.15},null,{"$f":"IF(SUM(T$27:T$32)>0,$H37*$I37,0)/SUM($I$28:$I$31)","v":255.15},null,0,null,0,null,0,null,0,null,0,null,0,null,0,null,0,null,0,null,0,null,0,null,0,null,0,null,0,null,0,null,0,null,0,null,0,null,0,null,0,null,0,null,0,null,0,null,0,null,0,null,0,null,0,null,0,null,0,null,0,null,0,null,0,null,0,null,0,null,0,null,0,null,0,null,0,null,0,null,0,null,0,null,0,null,0,null,0,null,0,null,0,null,0,null,0,null,0,null,0,null,0,null,0,null,0,null,0,null,0]
[null,null,null,"Camisa – Características: 100% algodão, padrão estipulado pelo CBMDF para a Câmara dos Deputados (deve haver a inscrição do nome e tipo sanguíneo do bombeiro civil)",3,null,68,204,53.099999999999994,null,null,null,{"$f":"IF(SUM(L$27:L$32)>0,$H38*$I38,0)/SUM($I$28:$I$31)","v":0},null,159.29999999999998,null,159.29999999999998,null,{"$f":"IF(SUM(R$27:R$32)>0,$H38*$I38,0)/SUM($I$28:$I$31)","v":159.29999999999998},null,{"$f":"IF(SUM(T$27:T$32)>0,$H38*$I38,0)/SUM($I$28:$I$31)","v":159.29999999999998},null,0,null,0,null,0,null,0,null,0,null,0,null,0,null,0,null,0,null,0,null,0,null,0,null,0,null,0,null,0,null,0,null,0,null,0,null,0,null,0,null,0,null,0,null,0,null,0,null,0,null,0,null,0,null,0,null,0,null,0,null,0,null,0,null,0,null,0,null,0,null,0,null,0,null,0,null,0,null,0,null,0,null,0,null,0,null,0,null,0,null,0,null,0,null,0,null,0,null,0,null,0,null,0,null,0,null,0,null,0]
[null,null,null,{"$f":"D23","v":"Meia, em algodão e lycra, cano longo na cor preta"},2,null,68,136,{"$f":"I23","v":9.4499999999999993},null,null,null,{"$f":"IF(SUM(L$27:L$32)>0,$H39*$I39,0)/SUM($I$28:$I$31)","v":0},null,18.899999999999999,null,18.899999999999999,null,{"$f":"IF(SUM(R$27:R$32)>0,$H39*$I39,0)/SUM($I$28:$I$31)","v":18.899999999999999},null,{"$f":"IF(SUM(T$27:T$32)>0,$H39*$I39,0)/SUM($I$28:$I$31)","v":18.899999999999999},null,0,null,0,null,0,null,0,null,0,null,0,null,0,null,0,null,0,null,0,null,0,null,0,null,0,null,0,null,0,null,0,null,0,null,0,null,0,null,0,null,0,null,0,null,0,null,0,null,0,null,0,null,0,null,0,null,0,null,0,null,0,null,0,null,0,null,0,null,0,null,0,null,0,null,0,null,0,null,0,null,0,null,0,null,0,null,0,null,0,null,0,null,0,null,0,null,0,null,0,null,0,null,0,null,0,null,0,null,0]
[null,null,null,"Cinto, confeccionado em poliéster, com fivela e ponteira prata",2,null,68,136,15.5,null,null,null,{"$f":"IF(SUM(L$27:L$32)>0,$H40*$I40,0)/SUM($I$28:$I$31)","v":0},null,31,null,31,null,{"$f":"IF(SUM(R$27:R$32)>0,$H40*$I40,0)/SUM($I$28:$I$31)","v":31},null,{"$f":"IF(SUM(T$27:T$32)>0,$H40*$I40,0)/SUM($I$28:$I$31)","v":31},null,0,null,0,null,0,null,0,null,0,null,0,null,0,null,0,null,0,null,0,null,0,null,0,null,0,null,0,null,0,null,0,null,0,null,0,null,0,null,0,null,0,null,0,null,0,null,0,null,0,null,0,null,0,null,0,null,0,null,0,null,0,null,0,null,0,null,0,null,0,null,0,null,0,null,0,null,0,null,0,null,0,null,0,null,0,null,0,null,0,null,0,null,0,null,0,null,0,null,0,null,0,null,0,null,0,null,0,null,0]
[null,null,null,"Coturno, material: Cabedal em couro nobuk hidrofugado, espessura mínima de 2mm, dublado com tecido de poliéster e colarinho de couro pelica, forração interna de acrílico, com isolamento térmico em EVA, reforço interno de material termoplástico leve e resistente, no bico e calcanhar, solado de borracha maciço, vulcanizado ao cabedal, resistente à corrente elétrica e 100% impermeável. Marca de ref. Guartela, mod. Attack II",1,null,68,68,282.63333333333333,null,null,null,{"$f":"IF(SUM(L$27:L$32)>0,$H41*$I41,0)/SUM($I$28:$I$31)","v":0},null,282.63333333333333,null,282.63333333333333,null,{"$f":"IF(SUM(R$27:R$32)>0,$H41*$I41,0)/SUM($I$28:$I$31)","v":282.63333333333333},null,{"$f":"IF(SUM(T$27:T$32)>0,$H41*$I41,0)/SUM($I$28:$I$31)","v":282.63333333333333},null,0,null,0,null,0,null,0,null,0,null,0,null,0,null,0,null,0,null,0,null,0,null,0,null,0,null,0,null,0,null,0,null,0,null,0,null,0,null,0,null,0,null,0,null,0,null,0,null,0,null,0,null,0,null,0,null,0,null,0,null,0,null,0,null,0,null,0,null,0,null,0,null,0,null,0,null,0,null,0,null,0,null,0,null,0,null,0,null,0,null,0,null,0,null,0,null,0,null,0,null,0,null,0,null,0,null,0,null,0]
[null,null,null,"Bombachas",1,null,68,68,10.966666666666667,null,null,null,{"$f":"IF(SUM(L$27:L$32)>0,$H42*$I42,0)/SUM($I$28:$I$31)","v":0},null,10.966666666666667,null,10.966666666666667,null,{"$f":"IF(SUM(R$27:R$32)>0,$H42*$I42,0)/SUM($I$28:$I$31)","v":10.966666666666667},null,{"$f":"IF(SUM(T$27:T$32)>0,$H42*$I42,0)/SUM($I$28:$I$31)","v":10.966666666666667},null,0,null,0,null,0,null,0,null,0,null,0,null,0,null,0,null,0,null,0,null,0,null,0,null,0,null,0,null,0,null,0,null,0,null,0,null,0,null,0,null,0,null,0,null,0,null,0,null,0,null,0,null,0,null,0,null,0,null,0,null,0,null,0,null,0,null,0,null,0,null,0,null,0,null,0,null,0,null,0,null,0,null,0,null,0,null,0,null,0,null,0,null,0,null,0,null,0,null,0,null,0,null,0,null,0,null,0,null,0]
[null,null,null,"Camisa térmica – Segunda pele, confeccionada em poliéster térmico + elastano + lã acrílica (fleece). Tamanhos a ser definidos no momento da contratação. Cor preta",1,null,68,68,67.414999999999992,null,null,null,{"$f":"IF(SUM(L$27:L$32)>0,$H43*$I43,0)/SUM($I$28:$I$31)","v":0},null,67.414999999999992,null,67.414999999999992,null,{"$f":"IF(SUM(R$27:R$32)>0,$H43*$I43,0)/SUM($I$28:$I$31)","v":67.414999999999992},null,{"$f":"IF(SUM(T$27:T$32)>0,$H43*$I43,0)/SUM($I$28:$I$31)","v":67.414999999999992},null,0,null,0,null,0,null,0,null,0,null,0,null,0,null,0,null,0,null,0,null,0,null,0,null,0,null,0,null,0,null,0,null,0,null,0,null,0,null,0,null,0,null,0,null,0,null,0,null,0,null,0,null,0,null,0,null,0,null,0,null,0,null,0,null,0,null,0,null,0,null,0,null,0,null,0,null,0,null,0,null,0,null,0,null,0,null,0,null,0,null,0,null,0,null,0,null,0,null,0,null,0,null,0,null,0,null,0,null,0]
[null,null,null,"Bolsa de perna (pochete): Tecido 800D oxford ou superior e nailon resistente, à prova d'água, resistente a perfurações, ajuste completo na cintura e perna, dimensões aproximadas: 17 x 31 x 11 cm, mínimo de 6 bolsos, sistema MOLLE, cor preta. Marca de ref. TACTICAL CLUB, mod. Assalt.",1,null,68,68,58.51,null,null,null,{"$f":"IF(SUM(L$27:L$32)>0,$H44*$I44,0)/SUM($I$28:$I$31)","v":0},null,58.51,null,58.51,null,{"$f":"IF(SUM(R$27:R$32)>0,$H44*$I44,0)/SUM($I$28:$I$31)","v":58.51},null,{"$f":"IF(SUM(T$27:T$32)>0,$H44*$I44,0)/SUM($I$28:$I$31)","v":58.51},null,0,null,0,null,0,null,0,null,0,null,0,null,0,null,0,null,0,null,0,null,0,null,0,null,0,null,0,null,0,null,0,null,0,null,0,null,0,null,0,null,0,null,0,null,0,null,0,null,0,null,0,null,0,null,0,null,0,null,0,null,0,null,0,null,0,null,0,null,0,null,0,null,0,null,0,null,0,null,0,null,0,null,0,null,0,null,0,null,0,null,0,null,0,null,0,null,0,null,0,null,0,null,0,null,0,null,0,null,0]
[null,null,null,null,null,null,null,null,null,null,null,null,{"$f":"IF(SUM(L$27:L$32)>0,$E45*$I45,0)","v":0},null,0,null,0,null,{"$f":"IF(SUM(R$27:R$32)>0,$H45*$I45,0)/SUM($I$28:$I$31)","v":0},null,{"$f":"IF(SUM(T$27:T$32)>0,$H45*$I45,0)/SUM($I$28:$I$31)","v":0},null,{"$f":"IF(SUM(V$27:V$32)>0,$E45*$I45,0)","v":0},null,{"$f":"IF(SUM(X$27:X$32)>0,$E45*$I45,0)","v":0},null,{"$f":"IF(SUM(Z$27:Z$32)>0,$E45*$I45,0)","v":0},null,{"$f":"IF(SUM(AB$27:AB$32)>0,$E45*$I45,0)","v":0},null,{"$f":"IF(SUM(AD$27:AD$32)>0,$E45*$I45,0)","v":0},null,{"$f":"IF(SUM(AF$27:AF$32)>0,$E45*$I45,0)","v":0},null,{"$f":"IF(SUM(AH$27:AH$32)>0,$E45*$I45,0)","v":0},null,{"$f":"IF(SUM(AJ$27:AJ$32)>0,$E45*$I45,0)","v":0},null,{"$f":"IF(SUM(AL$27:AL$32)>0,$E45*$I45,0)","v":0},null,{"$f":"IF(SUM(AN$27:AN$32)>0,$E45*$I45,0)","v":0},null,{"$f":"IF(SUM(AP$27:AP$32)>0,$E45*$I45,0)","v":0},null,{"$f":"IF(SUM(AR$27:AR$32)>0,$E45*$I45,0)","v":0},null,{"$f":"IF(SUM(AT$27:AT$32)>0,$E45*$I45,0)","v":0},null,{"$f":"IF(SUM(AV$27:AV$32)>0,$E45*$I45,0)","v":0},null,{"$f":"IF(SUM(AX$27:AX$32)>0,$E45*$I45,0)","v":0},null,{"$f":"IF(SUM(AZ$27:AZ$32)>0,$E45*$I45,0)","v":0},null,{"$f":"IF(SUM(BB$27:BB$32)>0,$E45*$I45,0)","v":0},null,{"$f":"IF(SUM(BD$27:BD$32)>0,$E45*$I45,0)","v":0},null,{"$f":"IF(SUM(BF$27:BF$32)>0,$E45*$I45,0)","v":0},null,{"$f":"IF(SUM(BH$27:BH$32)>0,$E45*$I45,0)","v":0},null,{"$f":"IF(SUM(BJ$27:BJ$32)>0,$E45*$I45,0)","v":0},null,{"$f":"IF(SUM(BL$27:BL$32)>0,$E45*$I45,0)","v":0},null,{"$f":"IF(SUM(BN$27:BN$32)>0,$E45*$I45,0)","v":0},null,{"$f":"IF(SUM(BP$27:BP$32)>0,$E45*$I45,0)","v":0},null,{"$f":"IF(SUM(BR$27:BR$32)>0,$E45*$I45,0)","v":0},null,{"$f":"IF(SUM(BT$27:BT$32)>0,$E45*$I45,0)","v":0},null,{"$f":"IF(SUM(BV$27:BV$32)>0,$E45*$I45,0)","v":0},null,{"$f":"IF(SUM(BX$27:BX$32)>0,$E45*$I45,0)","v":0},null,{"$f":"IF(SUM(BZ$27:BZ$32)>0,$E45*$I45,0)","v":0},null,{"$f":"IF(SUM(CB$27:CB$32)>0,$E45*$I45,0)","v":0},null,{"$f":"IF(SUM(CD$27:CD$32)>0,$E45*$I45,0)","v":0},null,{"$f":"IF(SUM(CF$27:CF$32)>0,$E45*$I45,0)","v":0},null,{"$f":"IF(SUM(CH$27:CH$32)>0,$E45*$I45,0)","v":0},null,{"$f":"IF(SUM(CJ$27:CJ$32)>0,$E45*$I45,0)","v":0},null,{"$f":"IF(SUM(CL$27:CL$32)>0,$E45*$I45,0)","v":0},null,{"$f":"IF(SUM(CN$27:CN$32)>0,$E45*$I45,0)","v":0},null,{"$f":"IF(SUM(CP$27:CP$32)>0,$E45*$I45,0)","v":0},null,{"$f":"IF(SUM(CR$27:CR$32)>0,$E45*$I45,0)","v":0},null,{"$f":"IF(SUM(CT$27:CT$32)>0,$E45*$I45,0)","v":0},null,{"$f":"IF(SUM(CV$27:CV$32)>0,$E45*$I45,0)","v":0},null,{"$f":"IF(SUM(CX$27:CX$32)>0,$E45*$I45,0)","v":0},null,{"$f":"IF(SUM(CZ$27:CZ$32)>0,$E45*$I45,0)","v":0},null,{"$f":"IF(SUM(DB$27:DB$32)>0,$E45*$I45,0)","v":0},null,{"$f":"IF(SUM(DD$27:DD$32)>0,$E45*$I45,0)","v":0},null,{"$f":"IF(SUM(DF$27:DF$32)>0,$E45*$I45,0)","v":0},null,{"$f":"IF(SUM(DH$27:DH$32)>0,$E45*$I45,0)","v":0},null,{"$f":"IF(SUM(DJ$27:DJ$32)>0,$E45*$I45,0)","v":0},null,{"$f":"IF(SUM(DL$27:DL$32)>0,$E45*$I45,0)","v":0},null,{"$f":"IF(SUM(DN$27:DN$32)>0,$E45*$I45,0)","v":0},null,{"$f":"IF(SUM(DP$27:DP$32)>0,$E45*$I45,0)","v":0},null,{"$f":"IF(SUM(DR$27:DR$32)>0,$E45*$I45,0)","v":0},null,{"$f":"IF(SUM(DT$27:DT$32)>0,$E45*$I45,0)","v":0},null,{"$f":"IF(SUM(DV$27:DV$32)>0,$E45*$I45,0)","v":0},null,{"$f":"IF(SUM(DX$27:DX$32)>0,$E45*$I45,0)","v":0},null,{"$f":"IF(SUM(DZ$27:DZ$32)>0,$E45*$I45,0)","v":0}]
[]
[null,null,"CATEGORIAS",null,null,null,null,null,"QUANTIDADE"]
[null,null,null,null,null,null,null,null,null,null,null,{"$f":"IF($C48=L$4,1,0)","v":0},null,{"$f":"IF($C48=N$4,1,0)","v":0},null,{"$f":"IF($C48=P$4,1,0)","v":0},null,{"$f":"IF($C48=R$4,1,0)","v":0},null,{"$f":"IF($C48=T$4,1,0)","v":0},null,{"$f":"IF($C48=V$4,1,0)","v":0},null,{"$f":"IF($C48=X$4,1,0)","v":0},null,{"$f":"IF($C48=Z$4,1,0)","v":0},null,{"$f":"IF($C48=AB$4,1,0)","v":0},null,{"$f":"IF($C48=AD$4,1,0)","v":0},null,0,null,0,null,0,null,0,null,0,null,0,null,0,null,0,null,0,null,0,null,0,null,0,null,0,null,0,null,0,null,0,null,0,null,0,null,0,null,0,null,0,null,0,null,0,null,0,null,0,null,0,null,0,null,0,null,0,null,0,null,0,null,{"$f":"IF($C48=CP$4,1,0)","v":0},null,0,null,0,null,0,null,0,null,0,null,0,null,0,null,0,null,0,null,0,null,0,null,0,null,0,null,0,null,0,null,0,null,0,null,0]
[null,null,null,{"$f":"HLOOKUP($C49,'Dados Gerais'!$D$5:$BK$10,6)","v":{"$error":"#N/A"}},null,null,null,null,{"$f":"HLOOKUP($C49,'Dados Gerais'!$D$5:$BK$14,10)","v":{"$error":"#N/A"}},null,null,{"$f":"IF($C49=L$4,1,0)","v":0},null,0,null,0,null,0,null,0,null,0,null,0,null,0,null,0,null,0,null,0,null,0,null,0,null,0,null,0,null,0,null,0,null,0,null,0,null,0,null,0,null,0,null,0,null,0,null,0,null,0,null,0,null,0,null,0,null,0,null,0,null,0,null,0,null,0,null,0,null,0,null,0,null,0,null,0,null,0,null,0,null,0,null,0,null,0,null,0,null,0,null,0,null,0,null,0,null,0,null,0,null,0,null,0,null,0,null,0,null,0,null,0,null,0,null,0,null,0]
[null,null,null,{"$f":"HLOOKUP($C50,'Dados Gerais'!$D$5:$BK$10,6)","v":{"$error":"#N/A"}},null,null,null,null,{"$f":"HLOOKUP($C50,'Dados Gerais'!$D$5:$BK$14,10)","v":{"$error":"#N/A"}},null,null,0,null,0,null,0,null,{"$f":"IF($C50=R$4,1,0)","v":0},null,0,null,0,null,0,null,0,null,0,null,0,null,0,null,0,null,0,null,0,null,0,null,0,null,0,null,0,null,0,null,0,null,0,null,0,null,0,null,0,null,0,null,0,null,0,null,0,null,0,null,0,null,0,null,0,null,0,null,0,null,0,null,0,null,0,null,0,null,0,null,0,null,0,null,0,null,0,null,0,null,0,null,0,null,0,null,0,null,0,null,0,null,0,null,0,null,0,null,0,null,0,null,0,null,0,null,0,null,0,null,0]
[null,null,null,null,null,null,null,null,null,null,null,{"$f":"IF($C51=L$4,1,0)","v":0},null,{"$f":"IF($C51=N$4,1,0)","v":0},null,{"$f":"IF($C51=P$4,1,0)","v":0},null,0,null,0,null,0,null,0,null,0,null,0,null,0,null,{"$f":"IF($C51=AF$4,1,0)","v":0},null,0,null,0,null,0,null,0,null,0,null,0,null,0,null,0,null,0,null,0,null,0,null,0,null,0,null,0,null,0,null,0,null,0,null,0,null,0,null,0,null,0,null,0,null,0,null,0,null,0,null,0,null,0,null,0,null,0,null,0,null,0,null,0,null,0,null,0,null,0,null,0,null,0,null,0,null,0,null,0,null,0,null,0,null,0,null,0,null,0,null,0,null,0,null,0,null,0]
[]
[null,null,"ITEM","DESCRIÇÃO","QUANT ANUAL\nPOR POSTO",null,"Nº DE POSTOS","QUANT ANUAL\nTOTAL","VALOR"]
[null,null,null,null,null,null,null,null,null,null,null,null,{"$f":"IF(SUM(L$27:L$32)>0,$E54*$I54,0)","v":0},null,{"$f":"IF(SUM(N$27:N$32)>0,$E54*$I54,0)","v":0},null,{"$f":"IF(SUM(P$27:P$32)>0,$E54*$I54,0)","v":0},null,{"$f":"IF(SUM(R$27:R$32)>0,$E54*$I54,0)","v":0},null,{"$f":"IF(SUM(T$27:T$32)>0,$E54*$I54,0)","v":0},null,{"$f":"IF(SUM(V$27:V$32)>0,$E54*$I54,0)","v":0},null,{"$f":"IF(SUM(X$27:X$32)>0,$E54*$I54,0)","v":0},null,{"$f":"IF(SUM(Z$27:Z$32)>0,$E54*$I54,0)","v":0},null,{"$f":"IF(SUM(AB$27:AB$32)>0,$E54*$I54,0)","v":0},null,{"$f":"IF(SUM(AD$27:AD$32)>0,$E54*$I54,0)","v":0},null,{"$f":"IF(SUM(AF$27:AF$32)>0,$E54*$I54,0)","v":0},null,{"$f":"IF(SUM(AH$27:AH$32)>0,$E54*$I54,0)","v":0},null,{"$f":"IF(SUM(AJ$27:AJ$32)>0,$E54*$I54,0)","v":0},null,{"$f":"IF(SUM(AL$27:AL$32)>0,$E54*$I54,0)","v":0},null,{"$f":"IF(SUM(AN$27:AN$32)>0,$E54*$I54,0)","v":0},null,{"$f":"IF(SUM(AP$27:AP$32)>0,$E54*$I54,0)","v":0},null,{"$f":"IF(SUM(AR$27:AR$32)>0,$E54*$I54,0)","v":0},null,{"$f":"IF(SUM(AT$27:AT$32)>0,$E54*$I54,0)","v":0},null,{"$f":"IF(SUM(AV$27:AV$32)>0,$E54*$I54,0)","v":0},null,{"$f":"IF(SUM(AX$27:AX$32)>0,$E54*$I54,0)","v":0},null,{"$f":"IF(SUM(AZ$27:AZ$32)>0,$E54*$I54,0)","v":0},null,{"$f":"IF(SUM(BB$27:BB$32)>0,$E54*$I54,0)","v":0},null,{"$f":"IF(SUM(BD$27:BD$32)>0,$E54*$I54,0)","v":0},null,{"$f":"IF(SUM(BF$27:BF$32)>0,$E54*$I54,0)","v":0},null,{"$f":"IF(SUM(BH$27:BH$32)>0,$E54*$I54,0)","v":0},null,{"$f":"IF(SUM(BJ$27:BJ$32)>0,$E54*$I54,0)","v":0},null,{"$f":"IF(SUM(BL$27:BL$32)>0,$E54*$I54,0)","v":0},null,{"$f":"IF(SUM(BN$27:BN$32)>0,$E54*$I54,0)","v":0},null,{"$f":"IF(SUM(BP$27:BP$32)>0,$E54*$I54,0)","v":0},null,{"$f":"IF(SUM(BR$27:BR$32)>0,$E54*$I54,0)","v":0},null,{"$f":"IF(SUM(BT$27:BT$32)>0,$E54*$I54,0)","v":0},null,{"$f":"IF(SUM(BV$27:BV$32)>0,$E54*$I54,0)","v":0},null,{"$f":"IF(SUM(BX$27:BX$32)>0,$E54*$I54,0)","v":0},null,{"$f":"IF(SUM(BZ$27:BZ$32)>0,$E54*$I54,0)","v":0},null,{"$f":"IF(SUM(CB$27:CB$32)>0,$E54*$I54,0)","v":0},null,{"$f":"IF(SUM(CD$27:CD$32)>0,$E54*$I54,0)","v":0},null,{"$f":"IF(SUM(CF$27:CF$32)>0,$E54*$I54,0)","v":0},null,{"$f":"IF(SUM(CH$27:CH$32)>0,$E54*$I54,0)","v":0},null,{"$f":"IF(SUM(CJ$27:CJ$32)>0,$E54*$I54,0)","v":0},null,{"$f":"IF(SUM(CL$27:CL$32)>0,$E54*$I54,0)","v":0},null,{"$f":"IF(SUM(CN$27:CN$32)>0,$E54*$I54,0)","v":0},null,{"$f":"IF(SUM(CP$27:CP$32)>0,$E54*$I54,0)","v":0},null,{"$f":"IF(SUM(CR$27:CR$32)>0,$E54*$I54,0)","v":0},null,{"$f":"IF(SUM(CT$27:CT$32)>0,$E54*$I54,0)","v":0},null,{"$f":"IF(SUM(CV$27:CV$32)>0,$E54*$I54,0)","v":0},null,{"$f":"IF(SUM(CX$27:CX$32)>0,$E54*$I54,0)","v":0},null,{"$f":"IF(SUM(CZ$27:CZ$32)>0,$E54*$I54,0)","v":0},null,{"$f":"IF(SUM(DB$27:DB$32)>0,$E54*$I54,0)","v":0},null,{"$f":"IF(SUM(DD$27:DD$32)>0,$E54*$I54,0)","v":0},null,{"$f":"IF(SUM(DF$27:DF$32)>0,$E54*$I54,0)","v":0},null,{"$f":"IF(SUM(DH$27:DH$32)>0,$E54*$I54,0)","v":0},null,{"$f":"IF(SUM(DJ$27:DJ$32)>0,$E54*$I54,0)","v":0},null,{"$f":"IF(SUM(DL$27:DL$32)>0,$E54*$I54,0)","v":0},null,{"$f":"IF(SUM(DN$27:DN$32)>0,$E54*$I54,0)","v":0},null,{"$f":"IF(SUM(DP$27:DP$32)>0,$E54*$I54,0)","v":0},null,{"$f":"IF(SUM(DR$27:DR$32)>0,$E54*$I54,0)","v":0},null,{"$f":"IF(SUM(DT$27:DT$32)>0,$E54*$I54,0)","v":0},null,{"$f":"IF(SUM(DV$27:DV$32)>0,$E54*$I54,0)","v":0},null,{"$f":"IF(SUM(DX$27:DX$32)>0,$E54*$I54,0)","v":0},null,{"$f":"IF(SUM(DZ$27:DZ$32)>0,$E54*$I54,0)","v":0}]
[null,null,7,null,4,null,{"$f":"I49+I50","v":{"$error":"#N/A"}},{"$f":"G55*E55","v":{"$error":"#N/A"}},null,null,null,null,{"$f":"IF(SUM(L$49:L$51)>0,$E55*$I55,0)","v":0},null,{"$f":"IF(SUM(N$49:N$51)>0,$E55*$I55,0)","v":0},null,{"$f":"IF(SUM(P$49:P$51)>0,$E55*$I55,0)","v":0},null,{"$f":"IF(SUM(R$49:R$51)>0,$E55*$I55,0)","v":0},null,{"$f":"IF(SUM(T$49:T$51)>0,$E55*$I55,0)","v":0},null,{"$f":"IF(SUM(V$49:V$51)>0,$E55*$I55,0)","v":0},null,{"$f":"IF(SUM(X$49:X$51)>0,$E55*$I55,0)","v":0},null,{"$f":"IF(SUM(Z$49:Z$51)>0,$E55*$I55,0)","v":0},null,{"$f":"IF(SUM(AB$49:AB$51)>0,$E55*$I55,0)","v":0},null,{"$f":"IF(SUM(AD$49:AD$51)>0,$E55*$I55,0)","v":0},null,{"$f":"IF(SUM(AF$49:AF$51)>0,$E55*$I55,0)","v":0},null,{"$f":"IF(SUM(AH$49:AH$51)>0,$E55*$I55,0)","v":0},null,{"$f":"IF(SUM(AJ$49:AJ$51)>0,$E55*$I55,0)","v":0},null,{"$f":"IF(SUM(AL$49:AL$51)>0,$E55*$I55,0)","v":0},null,{"$f":"IF(SUM(AN$49:AN$51)>0,$E55*$I55,0)","v":0},null,{"$f":"IF(SUM(AP$49:AP$51)>0,$E55*$I55,0)","v":0},null,{"$f":"IF(SUM(AR$49:AR$51)>0,$E55*$I55,0)","v":0},null,{"$f":"IF(SUM(AT$49:AT$51)>0,$E55*$I55,0)","v":0},null,{"$f":"IF(SUM(AV$49:AV$51)>0,$E55*$I55,0)","v":0},null,{"$f":"IF(SUM(AX$49:AX$51)>0,$E55*$I55,0)","v":0},null,{"$f":"IF(SUM(AZ$49:AZ$51)>0,$E55*$I55,0)","v":0},null,{"$f":"IF(SUM(BB$49:BB$51)>0,$E55*$I55,0)","v":0},null,{"$f":"IF(SUM(BD$49:BD$51)>0,$E55*$I55,0)","v":0},null,{"$f":"IF(SUM(BF$49:BF$51)>0,$E55*$I55,0)","v":0},null,{"$f":"IF(SUM(BH$49:BH$51)>0,$E55*$I55,0)","v":0},null,{"$f":"IF(SUM(BJ$49:BJ$51)>0,$E55*$I55,0)","v":0},null,{"$f":"IF(SUM(BL$49:BL$51)>0,$E55*$I55,0)","v":0},null,{"$f":"IF(SUM(BN$49:BN$51)>0,$E55*$I55,0)","v":0},null,{"$f":"IF(SUM(BP$49:BP$51)>0,$E55*$I55,0)","v":0},null,{"$f":"IF(SUM(BR$49:BR$51)>0,$E55*$I55,0)","v":0},null,{"$f":"IF(SUM(BT$49:BT$51)>0,$E55*$I55,0)","v":0},null,{"$f":"IF(SUM(BV$49:BV$51)>0,$E55*$I55,0)","v":0},null,{"$f":"IF(SUM(BX$49:BX$51)>0,$E55*$I55,0)","v":0},null,{"$f":"IF(SUM(BZ$49:BZ$51)>0,$E55*$I55,0)","v":0},null,{"$f":"IF(SUM(CB$49:CB$51)>0,$E55*$I55,0)","v":0},null,{"$f":"IF(SUM(CD$49:CD$51)>0,$E55*$I55,0)","v":0},null,{"$f":"IF(SUM(CF$49:CF$51)>0,$E55*$I55,0)","v":0},null,{"$f":"IF(SUM(CH$49:CH$51)>0,$E55*$I55,0)","v":0},null,{"$f":"IF(SUM(CJ$49:CJ$51)>0,$E55*$I55,0)","v":0},null,{"$f":"IF(SUM(CL$49:CL$51)>0,$E55*$I55,0)","v":0},null,{"$f":"IF(SUM(CN$49:CN$51)>0,$E55*$I55,0)","v":0},null,{"$f":"IF(SUM(CP$49:CP$51)>0,$E55*$I55,0)","v":0},null,{"$f":"IF(SUM(CR$49:CR$51)>0,$E55*$I55,0)","v":0},null,{"$f":"IF(SUM(CT$49:CT$51)>0,$E55*$I55,0)","v":0},null,{"$f":"IF(SUM(CV$49:CV$51)>0,$E55*$I55,0)","v":0},null,{"$f":"IF(SUM(CX$49:CX$51)>0,$E55*$I55,0)","v":0},null,{"$f":"IF(SUM(CZ$49:CZ$51)>0,$E55*$I55,0)","v":0},null,{"$f":"IF(SUM(DB$49:DB$51)>0,$E55*$I55,0)","v":0},null,{"$f":"IF(SUM(DD$49:DD$51)>0,$E55*$I55,0)","v":0},null,{"$f":"IF(SUM(DF$49:DF$51)>0,$E55*$I55,0)","v":0},null,{"$f":"IF(SUM(DH$49:DH$51)>0,$E55*$I55,0)","v":0},null,{"$f":"IF(SUM(DJ$49:DJ$51)>0,$E55*$I55,0)","v":0},null,{"$f":"IF(SUM(DL$49:DL$51)>0,$E55*$I55,0)","v":0},null,{"$f":"IF(SUM(DN$49:DN$51)>0,$E55*$I55,0)","v":0},null,{"$f":"IF(SUM(DP$49:DP$51)>0,$E55*$I55,0)","v":0},null,{"$f":"IF(SUM(DR$49:DR$51)>0,$E55*$I55,0)","v":0},null,{"$f":"IF(SUM(DT$49:DT$51)>0,$E55*$I55,0)","v":0},null,{"$f":"IF(SUM(DV$49:DV$51)>0,$E55*$I55,0)","v":0},null,{"$f":"IF(SUM(DX$49:DX$51)>0,$E55*$I55,0)","v":0},null,{"$f":"IF(SUM(DZ$49:DZ$51)>0,$E55*$I55,0)","v":0}]
[null,null,8,null,{"$f":"E55","v":4},null,{"$f":"G55","v":{"$error":"#N/A"}},{"$error":"#N/A"},null,null,null,null,0,null,0,null,0,null,0,null,0,null,0,null,0,null,0,null,0,null,0,null,0,null,0,null,0,null,0,null,0,null,0,null,0,null,0,null,0,null,0,null,0,null,0,null,0,null,0,null,0,null,0,null,0,null,0,null,0,null,0,null,0,null,0,null,0,null,0,null,0,null,0,null,0,null,0,null,0,null,0,null,0,null,0,null,0,null,0,null,0,null,0,null,0,null,0,null,0,null,0,null,0,null,0,null,0,null,0,null,0,null,0,null,0,null,0,null,0,null,0]
[null,null,9,null,{"$f":"E56","v":4},null,{"$f":"G56","v":{"$error":"#N/A"}},{"$error":"#N/A"},null,null,null,null,0,null,0,null,0,null,0,null,0,null,0,null,0,null,0,null,0,null,0,null,0,null,0,null,0,null,0,null,0,null,0,null,0,null,0,null,0,null,0,null,0,null,0,null,0,null,0,null,0,null,0,null,0,null,0,null,0,null,0,null,0,null,0,null,0,null,0,null,0,null,0,null,0,null,0,null,0,null,0,null,0,null,0,null,0,null,0,null,0,null,0,null,0,null,0,null,0,null,0,null,0,null,0,null,0,null,0,null,0,null,0,null,0,null,0,null,0,null,0]
[null,null,10,null,4,null,{"$error":"#N/A"},{"$error":"#N/A"},null,null,null,null,0,null,0,null,0,null,0,null,0,null,0,null,0,null,0,null,0,null,0,null,0,null,0,null,0,null,0,null,0,null,0,null,0,null,0,null,0,null,0,null,0,null,0,null,0,null,0,null,0,null,0,null,0,null,0,null,0,null,0,null,0,null,0,null,0,null,0,null,0,null,0,null,0,null,0,null,0,null,0,null,0,null,0,null,0,null,0,null,0,null,0,null,0,null,0,null,0,null,0,null,0,null,0,null,0,null,0,null,0,null,0,null,0,null,0,null,0,null,0]
[null,null,11,null,4,null,{"$error":"#N/A"},{"$error":"#N/A"},null,null,null,null,0,null,0,null,0,null,0,null,0,null,0,null,0,null,0,null,0,null,0,null,0,null,0,null,0,null,0,null,0,null,0,null,0,null,0,null,0,null,0,null,0,null,0,null,0,null,0,null,0,null,0,null,0,null,0,null,0,null,0,null,0,null,0,null,0,null,0,null,0,null,0,null,0,null,0,null,0,null,0,null,0,null,0,null,0,null,0,null,0,null,0,null,0,null,0,null,0,null,0,null,0,null,0,null,0,null,0,null,0,null,0,null,0,null,0,null,0,null,0]
[null,null,12,null,4,null,{"$error":"#N/A"},{"$error":"#N/A"},null,null,null,null,0,null,0,null,0,null,0,null,0,null,0,null,0,null,0,null,0,null,0,null,0,null,0,null,0,null,0,null,0,null,0,null,0,null,0,null,0,null,0,null,0,null,0,null,0,null,0,null,0,null,0,null,0,null,0,null,0,null,0,null,0,null,0,null,0,null,0,null,0,null,0,null,0,null,0,null,0,null,0,null,0,null,0,null,0,null,0,null,0,null,0,null,0,null,0,null,0,null,0,null,0,null,0,null,0,null,0,null,0,null,0,null,0,null,0,null,0,null,0]
[null,null,null,null,null,null,null,null,null,null,null,null,0,null,0,null,0,null,0,null,0,null,0,null,0,null,0,null,0,null,0,null,0,null,0,null,0,null,0,null,0,null,0,null,0,null,0,null,0,null,0,null,0,null,0,null,0,null,0,null,0,null,0,null,0,null,0,null,0,null,0,null,0,null,0,null,0,null,0,null,0,null,0,null,0,null,0,null,0,null,0,null,0,null,0,null,0,null,0,null,0,null,0,null,0,null,0,null,0,null,0,null,0,null,0,null,0,null,0,null,0,null,0,null,0,null,0,null,0,null,0]
[null,null,"CATEGORIAS",null,null,null,null,null,"QUANTIDADE"]
[null,null,null,null,null,null,null,null,null,null,null,{"$f":"IF($C63=L$4,1,0)","v":0},null,{"$f":"IF($C63=N$4,1,0)","v":0},null,{"$f":"IF($C63=P$4,1,0)","v":0},null,{"$f":"IF($C63=R$4,1,0)","v":0},null,{"$f":"IF($C63=T$4,1,0)","v":0},null,{"$f":"IF($C63=V$4,1,0)","v":0},null,{"$f":"IF($C63=X$4,1,0)","v":0},null,{"$f":"IF($C63=Z$4,1,0)","v":0},null,{"$f":"IF($C63=AB$4,1,0)","v":0},null,{"$f":"IF($C63=AD$4,1,0)","v":0},null,0,null,0,null,0,null,0,null,0,null,0,null,0,null,0,null,0,null,0,null,0,null,0,null,0,null,0,null,0,null,0,null,0,null,0,null,0,null,0,null,0,null,0,null,0,null,0,null,0,null,0,null,0,null,0,null,0,null,0,null,0,null,{"$f":"IF($C63=CP$4,1,0)","v":0},null,0,null,0,null,0,null,0,null,0,null,0,null,0,null,0,null,0,null,0,null,0,null,0,null,0,null,0,null,0,null,0,null,0,null,0]
[null,null,null,{"$f":"HLOOKUP($C64,'Dados Gerais'!$D$5:$BK$10,6)","v":{"$error":"#N/A"}},null,null,null,null,{"$f":"HLOOKUP($C64,'Dados Gerais'!$D$5:$BK$14,10)","v":{"$error":"#N/A"}},null,null,{"$f":"IF($C64=L$4,1,0)","v":0},null,0,null,0,null,0,null,0,null,0,null,0,null,0,null,0,null,0,null,0,null,0,null,0,null,0,null,0,null,0,null,0,null,0,null,0,null,0,null,0,null,0,null,0,null,0,null,0,null,0,null,0,null,0,null,0,null,0,null,0,null,0,null,0,null,0,null,0,null,0,null,0,null,0,null,0,null,0,null,0,null,0,null,0,null,0,null,0,null,0,null,0,null,0,null,0,null,0,null,0,null,0,null,0,null,0,null,0,null,0,null,0,null,0,null,0,null,0]
[null,null,null,{"$f":"HLOOKUP($C65,'Dados Gerais'!$D$5:$BK$10,6)","v":{"$error":"#N/A"}},null,null,null,null,{"$f":"HLOOKUP($C65,'Dados Gerais'!$D$5:$BK$14,10)","v":{"$error":"#N/A"}},null,null,0,null,0,null,0,null,{"$f":"IF($C65=R$4,1,0)","v":0},null,0,null,0,null,0,null,0,null,0,null,0,null,0,null,0,null,0,null,0,null,0,null,0,null,0,null,0,null,0,null,0,null,0,null,0,null,0,null,0,null,0,null,0,null,0,null,0,null,0,null,0,null,0,null,0,null,0,null,0,null,0,null,0,null,0,null,0,null,0,null,0,null,0,null,0,null,0,null,0,null,0,null,0,null,0,null,0,null,0,null,0,null,0,null,0,null,0,null,0,null,0,null,0,null,0,null,0,null,0,null,0]
[null,null,null,null,null,null,null,null,null,null,null,{"$f":"IF($C66=L$4,1,0)","v":0},null,{"$f":"IF($C66=N$4,1,0)","v":0},null,{"$f":"IF($C66=P$4,1,0)","v":0},null,0,null,0,null,0,null,0,null,0,null,0,null,0,null,{"$f":"IF($C66=AF$4,1,0)","v":0},null,0,null,0,null,0,null,0,null,0,null,0,null,0,null,0,null,0,null,0,null,0,null,0,null,0,null,0,null,0,null,0,null,0,null,0,null,0,null,0,null,0,null,0,null,0,null,0,null,0,null,0,null,0,null,0,null,0,null,0,null,0,null,0,null,0,null,0,null,0,null,0,null,0,null,0,null,0,null,0,null,0,null,0,null,0,null,0,null,0,null,0,null,0,null,0,null,0]
[]
[null,null,"ITEM","DESCRIÇÃO","QUANT ANUAL\nPOR POSTO",null,"Nº DE POSTOS","QUANT ANUAL\nTOTAL","VALOR"]
[null,null,null,null,null,null,null,null,null,null,null,null,{"$f":"IF(SUM(L$27:L$32)>0,$E69*$I69,0)","v":0},null,{"$f":"IF(SUM(N$27:N$32)>0,$E69*$I69,0)","v":0},null,{"$f":"IF(SUM(P$27:P$32)>0,$E69*$I69,0)","v":0},null,{"$f":"IF(SUM(R$27:R$32)>0,$E69*$I69,0)","v":0},null,{"$f":"IF(SUM(T$27:T$32)>0,$E69*$I69,0)","v":0},null,{"$f":"IF(SUM(V$27:V$32)>0,$E69*$I69,0)","v":0},null,{"$f":"IF(SUM(X$27:X$32)>0,$E69*$I69,0)","v":0},null,{"$f":"IF(SUM(Z$27:Z$32)>0,$E69*$I69,0)","v":0},null,{"$f":"IF(SUM(AB$27:AB$32)>0,$E69*$I69,0)","v":0},null,{"$f":"IF(SUM(AD$27:AD$32)>0,$E69*$I69,0)","v":0},null,{"$f":"IF(SUM(AF$27:AF$32)>0,$E69*$I69,0)","v":0},null,{"$f":"IF(SUM(AH$27:AH$32)>0,$E69*$I69,0)","v":0},null,{"$f":"IF(SUM(AJ$27:AJ$32)>0,$E69*$I69,0)","v":0},null,{"$f":"IF(SUM(AL$27:AL$32)>0,$E69*$I69,0)","v":0},null,{"$f":"IF(SUM(AN$27:AN$32)>0,$E69*$I69,0)","v":0},null,{"$f":"IF(SUM(AP$27:AP$32)>0,$E69*$I69,0)","v":0},null,{"$f":"IF(SUM(AR$27:AR$32)>0,$E69*$I69,0)","v":0},null,{"$f":"IF(SUM(AT$27:AT$32)>0,$E69*$I69,0)","v":0},null,{"$f":"IF(SUM(AV$27:AV$32)>0,$E69*$I69,0)","v":0},null,{"$f":"IF(SUM(AX$27:AX$32)>0,$E69*$I69,0)","v":0},null,{"$f":"IF(SUM(AZ$27:AZ$32)>0,$E69*$I69,0)","v":0},null,{"$f":"IF(SUM(BB$27:BB$32)>0,$E69*$I69,0)","v":0},null,{"$f":"IF(SUM(BD$27:BD$32)>0,$E69*$I69,0)","v":0},null,{"$f":"IF(SUM(BF$27:BF$32)>0,$E69*$I69,0)","v":0},null,{"$f":"IF(SUM(BH$27:BH$32)>0,$E69*$I69,0)","v":0},null,{"$f":"IF(SUM(BJ$27:BJ$32)>0,$E69*$I69,0)","v":0},null,{"$f":"IF(SUM(BL$27:BL$32)>0,$E69*$I69,0)","v":0},null,{"$f":"IF(SUM(BN$27:BN$32)>0,$E69*$I69,0)","v":0},null,{"$f":"IF(SUM(BP$27:BP$32)>0,$E69*$I69,0)","v":0},null,{"$f":"IF(SUM(BR$27:BR$32)>0,$E69*$I69,0)","v":0},null,{"$f":"IF(SUM(BT$27:BT$32)>0,$E69*$I69,0)","v":0},null,{"$f":"IF(SUM(BV$27:BV$32)>0,$E69*$I69,0)","v":0},null,{"$f":"IF(SUM(BX$27:BX$32)>0,$E69*$I69,0)","v":0},null,{"$f":"IF(SUM(BZ$27:BZ$32)>0,$E69*$I69,0)","v":0},null,{"$f":"IF(SUM(CB$27:CB$32)>0,$E69*$I69,0)","v":0},null,{"$f":"IF(SUM(CD$27:CD$32)>0,$E69*$I69,0)","v":0},null,{"$f":"IF(SUM(CF$27:CF$32)>0,$E69*$I69,0)","v":0},null,{"$f":"IF(SUM(CH$27:CH$32)>0,$E69*$I69,0)","v":0},null,{"$f":"IF(SUM(CJ$27:CJ$32)>0,$E69*$I69,0)","v":0},null,{"$f":"IF(SUM(CL$27:CL$32)>0,$E69*$I69,0)","v":0},null,{"$f":"IF(SUM(CN$27:CN$32)>0,$E69*$I69,0)","v":0},null,{"$f":"IF(SUM(CP$27:CP$32)>0,$E69*$I69,0)","v":0},null,{"$f":"IF(SUM(CR$27:CR$32)>0,$E69*$I69,0)","v":0},null,{"$f":"IF(SUM(CT$27:CT$32)>0,$E69*$I69,0)","v":0},null,{"$f":"IF(SUM(CV$27:CV$32)>0,$E69*$I69,0)","v":0},null,{"$f":"IF(SUM(CX$27:CX$32)>0,$E69*$I69,0)","v":0},null,{"$f":"IF(SUM(CZ$27:CZ$32)>0,$E69*$I69,0)","v":0},null,{"$f":"IF(SUM(DB$27:DB$32)>0,$E69*$I69,0)","v":0},null,{"$f":"IF(SUM(DD$27:DD$32)>0,$E69*$I69,0)","v":0},null,{"$f":"IF(SUM(DF$27:DF$32)>0,$E69*$I69,0)","v":0},null,{"$f":"IF(SUM(DH$27:DH$32)>0,$E69*$I69,0)","v":0},null,{"$f":"IF(SUM(DJ$27:DJ$32)>0,$E69*$I69,0)","v":0},null,{"$f":"IF(SUM(DL$27:DL$32)>0,$E69*$I69,0)","v":0},null,{"$f":"IF(SUM(DN$27:DN$32)>0,$E69*$I69,0)","v":0},null,{"$f":"IF(SUM(DP$27:DP$32)>0,$E69*$I69,0)","v":0},null,{"$f":"IF(SUM(DR$27:DR$32)>0,$E69*$I69,0)","v":0},null,{"$f":"IF(SUM(DT$27:DT$32)>0,$E69*$I69,0)","v":0},null,{"$f":"IF(SUM(DV$27:DV$32)>0,$E69*$I69,0)","v":0},null,{"$f":"IF(SUM(DX$27:DX$32)>0,$E69*$I69,0)","v":0},null,{"$f":"IF(SUM(DZ$27:DZ$32)>0,$E69*$I69,0)","v":0}]
[null,null,13,null,4,null,{"$f":"I64+I65","v":{"$error":"#N/A"}},{"$f":"G70*E70","v":{"$error":"#N/A"}},null,null,null,null,{"$f":"IF(SUM(L$63:L$66)>0,$E70*$I70,0)","v":0},null,{"$f":"IF(SUM(N$63:N$66)>0,$E70*$I70,0)","v":0},null,{"$f":"IF(SUM(P$63:P$66)>0,$E70*$I70,0)","v":0},null,{"$f":"IF(SUM(R$63:R$66)>0,$E70*$I70,0)","v":0},null,{"$f":"IF(SUM(T$63:T$66)>0,$E70*$I70,0)","v":0},null,{"$f":"IF(SUM(V$63:V$66)>0,$E70*$I70,0)","v":0},null,{"$f":"IF(SUM(X$63:X$66)>0,$E70*$I70,0)","v":0},null,{"$f":"IF(SUM(Z$63:Z$66)>0,$E70*$I70,0)","v":0},null,{"$f":"IF(SUM(AB$63:AB$66)>0,$E70*$I70,0)","v":0},null,{"$f":"IF(SUM(AD$63:AD$66)>0,$E70*$I70,0)","v":0},null,{"$f":"IF(SUM(AF$63:AF$66)>0,$E70*$I70,0)","v":0},null,{"$f":"IF(SUM(AH$63:AH$66)>0,$E70*$I70,0)","v":0},null,{"$f":"IF(SUM(AJ$63:AJ$66)>0,$E70*$I70,0)","v":0},null,{"$f":"IF(SUM(AL$63:AL$66)>0,$E70*$I70,0)","v":0},null,{"$f":"IF(SUM(AN$63:AN$66)>0,$E70*$I70,0)","v":0},null,{"$f":"IF(SUM(AP$63:AP$66)>0,$E70*$I70,0)","v":0},null,{"$f":"IF(SUM(AR$63:AR$66)>0,$E70*$I70,0)","v":0},null,{"$f":"IF(SUM(AT$63:AT$66)>0,$E70*$I70,0)","v":0},null,{"$f":"IF(SUM(AV$63:AV$66)>0,$E70*$I70,0)","v":0},null,{"$f":"IF(SUM(AX$63:AX$66)>0,$E70*$I70,0)","v":0},null,{"$f":"IF(SUM(AZ$63:AZ$66)>0,$E70*$I70,0)","v":0},null,{"$f":"IF(SUM(BB$63:BB$66)>0,$E70*$I70,0)","v":0},null,{"$f":"IF(SUM(BD$63:BD$66)>0,$E70*$I70,0)","v":0},null,{"$f":"IF(SUM(BF$63:BF$66)>0,$E70*$I70,0)","v":0},null,{"$f":"IF(SUM(BH$63:BH$66)>0,$E70*$I70,0)","v":0},null,{"$f":"IF(SUM(BJ$63:BJ$66)>0,$E70*$I70,0)","v":0},null,{"$f":"IF(SUM(BL$63:BL$66)>0,$E70*$I70,0)","v":0},null,{"$f":"IF(SUM(BN$63:BN$66)>0,$E70*$I70,0)","v":0},null,{"$f":"IF(SUM(BP$63:BP$66)>0,$E70*$I70,0)","v":0},null,{"$f":"IF(SUM(BR$63:BR$66)>0,$E70*$I70,0)","v":0},null,{"$f":"IF(SUM(BT$63:BT$66)>0,$E70*$I70,0)","v":0},null,{"$f":"IF(SUM(BV$63:BV$66)>0,$E70*$I70,0)","v":0},null,{"$f":"IF(SUM(BX$63:BX$66)>0,$E70*$I70,0)","v":0},null,{"$f":"IF(SUM(BZ$63:BZ$66)>0,$E70*$I70,0)","v":0},null,{"$f":"IF(SUM(CB$63:CB$66)>0,$E70*$I70,0)","v":0},null,{"$f":"IF(SUM(CD$63:CD$66)>0,$E70*$I70,0)","v":0},null,{"$f":"IF(SUM(CF$63:CF$66)>0,$E70*$I70,0)","v":0},null,{"$f":"IF(SUM(CH$63:CH$66)>0,$E70*$I70,0)","v":0},null,{"$f":"IF(SUM(CJ$63:CJ$66)>0,$E70*$I70,0)","v":0},null,{"$f":"IF(SUM(CL$63:CL$66)>0,$E70*$I70,0)","v":0},null,{"$f":"IF(SUM(CN$63:CN$66)>0,$E70*$I70,0)","v":0},null,{"$f":"IF(SUM(CP$63:CP$66)>0,$E70*$I70,0)","v":0},null,{"$f":"IF(SUM(CR$63:CR$66)>0,$E70*$I70,0)","v":0},null,{"$f":"IF(SUM(CT$63:CT$66)>0,$E70*$I70,0)","v":0},null,{"$f":"IF(SUM(CV$63:CV$66)>0,$E70*$I70,0)","v":0},null,{"$f":"IF(SUM(CX$63:CX$66)>0,$E70*$I70,0)","v":0},null,{"$f":"IF(SUM(CZ$63:CZ$66)>0,$E70*$I70,0)","v":0},null,{"$f":"IF(SUM(DB$63:DB$66)>0,$E70*$I70,0)","v":0},null,{"$f":"IF(SUM(DD$63:DD$66)>0,$E70*$I70,0)","v":0},null,{"$f":"IF(SUM(DF$63:DF$66)>0,$E70*$I70,0)","v":0},null,{"$f":"IF(SUM(DH$63:DH$66)>0,$E70*$I70,0)","v":0},null,{"$f":"IF(SUM(DJ$63:DJ$66)>0,$E70*$I70,0)","v":0},null,{"$f":"IF(SUM(DL$63:DL$66)>0,$E70*$I70,0)","v":0},null,{"$f":"IF(SUM(DN$63:DN$66)>0,$E70*$I70,0)","v":0},null,{"$f":"IF(SUM(DP$63:DP$66)>0,$E70*$I70,0)","v":0},null,{"$f":"IF(SUM(DR$63:DR$66)>0,$E70*$I70,0)","v":0},null,{"$f":"IF(SUM(DT$63:DT$66)>0,$E70*$I70,0)","v":0},null,{"$f":"IF(SUM(DV$63:DV$66)>0,$E70*$I70,0)","v":0},null,{"$f":"IF(SUM(DX$63:DX$66)>0,$E70*$I70,0)","v":0},null,{"$f":"IF(SUM(DZ$63:DZ$66)>0,$E70*$I70,0)","v":0}]
[null,null,14,null,{"$f":"E70","v":4},null,{"$f":"G70","v":{"$error":"#N/A"}},{"$error":"#N/A"},null,null,null,null,{"$f":"IF(SUM(L$63:L$66)>0,$E71*$I71,0)","v":0},null,{"$f":"IF(SUM(N$63:N$66)>0,$E71*$I71,0)","v":0},null,{"$f":"IF(SUM(P$63:P$66)>0,$E71*$I71,0)","v":0},null,{"$f":"IF(SUM(R$63:R$66)>0,$E71*$I71,0)","v":0},null,{"$f":"IF(SUM(T$63:T$66)>0,$E71*$I71,0)","v":0},null,{"$f":"IF(SUM(V$63:V$66)>0,$E71*$I71,0)","v":0},null,{"$f":"IF(SUM(X$63:X$66)>0,$E71*$I71,0)","v":0},null,{"$f":"IF(SUM(Z$63:Z$66)>0,$E71*$I71,0)","v":0},null,{"$f":"IF(SUM(AB$63:AB$66)>0,$E71*$I71,0)","v":0},null,{"$f":"IF(SUM(AD$63:AD$66)>0,$E71*$I71,0)","v":0},null,0,null,0,null,0,null,0,null,0,null,0,null,0,null,0,null,0,null,0,null,0,null,0,null,0,null,0,null,0,null,0,null,0,null,0,null,0,null,0,null,0,null,0,null,0,null,0,null,0,null,0,null,0,null,0,null,0,null,0,null,0,null,0,null,0,null,0,null,0,null,0,null,0,null,0,null,0,null,0,null,0,null,0,null,0,null,0,null,0,null,0,null,0,null,0,null,0,null,0]
[null,null,15,null,4,null,{"$error":"#N/A"},{"$error":"#N/A"},null,null,null,null,{"$f":"IF(SUM(L$63:L$66)>0,$E72*$I72,0)","v":0},null,{"$f":"IF(SUM(N$63:N$66)>0,$E72*$I72,0)","v":0},null,{"$f":"IF(SUM(P$63:P$66)>0,$E72*$I72,0)","v":0},null,{"$f":"IF(SUM(R$63:R$66)>0,$E72*$I72,0)","v":0},null,{"$f":"IF(SUM(T$63:T$66)>0,$E72*$I72,0)","v":0},null,{"$f":"IF(SUM(V$63:V$66)>0,$E72*$I72,0)","v":0},null,{"$f":"IF(SUM(X$63:X$66)>0,$E72*$I72,0)","v":0},null,{"$f":"IF(SUM(Z$63:Z$66)>0,$E72*$I72,0)","v":0},null,{"$f":"IF(SUM(AB$63:AB$66)>0,$E72*$I72,0)","v":0},null,{"$f":"IF(SUM(AD$63:AD$66)>0,$E72*$I72,0)","v":0},null,0,null,0,null,0,null,0,null,0,null,0,null,0,null,0,null,0,null,0,null,0,null,0,null,0,null,0,null,0,null,0,null,0,null,0,null,0,null,0,null,0,null,0,null,0,null,0,null,0,null,0,null,0,null,0,null,0,null,0,null,0,null,0,null,0,null,0,null,0,null,0,null,0,null,0,null,0,null,0,null,0,null,0,null,0,null,0,null,0,null,0,null,0,null,0,null,0,null,0]
[]
[]
[]
[null,null,null,null,null,{"$f":"20/53","v":0.37735849056603776},null,null,{"$f":"SUM(I36:I44)*SUM(H36+H41)/52/2","v":1613.6596153846151}]

{"sheet":"EPI","index":13,"n_rows":45,"n_cols":129,"rows_kept":45,"cut":false,"hidden":false,"merged":[[2,1,2,3],[3,1,3,6]]}
[]
[]
[]
[null,"EQUIPAMENTOS DE PROTEÇÃO INDIVIDUAL - AQUISIÇÃO",null,null,null,null,null,null,null,1,null,{"$f":"J4+1","v":2},null,{"$f":"L4+1","v":3},null,{"$f":"N4+1","v":4},null,{"$f":"P4+1","v":5},null,{"$f":"R4+1","v":6},null,{"$f":"T4+1","v":7},null,{"$f":"V4+1","v":8},null,{"$f":"X4+1","v":9},null,{"$f":"Z4+1","v":10},null,{"$f":"AB4+1","v":11},null,{"$f":"AD4+1","v":12},null,{"$f":"AF4+1","v":13},null,{"$f":"AH4+1","v":14},null,{"$f":"AJ4+1","v":15},null,{"$f":"AL4+1","v":16},null,{"$f":"AN4+1","v":17},null,{"$f":"AP4+1","v":18},null,{"$f":"AR4+1","v":19},null,{"$f":"AT4+1","v":20},null,{"$f":"AV4+1","v":21},null,{"$f":"AX4+1","v":22},null,{"$f":"AZ4+1","v":23},null,{"$f":"BB4+1","v":24},null,{"$f":"BD4+1","v":25},null,{"$f":"BF4+1","v":26},null,{"$f":"BH4+1","v":27},null,{"$f":"BJ4+1","v":28},null,{"$f":"BL4+1","v":29},null,{"$f":"BN4+1","v":30},null,{"$f":"BP4+1","v":31},null,{"$f":"BR4+1","v":32},null,{"$f":"BT4+1","v":33},null,{"$f":"BV4+1","v":34},null,{"$f":"BX4+1","v":35},null,{"$f":"BZ4+1","v":36},null,{"$f":"CB4+1","v":37},null,{"$f":"CD4+1","v":38},null,{"$f":"CF4+1","v":39},null,{"$f":"CH4+1","v":40},null,{"$f":"CJ4+1","v":41},null,{"$f":"CL4+1","v":42},null,{"$f":"CN4+1","v":43},null,{"$f":"CP4+1","v":44},null,{"$f":"CR4+1","v":45},null,{"$f":"CT4+1","v":46},null,{"$f":"CV4+1","v":47},null,{"$f":"CX4+1","v":48},null,{"$f":"CZ4+1","v":49},null,{"$f":"DB4+1","v":50},null,{"$f":"DD4+1","v":51},null,{"$f":"DF4+1","v":52},null,{"$f":"DH4+1","v":53},null,{"$f":"DJ4+1","v":54},null,{"$f":"DL4+1","v":55},null,{"$f":"DN4+1","v":56},null,{"$f":"DP4+1","v":57},null,{"$f":"DR4+1","v":58},null,{"$f":"DT4+1","v":59},null,{"$f":"DV4+1","v":60}]
[]
[null,null,null,null,null,null,null,null,null,{"$f":"ROUND(SUM(K5:K82),2)","v":0},null,{"$f":"ROUND(SUM(M5:M82),2)","v":983},null,{"$f":"ROUND(SUM(O5:O82),2)","v":983},null,{"$f":"ROUND(SUM(Q5:Q82),2)","v":983},null,{"$f":"ROUND(SUM(S5:S82),2)","v":983},null,{"$f":"ROUND(SUM(U5:U82),2)","v":0},null,{"$f":"ROUND(SUM(W5:W82),2)","v":0},null,{"$f":"ROUND(SUM(Y5:Y82),2)","v":0},null,{"$f":"ROUND(SUM(AA5:AA82),2)","v":0},null,{"$f":"ROUND(SUM(AC5:AC82),2)","v":0},null,{"$f":"ROUND(SUM(AE5:AE82),2)","v":0},null,{"$f":"ROUND(SUM(AG5:AG82),2)","v":0},null,{"$f":"ROUND(SUM(AI5:AI82),2)","v":0},null,{"$f":"ROUND(SUM(AK5:AK82),2)","v":0},null,{"$f":"ROUND(SUM(AM5:AM82),2)","v":0},null,{"$f":"ROUND(SUM(AO5:AO82),2)","v":0},null,{"$f":"ROUND(SUM(AQ5:AQ82),2)","v":0},null,{"$f":"ROUND(SUM(AS5:AS82),2)","v":0},null,{"$f":"ROUND(SUM(AU5:AU82),2)","v":0},null,{"$f":"ROUND(SUM(AW5:AW82),2)","v":0},null,{"$f":"ROUND(SUM(AY5:AY82),2)","v":0},null,{"$f":"ROUND(SUM(BA5:BA82),2)","v":0},null,{"$f":"ROUND(SUM(BC5:BC82),2)","v":0},null,{"$f":"ROUND(SUM(BE5:BE82),2)","v":0},null,{"$f":"ROUND(SUM(BG5:BG82),2)","v":0},null,{"$f":"ROUND(SUM(BI5:BI82),2)","v":0},null,{"$f":"ROUND(SUM(BK5:BK82),2)","v":0},null,{"$f":"ROUND(SUM(BM5:BM82),2)","v":0},null,{"$f":"ROUND(SUM(BO5:BO82),2)","v":0},null,{"$f":"ROUND(SUM(BQ5:BQ82),2)","v":0},null,{"$f":"ROUND(SUM(BS5:BS82),2)","v":0},null,{"$f":"ROUND(SUM(BU5:BU82),2)","v":0},null,{"$f":"ROUND(SUM(BW5:BW82),2)","v":0},null,{"$f":"ROUND(SUM(BY5:BY82),2)","v":0},null,{"$f":"ROUND(SUM(CA5:CA82),2)","v":0},null,{"$f":"ROUND(SUM(CC5:CC82),2)","v":0},null,{"$f":"ROUND(SUM(CE5:CE82),2)","v":0},null,{"$f":"ROUND(SUM(CG5:CG82),2)","v":0},null,{"$f":"ROUND(SUM(CI5:CI82),2)","v":0},null,{"$f":"ROUND(SUM(CK5:CK82),2)","v":0},null,{"$f":"ROUND(SUM(CM5:CM82),2)","v":0},null,{"$f":"ROUND(SUM(CO5:CO82),2)","v":0},null,{"$f":"ROUND(SUM(CQ5:CQ82),2)","v":0},null,{"$f":"ROUND(SUM(CS5:CS82),2)","v":0},null,{"$f":"ROUND(SUM(CU5:CU82),2)","v":0},null,{"$f":"ROUND(SUM(CW5:CW82),2)","v":0},null,{"$f":"ROUND(SUM(CY5:CY82),2)","v":0},null,{"$f":"ROUND(SUM(DA5:DA82),2)","v":0},null,{"$f":"ROUND(SUM(DC5:DC82),2)","v":0},null,{"$f":"ROUND(SUM(DE5:DE82),2)","v":0},null,{"$f":"ROUND(SUM(DG5:DG82),2)","v":0},null,{"$f":"ROUND(SUM(DI5:DI82),2)","v":0},null,{"$f":"ROUND(SUM(DK5:DK82),2)","v":0},null,{"$f":"ROUND(SUM(DM5:DM82),2)","v":0},null,{"$f":"ROUND(SUM(DO5:DO82),2)","v":0},null,{"$f":"ROUND(SUM(DQ5:DQ82),2)","v":0},null,{"$f":"ROUND(SUM(DS5:DS82),2)","v":0},null,{"$f":"ROUND(SUM(DU5:DU82),2)","v":0},null,{"$f":"ROUND(SUM(DW5:DW82),2)","v":0},null,{"$f":"ROUND(SUM(DY5:DY82),2)","v":0}]
[null,null,"CATEGORIAS",null,null,null,"QUANTIDADE"]
[null,null,null,null,null,null,null,null,null,{"$f":"IF($C8=J$4,1,0)","v":0},null,{"$f":"IF($C8=L$4,1,0)","v":0},null,{"$f":"IF($C8=N$4,1,0)","v":0},null,{"$f":"IF($C8=P$4,1,0)","v":0},null,{"$f":"IF($C8=R$4,1,0)","v":0},null,{"$f":"IF($C8=T$4,1,0)","v":0},null,{"$f":"IF($C8=V$4,1,0)","v":0},null,{"$f":"IF($C8=X$4,1,0)","v":0},null,{"$f":"IF($C8=Z$4,1,0)","v":0},null,{"$f":"IF($C8=AB$4,1,0)","v":0},null,{"$f":"IF($C8=AD$4,1,0)","v":0},null,{"$f":"IF($C8=AF$4,1,0)","v":0},null,{"$f":"IF($C8=AH$4,1,0)","v":0},null,{"$f":"IF($C8=AJ$4,1,0)","v":0},null,{"$f":"IF($C8=AL$4,1,0)","v":0},null,{"$f":"IF($C8=AN$4,1,0)","v":0},null,{"$f":"IF($C8=AP$4,1,0)","v":0},null,{"$f":"IF($C8=AR$4,1,0)","v":0},null,{"$f":"IF($C8=AT$4,1,0)","v":0},null,{"$f":"IF($C8=AV$4,1,0)","v":0},null,{"$f":"IF($C8=AX$4,1,0)","v":0},null,{"$f":"IF($C8=AZ$4,1,0)","v":0},null,{"$f":"IF($C8=BB$4,1,0)","v":0},null,{"$f":"IF($C8=BD$4,1,0)","v":0},null,{"$f":"IF($C8=BF$4,1,0)","v":0},null,{"$f":"IF($C8=BH$4,1,0)","v":0},null,{"$f":"IF($C8=BJ$4,1,0)","v":0},null,{"$f":"IF($C8=BL$4,1,0)","v":0},null,{"$f":"IF($C8=BN$4,1,0)","v":0},null,{"$f":"IF($C8=BP$4,1,0)","v":0},null,{"$f":"IF($C8=BR$4,1,0)","v":0},null,{"$f":"IF($C8=BT$4,1,0)","v":0},null,{"$f":"IF($C8=BV$4,1,0)","v":0},null,{"$f":"IF($C8=BX$4,1,0)","v":0},null,{"$f":"IF($C8=BZ$4,1,0)","v":0},null,{"$f":"IF($C8=CB$4,1,0)","v":0},null,{"$f":"IF($C8=CD$4,1,0)","v":0},null,{"$f":"IF($C8=CF$4,1,0)","v":0},null,{"$f":"IF($C8=CH$4,1,0)","v":0},null,{"$f":"IF($C8=CJ$4,1,0)","v":0},null,{"$f":"IF($C8=CL$4,1,0)","v":0},null,{"$f":"IF($C8=CN$4,1,0)","v":0},null,{"$f":"IF($C8=CP$4,1,0)","v":0},null,{"$f":"IF($C8=CR$4,1,0)","v":0},null,{"$f":"IF($C8=CT$4,1,0)","v":0},null,{"$f":"IF($C8=CV$4,1,0)","v":0},null,{"$f":"IF($C8=CX$4,1,0)","v":0},null,{"$f":"IF($C8=CZ$4,1,0)","v":0},null,{"$f":"IF($C8=DB$4,1,0)","v":0},null,{"$f":"IF($C8=DD$4,1,0)","v":0},null,{"$f":"IF($C8=DF$4,1,0)","v":0},null,{"$f":"IF($C8=DH$4,1,0)","v":0},null,{"$f":"IF($C8=DJ$4,1,0)","v":0},null,{"$f":"IF($C8=DL$4,1,0)","v":0},null,{"$f":"IF($C8=DN$4,1,0)","v":0},null,{"$f":"IF($C8=DP$4,1,0)","v":0},null,{"$f":"IF($C8=DR$4,1,0)","v":0},null,{"$f":"IF($C8=DT$4,1,0)","v":0},null,{"$f":"IF($C8=DV$4,1,0)","v":0},null,{"$f":"IF($C8=DX$4,1,0)","v":0}]
[null,null,2,{"$f":"HLOOKUP($C9,'Dados Gerais'!$D$5:$BK$10,6)","v":"BOMBEIRO CIVIL LÍDER DIURNO"},null,null,{"$f":"HLOOKUP($C9,'Dados Gerais'!$D$5:$BK$14,10)","v":2},null,null,{"$f":"IF($C9=J$4,1,0)","v":0},null,1,null,0,null,0,null,0,null,0,null,0,null,0,null,0,null,0,null,0,null,0,null,0,null,0,null,0,null,0,null,0,null,0,null,0,null,0,null,0,null,0,null,0,null,0,null,0,null,0,null,0,null,0,null,0,null,0,null,0,null,0,null,0,null,0,null,0,null,0,null,0,null,0,null,0,null,0,null,0,null,0,null,0,null,0,null,0,null,0,null,0,null,0,null,0,null,0,null,0,null,0,null,0,null,0,null,0,null,0,null,0,null,0,null,0,null,0]
[null,null,3,{"$f":"HLOOKUP($C10,'Dados Gerais'!$D$5:$BK$10,6)","v":"BOMBEIRO CIVIL LÍDER NOTURNO"},null,null,{"$f":"HLOOKUP($C10,'Dados Gerais'!$D$5:$BK$14,10)","v":2},null,null,{"$f":"IF($C10=J$4,1,0)","v":0},null,0,null,1,null,0,null,0,null,0,null,0,null,0,null,0,null,0,null,0,null,0,null,0,null,0,null,0,null,0,null,0,null,0,null,0,null,0,null,0,null,0,null,0,null,0,null,0,null,0,null,0,null,0,null,0,null,0,null,0,null,0,null,0,null,0,null,0,null,0,null,0,null,0,null,0,null,0,null,0,null,0,null,0,null,0,null,0,null,0,null,0,null,0,null,0,null,0,null,0,null,0,null,0,null,0,null,0,null,0,null,0,null,0,null,0,null,0]
[null,null,null,null,null,null,null,null,null,{"$f":"IF($C11=J$4,1,0)","v":0},null,0,null,0,null,0,null,0,null,0,null,0,null,0,null,0,null,0,null,0,null,0,null,0,null,0,null,0,null,0,null,0,null,0,null,0,null,0,null,0,null,0,null,0,null,0,null,0,null,0,null,0,null,0,null,0,null,0,null,0,null,0,null,0,null,0,null,0,null,0,null,0,null,0,null,0,null,0,null,0,null,0,null,0,null,0,null,0,null,0,null,0,null,0,null,0,null,0,null,0,null,0,null,0,null,0,null,0,null,0,null,0,null,0,null,0,null,0]
[]
[null,null,"ITEM","DESCRIÇÃO","QUANT ANUAL POR POSTO","UNIDADE","VALOR"]
[]
[null,null,1,"Capa de chuva confeccionada em tecido de náilon emborrachado, com uma face em poliamida e a outra em PVC, emendas através de costuras impermeabilizadas, fechamento frontal, com capuz fixo ajustado por cadarços com regulador e ponteiras em PVC, punhos ajustados com elástico, com faicha reflexiva de elevado brilho, com a logomarca da brigada de incêncio da Câmara dos Deputados.   ",1,"UND",42.245000000000005,null,null,null,{"$f":"IF(SUM(J$8:J$11)>0,$E15*$G15,0)","v":0},null,{"$f":"IF(SUM(L$8:L$11)>0,$E15*$G15,0)","v":42.245000000000005},null,{"$f":"IF(SUM(N$8:N$11)>0,$E15*$G15,0)","v":42.245000000000005},null,{"$f":"IF(SUM(P$8:P$11)>0,$E15*$G15,0)","v":0},null,{"$f":"IF(SUM(R$8:R$11)>0,$E15*$G15,0)","v":0},null,{"$f":"IF(SUM(T$8:T$11)>0,$E15*$G15,0)","v":0},null,{"$f":"IF(SUM(V$8:V$11)>0,$E15*$G15,0)","v":0},null,{"$f":"IF(SUM(X$8:X$11)>0,$E15*$G15,0)","v":0},null,{"$f":"IF(SUM(Z$8:Z$11)>0,$E15*$G15,0)","v":0},null,{"$f":"IF(SUM(AB$8:AB$11)>0,$E15*$G15,0)","v":0},null,{"$f":"IF(SUM(AD$8:AD$11)>0,$E15*$G15,0)","v":0},null,{"$f":"IF(SUM(AF$8:AF$11)>0,$E15*$G15,0)","v":0},null,{"$f":"IF(SUM(AH$8:AH$11)>0,$E15*$G15,0)","v":0},null,{"$f":"IF(SUM(AJ$8:AJ$11)>0,$E15*$G15,0)","v":0},null,{"$f":"IF(SUM(AL$8:AL$11)>0,$E15*$G15,0)","v":0},null,{"$f":"IF(SUM(AN$8:AN$11)>0,$E15*$G15,0)","v":0},null,{"$f":"IF(SUM(AP$8:AP$11)>0,$E15*$G15,0)","v":0},null,{"$f":"IF(SUM(AR$8:AR$11)>0,$E15*$G15,0)","v":0},null,{"$f":"IF(SUM(AT$8:AT$11)>0,$E15*$G15,0)","v":0},null,{"$f":"IF(SUM(AV$8:AV$11)>0,$E15*$G15,0)","v":0},null,{"$f":"IF(SUM(AX$8:AX$11)>0,$E15*$G15,0)","v":0},null,{"$f":"IF(SUM(AZ$8:AZ$11)>0,$E15*$G15,0)","v":0},null,{"$f":"IF(SUM(BB$8:BB$11)>0,$E15*$G15,0)","v":0},null,{"$f":"IF(SUM(BD$8:BD$11)>0,$E15*$G15,0)","v":0},null,{"$f":"IF(SUM(BF$8:BF$11)>0,$E15*$G15,0)","v":0},null,{"$f":"IF(SUM(BH$8:BH$11)>0,$E15*$G15,0)","v":0},null,{"$f":"IF(SUM(BJ$8:BJ$11)>0,$E15*$G15,0)","v":0},null,{"$f":"IF(SUM(BL$8:BL$11)>0,$E15*$G15,0)","v":0},null,{"$f":"IF(SUM(BN$8:BN$11)>0,$E15*$G15,0)","v":0},null,{"$f":"IF(SUM(BP$8:BP$11)>0,$E15*$G15,0)","v":0},null,{"$f":"IF(SUM(BR$8:BR$11)>0,$E15*$G15,0)","v":0},null,{"$f":"IF(SUM(BT$8:BT$11)>0,$E15*$G15,0)","v":0},null,{"$f":"IF(SUM(BV$8:BV$11)>0,$E15*$G15,0)","v":0},null,{"$f":"IF(SUM(BX$8:BX$11)>0,$E15*$G15,0)","v":0},null,{"$f":"IF(SUM(BZ$8:BZ$11)>0,$E15*$G15,0)","v":0},null,{"$f":"IF(SUM(CB$8:CB$11)>0,$E15*$G15,0)","v":0},null,{"$f":"IF(SUM(CD$8:CD$11)>0,$E15*$G15,0)","v":0},null,{"$f":"IF(SUM(CF$8:CF$11)>0,$E15*$G15,0)","v":0},null,{"$f":"IF(SUM(CH$8:CH$11)>0,$E15*$G15,0)","v":0},null,{"$f":"IF(SUM(CJ$8:CJ$11)>0,$E15*$G15,0)","v":0},null,{"$f":"IF(SUM(CL$8:CL$11)>0,$E15*$G15,0)","v":0},null,{"$f":"IF(SUM(CN$8:CN$11)>0,$E15*$G15,0)","v":0},null,{"$f":"IF(SUM(CP$8:CP$11)>0,$E15*$G15,0)","v":0},null,{"$f":"IF(SUM(CR$8:CR$11)>0,$E15*$G15,0)","v":0},null,{"$f":"IF(SUM(CT$8:CT$11)>0,$E15*$G15,0)","v":0},null,{"$f":"IF(SUM(CV$8:CV$11)>0,$E15*$G15,0)","v":0},null,{"$f":"IF(SUM(CX$8:CX$11)>0,$E15*$G15,0)","v":0},null,{"$f":"IF(SUM(CZ$8:CZ$11)>0,$E15*$G15,0)","v":0},null,{"$f":"IF(SUM(DB$8:DB$11)>0,$E15*$G15,0)","v":0},null,{"$f":"IF(SUM(DD$8:DD$11)>0,$E15*$G15,0)","v":0},null,{"$f":"IF(SUM(DF$8:DF$11)>0,$E15*$G15,0)","v":0},null,{"$f":"IF(SUM(DH$8:DH$11)>0,$E15*$G15,0)","v":0},null,{"$f":"IF(SUM(DJ$8:DJ$11)>0,$E15*$G15,0)","v":0},null,{"$f":"IF(SUM(DL$8:DL$11)>0,$E15*$G15,0)","v":0},null,{"$f":"IF(SUM(DN$8:DN$11)>0,$E15*$G15,0)","v":0},null,{"$f":"IF(SUM(DP$8:DP$11)>0,$E15*$G15,0)","v":0},null,{"$f":"IF(SUM(DR$8:DR$11)>0,$E15*$G15,0)","v":0},null,{"$f":"IF(SUM(DT$8:DT$11)>0,$E15*$G15,0)","v":0},null,{"$f":"IF(SUM(DV$8:DV$11)>0,$E15*$G15,0)","v":0},null,{"$f":"IF(SUM(DX$8:DX$11)>0,$E15*$G15,0)","v":0}]
[null,null,2,"Protetor auricular tipo plug em silicone, lavável com proteção de 18 dB(A) de atenuação pelo método NRRsf. Marca 3M ou similar.",2,"UND",1.95,null,null,null,0,null,3.9,null,3.9,null,0,null,0,null,0,null,0,null,0,null,0,null,0,null,0,null,0,null,0,null,0,null,0,null,0,null,0,null,0,null,0,null,0,null,0,null,0,null,0,null,0,null,0,null,0,null,0,null,0,null,0,null,0,null,0,null,0,null,0,null,0,null,0,null,0,null,0,null,0,null,0,null,0,null,0,null,0,null,0,null,0,null,0,null,0,null,0,null,0,null,0,null,0,null,0,null,0,null,0,null,0,null,0,null,0,null,0,null,0,null,0,null,{"$f":"IF(SUM(DX$8:DX$11)>0,$E16*$G16,0)","v":0}]
[null,null,3,"Luvas de segurança confeccionada com vaqueta, com formato de cinco dedos, com reforço na palma e entre o polegar e o indicador, cano curto (10 cm). Marca de ref. Giovanni B. S. Bonatto",2,"PAR",21.414999999999999,null,null,null,0,null,42.83,null,42.83,null,0,null,0,null,0,null,0,null,0,null,0,null,0,null,0,null,0,null,0,null,0,null,0,null,0,null,0,null,0,null,0,null,0,null,0,null,0,null,0,null,0,null,0,null,0,null,0,null,0,null,0,null,0,null,0,null,0,null,0,null,0,null,0,null,0,null,0,null,0,null,0,null,0,null,0,null,0,null,0,null,0,null,0,null,0,null,0,null,0,null,0,null,0,null,0,null,0,null,0,null,0,null,0,null,0,null,0,null,0,null,0,null,0]
[null,null,4,"Luva de malha pigmentada, tricotada em 4 fios de algodão e poliéster, com pigmentos em PVC antiderrapante na palma e face dos dedos, e punho com elástico, na cor branca. Marca Vonder ou similar.",2,"PAR",2.2400000000000002,null,null,null,0,null,4.4800000000000004,null,4.4800000000000004,null,0,null,0,null,0,null,0,null,0,null,0,null,0,null,0,null,0,null,0,null,0,null,0,null,0,null,0,null,0,null,0,null,0,null,0,null,0,null,0,null,0,null,0,null,0,null,0,null,0,null,0,null,0,null,0,null,0,null,0,null,0,null,0,null,0,null,0,null,0,null,0,null,0,null,0,null,0,null,0,null,0,null,0,null,0,null,0,null,0,null,0,null,0,null,0,null,0,null,0,null,0,null,0,null,0,null,0,null,0,null,0,null,{"$f":"IF(SUM(DX$8:DX$11)>0,$E18*$G18,0)","v":0}]
[null,null,5,"Óculos ampla visão, em Acrílico. a serem utilizados em procedimentos que possam gerar respingos de material orgânico e atingir a conjuntiva ocular. Devem ter anteparo em borracha na borda superior, lateral e inferior. Ajuste por meio de tirante elastico. Marca Danny (modelo SILO S8/2 ) ou similar.",2,"UND",40,null,null,null,0,null,80,null,80,null,0,null,0,null,0,null,0,null,0,null,0,null,0,null,0,null,0,null,0,null,0,null,0,null,0,null,0,null,0,null,0,null,0,null,0,null,0,null,0,null,0,null,0,null,0,null,0,null,0,null,0,null,0,null,0,null,0,null,0,null,0,null,0,null,0,null,0,null,0,null,0,null,0,null,0,null,0,null,0,null,0,null,0,null,0,null,0,null,0,null,0,null,0,null,0,null,0,null,0,null,0,null,0,null,0,null,0,null,0,null,0,null,0]
[null,null,6,"JOELHEIRA, na cor Preta, confeccionada em tecido resistente na parte externa, e interior em malha respirável, possui couraça em TPU com rebites metálicos na cor do produto; ajuste maleável triplo, clip de engate rápido, acolchoamento por placa de EVA e etiqueta de identificação. Ref. INVICTUS, modelo  Protec",1,"PAR",259,null,null,null,0,null,{"$f":"IF(SUM(L$8:L$11)>0,$E20*$G20,0)","v":259},null,{"$f":"IF(SUM(N$8:N$11)>0,$E20*$G20,0)","v":259},null,{"$f":"IF(SUM(P$8:P$11)>0,$E20*$G20,0)","v":0},null,{"$f":"IF(SUM(R$8:R$11)>0,$E20*$G20,0)","v":0},null,{"$f":"IF(SUM(T$8:T$11)>0,$E20*$G20,0)","v":0},null,{"$f":"IF(SUM(V$8:V$11)>0,$E20*$G20,0)","v":0},null,{"$f":"IF(SUM(X$8:X$11)>0,$E20*$G20,0)","v":0},null,{"$f":"IF(SUM(Z$8:Z$11)>0,$E20*$G20,0)","v":0},null,{"$f":"IF(SUM(AB$8:AB$11)>0,$E20*$G20,0)","v":0},null,{"$f":"IF(SUM(AD$8:AD$11)>0,$E20*$G20,0)","v":0},null,{"$f":"IF(SUM(AF$8:AF$11)>0,$E20*$G20,0)","v":0},null,{"$f":"IF(SUM(AH$8:AH$11)>0,$E20*$G20,0)","v":0},null,{"$f":"IF(SUM(AJ$8:AJ$11)>0,$E20*$G20,0)","v":0},null,{"$f":"IF(SUM(AL$8:AL$11)>0,$E20*$G20,0)","v":0},null,{"$f":"IF(SUM(AN$8:AN$11)>0,$E20*$G20,0)","v":0},null,{"$f":"IF(SUM(AP$8:AP$11)>0,$E20*$G20,0)","v":0},null,{"$f":"IF(SUM(AR$8:AR$11)>0,$E20*$G20,0)","v":0},null,{"$f":"IF(SUM(AT$8:AT$11)>0,$E20*$G20,0)","v":0},null,{"$f":"IF(SUM(AV$8:AV$11)>0,$E20*$G20,0)","v":0},null,{"$f":"IF(SUM(AX$8:AX$11)>0,$E20*$G20,0)","v":0},null,{"$f":"IF(SUM(AZ$8:AZ$11)>0,$E20*$G20,0)","v":0},null,{"$f":"IF(SUM(BB$8:BB$11)>0,$E20*$G20,0)","v":0},null,{"$f":"IF(SUM(BD$8:BD$11)>0,$E20*$G20,0)","v":0},null,{"$f":"IF(SUM(BF$8:BF$11)>0,$E20*$G20,0)","v":0},null,{"$f":"IF(SUM(BH$8:BH$11)>0,$E20*$G20,0)","v":0},null,{"$f":"IF(SUM(BJ$8:BJ$11)>0,$E20*$G20,0)","v":0},null,{"$f":"IF(SUM(BL$8:BL$11)>0,$E20*$G20,0)","v":0},null,{"$f":"IF(SUM(BN$8:BN$11)>0,$E20*$G20,0)","v":0},null,{"$f":"IF(SUM(BP$8:BP$11)>0,$E20*$G20,0)","v":0},null,{"$f":"IF(SUM(BR$8:BR$11)>0,$E20*$G20,0)","v":0},null,{"$f":"IF(SUM(BT$8:BT$11)>0,$E20*$G20,0)","v":0},null,{"$f":"IF(SUM(BV$8:BV$11)>0,$E20*$G20,0)","v":0},null,{"$f":"IF(SUM(BX$8:BX$11)>0,$E20*$G20,0)","v":0},null,{"$f":"IF(SUM(BZ$8:BZ$11)>0,$E20*$G20,0)","v":0},null,{"$f":"IF(SUM(CB$8:CB$11)>0,$E20*$G20,0)","v":0},null,{"$f":"IF(SUM(CD$8:CD$11)>0,$E20*$G20,0)","v":0},null,{"$f":"IF(SUM(CF$8:CF$11)>0,$E20*$G20,0)","v":0},null,{"$f":"IF(SUM(CH$8:CH$11)>0,$E20*$G20,0)","v":0},null,{"$f":"IF(SUM(CJ$8:CJ$11)>0,$E20*$G20,0)","v":0},null,{"$f":"IF(SUM(CL$8:CL$11)>0,$E20*$G20,0)","v":0},null,{"$f":"IF(SUM(CN$8:CN$11)>0,$E20*$G20,0)","v":0},null,{"$f":"IF(SUM(CP$8:CP$11)>0,$E20*$G20,0)","v":0},null,{"$f":"IF(SUM(CR$8:CR$11)>0,$E20*$G20,0)","v":0},null,{"$f":"IF(SUM(CT$8:CT$11)>0,$E20*$G20,0)","v":0},null,{"$f":"IF(SUM(CV$8:CV$11)>0,$E20*$G20,0)","v":0},null,{"$f":"IF(SUM(CX$8:CX$11)>0,$E20*$G20,0)","v":0},null,{"$f":"IF(SUM(CZ$8:CZ$11)>0,$E20*$G20,0)","v":0},null,{"$f":"IF(SUM(DB$8:DB$11)>0,$E20*$G20,0)","v":0},null,{"$f":"IF(SUM(DD$8:DD$11)>0,$E20*$G20,0)","v":0},null,{"$f":"IF(SUM(DF$8:DF$11)>0,$E20*$G20,0)","v":0},null,{"$f":"IF(SUM(DH$8:DH$11)>0,$E20*$G20,0)","v":0},null,{"$f":"IF(SUM(DJ$8:DJ$11)>0,$E20*$G20,0)","v":0},null,{"$f":"IF(SUM(DL$8:DL$11)>0,$E20*$G20,0)","v":0},null,{"$f":"IF(SUM(DN$8:DN$11)>0,$E20*$G20,0)","v":0},null,{"$f":"IF(SUM(DP$8:DP$11)>0,$E20*$G20,0)","v":0},null,{"$f":"IF(SUM(DR$8:DR$11)>0,$E20*$G20,0)","v":0},null,{"$f":"IF(SUM(DT$8:DT$11)>0,$E20*$G20,0)","v":0},null,{"$f":"IF(SUM(DV$8:DV$11)>0,$E20*$G20,0)","v":0},null,0]
[null,null,7,"Respirador de meia peça facial, compatibilidade com filtros químicos, mecânicos ou combinados, encaixes para dois filtros/cartuchos. Diferentes opções de tamanhos para proporcionar vedação adequada aos tipos de rostos dos usuários. Ref.: 3M, modelo 6201",1,"UND",166.26499999999999,null,null,null,0,null,166.26499999999999,null,166.26499999999999,null,0,null,0,null,0,null,0,null,0,null,0,null,0,null,0,null,0,null,0,null,0,null,0,null,0,null,0,null,0,null,0,null,0,null,0,null,0,null,0,null,0,null,0,null,0,null,0,null,0,null,0,null,0,null,0,null,0,null,0,null,0,null,0,null,0,null,0,null,0,null,0,null,0,null,0,null,0,null,0,null,0,null,0,null,0,null,0,null,0,null,0,null,0,null,0,null,0,null,0,null,0,null,0,null,0,null,0,null,0,null,0,null,0]
[null,null,8,"Cartucho químico para Vapores orgânicos e gases ácidos compatível com o respirador de meia peça facial Ref. 6003 3M ",2,"PAR",98.990000000000009,null,null,null,0,null,{"$f":"IF(SUM(L$8:L$11)>0,$E22*$G22,0)","v":197.98000000000002},null,{"$f":"IF(SUM(N$8:N$11)>0,$E22*$G22,0)","v":197.98000000000002},null,{"$f":"IF(SUM(P$8:P$11)>0,$E22*$G22,0)","v":0},null,{"$f":"IF(SUM(R$8:R$11)>0,$E22*$G22,0)","v":0},null,{"$f":"IF(SUM(T$8:T$11)>0,$E22*$G22,0)","v":0},null,{"$f":"IF(SUM(V$8:V$11)>0,$E22*$G22,0)","v":0},null,{"$f":"IF(SUM(X$8:X$11)>0,$E22*$G22,0)","v":0},null,{"$f":"IF(SUM(Z$8:Z$11)>0,$E22*$G22,0)","v":0},null,{"$f":"IF(SUM(AB$8:AB$11)>0,$E22*$G22,0)","v":0},null,{"$f":"IF(SUM(AD$8:AD$11)>0,$E22*$G22,0)","v":0},null,{"$f":"IF(SUM(AF$8:AF$11)>0,$E22*$G22,0)","v":0},null,{"$f":"IF(SUM(AH$8:AH$11)>0,$E22*$G22,0)","v":0},null,{"$f":"IF(SUM(AJ$8:AJ$11)>0,$E22*$G22,0)","v":0},null,{"$f":"IF(SUM(AL$8:AL$11)>0,$E22*$G22,0)","v":0},null,{"$f":"IF(SUM(AN$8:AN$11)>0,$E22*$G22,0)","v":0},null,{"$f":"IF(SUM(AP$8:AP$11)>0,$E22*$G22,0)","v":0},null,{"$f":"IF(SUM(AR$8:AR$11)>0,$E22*$G22,0)","v":0},null,{"$f":"IF(SUM(AT$8:AT$11)>0,$E22*$G22,0)","v":0},null,{"$f":"IF(SUM(AV$8:AV$11)>0,$E22*$G22,0)","v":0},null,{"$f":"IF(SUM(AX$8:AX$11)>0,$E22*$G22,0)","v":0},null,{"$f":"IF(SUM(AZ$8:AZ$11)>0,$E22*$G22,0)","v":0},null,{"$f":"IF(SUM(BB$8:BB$11)>0,$E22*$G22,0)","v":0},null,{"$f":"IF(SUM(BD$8:BD$11)>0,$E22*$G22,0)","v":0},null,{"$f":"IF(SUM(BF$8:BF$11)>0,$E22*$G22,0)","v":0},null,{"$f":"IF(SUM(BH$8:BH$11)>0,$E22*$G22,0)","v":0},null,{"$f":"IF(SUM(BJ$8:BJ$11)>0,$E22*$G22,0)","v":0},null,{"$f":"IF(SUM(BL$8:BL$11)>0,$E22*$G22,0)","v":0},null,{"$f":"IF(SUM(BN$8:BN$11)>0,$E22*$G22,0)","v":0},null,{"$f":"IF(SUM(BP$8:BP$11)>0,$E22*$G22,0)","v":0},null,{"$f":"IF(SUM(BR$8:BR$11)>0,$E22*$G22,0)","v":0},null,{"$f":"IF(SUM(BT$8:BT$11)>0,$E22*$G22,0)","v":0},null,{"$f":"IF(SUM(BV$8:BV$11)>0,$E22*$G22,0)","v":0},null,{"$f":"IF(SUM(BX$8:BX$11)>0,$E22*$G22,0)","v":0},null,{"$f":"IF(SUM(BZ$8:BZ$11)>0,$E22*$G22,0)","v":0},null,{"$f":"IF(SUM(CB$8:CB$11)>0,$E22*$G22,0)","v":0},null,{"$f":"IF(SUM(CD$8:CD$11)>0,$E22*$G22,0)","v":0},null,{"$f":"IF(SUM(CF$8:CF$11)>0,$E22*$G22,0)","v":0},null,{"$f":"IF(SUM(CH$8:CH$11)>0,$E22*$G22,0)","v":0},null,{"$f":"IF(SUM(CJ$8:CJ$11)>0,$E22*$G22,0)","v":0},null,{"$f":"IF(SUM(CL$8:CL$11)>0,$E22*$G22,0)","v":0},null,{"$f":"IF(SUM(CN$8:CN$11)>0,$E22*$G22,0)","v":0},null,{"$f":"IF(SUM(CP$8:CP$11)>0,$E22*$G22,0)","v":0},null,{"$f":"IF(SUM(CR$8:CR$11)>0,$E22*$G22,0)","v":0},null,{"$f":"IF(SUM(CT$8:CT$11)>0,$E22*$G22,0)","v":0},null,{"$f":"IF(SUM(CV$8:CV$11)>0,$E22*$G22,0)","v":0},null,{"$f":"IF(SUM(CX$8:CX$11)>0,$E22*$G22,0)","v":0},null,{"$f":"IF(SUM(CZ$8:CZ$11)>0,$E22*$G22,0)","v":0},null,{"$f":"IF(SUM(DB$8:DB$11)>0,$E22*$G22,0)","v":0},null,{"$f":"IF(SUM(DD$8:DD$11)>0,$E22*$G22,0)","v":0},null,{"$f":"IF(SUM(DF$8:DF$11)>0,$E22*$G22,0)","v":0},null,{"$f":"IF(SUM(DH$8:DH$11)>0,$E22*$G22,0)","v":0},null,{"$f":"IF(SUM(DJ$8:DJ$11)>0,$E22*$G22,0)","v":0},null,{"$f":"IF(SUM(DL$8:DL$11)>0,$E22*$G22,0)","v":0},null,{"$f":"IF(SUM(DN$8:DN$11)>0,$E22*$G22,0)","v":0},null,{"$f":"IF(SUM(DP$8:DP$11)>0,$E22*$G22,0)","v":0},null,{"$f":"IF(SUM(DR$8:DR$11)>0,$E22*$G22,0)","v":0},null,{"$f":"IF(SUM(DT$8:DT$11)>0,$E22*$G22,0)","v":0},null,{"$f":"IF(SUM(DV$8:DV$11)>0,$E22*$G22,0)","v":0},null,0]
[null,null,9,"Filtro mecânico para poeiras, névoas e fumos. a ser utilizado de forma combinada com o cartucho. Compatível com o respirador de meia peça facial a ser adquirido. Ref: 5N11 3M",2,"UND",50.995000000000005,null,null,null,0,null,101.99000000000001,null,101.99000000000001,null,0,null,0,null,0,null,0,null,0,null,0,null,0,null,0,null,0,null,0,null,0,null,0,null,0,null,0,null,0,null,0,null,0,null,0,null,0,null,0,null,0,null,0,null,0,null,0,null,0,null,0,null,0,null,0,null,0,null,0,null,0,null,0,null,0,null,0,null,0,null,0,null,0,null,0,null,0,null,0,null,0,null,0,null,0,null,0,null,0,null,0,null,0,null,0,null,0,null,0,null,0,null,0,null,0,null,0,null,0,null,0,null,{"$f":"IF(SUM(DX$8:DX$11)>0,$E23*$G23,0)","v":0}]
[null,null,10,"Retentor para filtro. Compatível com o respirador de meia peça facial a ser adquirido. Ref.: 3M 501",2,"UND",10.685,null,null,null,0,null,21.37,null,21.37,null,0,null,0,null,0,null,0,null,0,null,0,null,0,null,0,null,0,null,0,null,0,null,0,null,0,null,0,null,0,null,0,null,0,null,0,null,0,null,0,null,0,null,0,null,0,null,0,null,0,null,0,null,0,null,0,null,0,null,0,null,0,null,0,null,0,null,0,null,0,null,0,null,0,null,0,null,0,null,0,null,0,null,0,null,0,null,0,null,0,null,0,null,0,null,0,null,0,null,0,null,0,null,0,null,0,null,0,null,0,null,0,null,{"$f":"IF(SUM(DX$8:DX$11)>0,$E24*$G24,0)","v":0}]
[null,null,11,"CAPACETE DE SEGURANÇA com carneira e jugular do tipo III (sem aba); com casco rígido; sem porosidade; não deverá ser condutor de corrente elétrica; na cor vermelha. Ref.:  Ultra Safe",1,"UND",62.94,null,null,null,0,null,{"$f":"IF(SUM(L$8:L$11)>0,$E25*$G25,0)","v":62.94},null,{"$f":"IF(SUM(N$8:N$11)>0,$E25*$G25,0)","v":62.94},null,{"$f":"IF(SUM(P$8:P$11)>0,$E25*$G25,0)","v":0},null,{"$f":"IF(SUM(R$8:R$11)>0,$E25*$G25,0)","v":0},null,{"$f":"IF(SUM(T$8:T$11)>0,$E25*$G25,0)","v":0},null,{"$f":"IF(SUM(V$8:V$11)>0,$E25*$G25,0)","v":0},null,{"$f":"IF(SUM(X$8:X$11)>0,$E25*$G25,0)","v":0},null,{"$f":"IF(SUM(Z$8:Z$11)>0,$E25*$G25,0)","v":0},null,{"$f":"IF(SUM(AB$8:AB$11)>0,$E25*$G25,0)","v":0},null,{"$f":"IF(SUM(AD$8:AD$11)>0,$E25*$G25,0)","v":0},null,{"$f":"IF(SUM(AF$8:AF$11)>0,$E25*$G25,0)","v":0},null,{"$f":"IF(SUM(AH$8:AH$11)>0,$E25*$G25,0)","v":0},null,{"$f":"IF(SUM(AJ$8:AJ$11)>0,$E25*$G25,0)","v":0},null,{"$f":"IF(SUM(AL$8:AL$11)>0,$E25*$G25,0)","v":0},null,{"$f":"IF(SUM(AN$8:AN$11)>0,$E25*$G25,0)","v":0},null,{"$f":"IF(SUM(AP$8:AP$11)>0,$E25*$G25,0)","v":0},null,{"$f":"IF(SUM(AR$8:AR$11)>0,$E25*$G25,0)","v":0},null,{"$f":"IF(SUM(AT$8:AT$11)>0,$E25*$G25,0)","v":0},null,{"$f":"IF(SUM(AV$8:AV$11)>0,$E25*$G25,0)","v":0},null,{"$f":"IF(SUM(AX$8:AX$11)>0,$E25*$G25,0)","v":0},null,{"$f":"IF(SUM(AZ$8:AZ$11)>0,$E25*$G25,0)","v":0},null,{"$f":"IF(SUM(BB$8:BB$11)>0,$E25*$G25,0)","v":0},null,{"$f":"IF(SUM(BD$8:BD$11)>0,$E25*$G25,0)","v":0},null,{"$f":"IF(SUM(BF$8:BF$11)>0,$E25*$G25,0)","v":0},null,{"$f":"IF(SUM(BH$8:BH$11)>0,$E25*$G25,0)","v":0},null,{"$f":"IF(SUM(BJ$8:BJ$11)>0,$E25*$G25,0)","v":0},null,{"$f":"IF(SUM(BL$8:BL$11)>0,$E25*$G25,0)","v":0},null,{"$f":"IF(SUM(BN$8:BN$11)>0,$E25*$G25,0)","v":0},null,{"$f":"IF(SUM(BP$8:BP$11)>0,$E25*$G25,0)","v":0},null,{"$f":"IF(SUM(BR$8:BR$11)>0,$E25*$G25,0)","v":0},null,{"$f":"IF(SUM(BT$8:BT$11)>0,$E25*$G25,0)","v":0},null,{"$f":"IF(SUM(BV$8:BV$11)>0,$E25*$G25,0)","v":0},null,{"$f":"IF(SUM(BX$8:BX$11)>0,$E25*$G25,0)","v":0},null,{"$f":"IF(SUM(BZ$8:BZ$11)>0,$E25*$G25,0)","v":0},null,{"$f":"IF(SUM(CB$8:CB$11)>0,$E25*$G25,0)","v":0},null,{"$f":"IF(SUM(CD$8:CD$11)>0,$E25*$G25,0)","v":0},null,{"$f":"IF(SUM(CF$8:CF$11)>0,$E25*$G25,0)","v":0},null,{"$f":"IF(SUM(CH$8:CH$11)>0,$E25*$G25,0)","v":0},null,{"$f":"IF(SUM(CJ$8:CJ$11)>0,$E25*$G25,0)","v":0},null,{"$f":"IF(SUM(CL$8:CL$11)>0,$E25*$G25,0)","v":0},null,{"$f":"IF(SUM(CN$8:CN$11)>0,$E25*$G25,0)","v":0},null,{"$f":"IF(SUM(CP$8:CP$11)>0,$E25*$G25,0)","v":0},null,{"$f":"IF(SUM(CR$8:CR$11)>0,$E25*$G25,0)","v":0},null,{"$f":"IF(SUM(CT$8:CT$11)>0,$E25*$G25,0)","v":0},null,{"$f":"IF(SUM(CV$8:CV$11)>0,$E25*$G25,0)","v":0},null,{"$f":"IF(SUM(CX$8:CX$11)>0,$E25*$G25,0)","v":0},null,{"$f":"IF(SUM(CZ$8:CZ$11)>0,$E25*$G25,0)","v":0},null,{"$f":"IF(SUM(DB$8:DB$11)>0,$E25*$G25,0)","v":0},null,{"$f":"IF(SUM(DD$8:DD$11)>0,$E25*$G25,0)","v":0},null,{"$f":"IF(SUM(DF$8:DF$11)>0,$E25*$G25,0)","v":0},null,{"$f":"IF(SUM(DH$8:DH$11)>0,$E25*$G25,0)","v":0},null,{"$f":"IF(SUM(DJ$8:DJ$11)>0,$E25*$G25,0)","v":0},null,{"$f":"IF(SUM(DL$8:DL$11)>0,$E25*$G25,0)","v":0},null,{"$f":"IF(SUM(DN$8:DN$11)>0,$E25*$G25,0)","v":0},null,{"$f":"IF(SUM(DP$8:DP$11)>0,$E25*$G25,0)","v":0},null,{"$f":"IF(SUM(DR$8:DR$11)>0,$E25*$G25,0)","v":0},null,{"$f":"IF(SUM(DT$8:DT$11)>0,$E25*$G25,0)","v":0},null,{"$f":"IF(SUM(DV$8:DV$11)>0,$E25*$G25,0)","v":0},null,0]
[]
[null,null,"CATEGORIAS",null,null,null,"QUANTIDADE"]
[null,null,null,null,null,null,null,null,null,{"$f":"IF($C28=J$4,1,0)","v":0},null,{"$f":"IF($C28=L$4,1,0)","v":0},null,{"$f":"IF($C28=N$4,1,0)","v":0},null,{"$f":"IF($C28=P$4,1,0)","v":0},null,{"$f":"IF($C28=R$4,1,0)","v":0},null,{"$f":"IF($C28=T$4,1,0)","v":0},null,{"$f":"IF($C28=V$4,1,0)","v":0},null,{"$f":"IF($C28=X$4,1,0)","v":0},null,{"$f":"IF($C28=Z$4,1,0)","v":0},null,{"$f":"IF($C28=AB$4,1,0)","v":0},null,{"$f":"IF($C28=AD$4,1,0)","v":0},null,{"$f":"IF($C28=AF$4,1,0)","v":0},null,{"$f":"IF($C28=AH$4,1,0)","v":0},null,{"$f":"IF($C28=AJ$4,1,0)","v":0},null,{"$f":"IF($C28=AL$4,1,0)","v":0},null,{"$f":"IF($C28=AN$4,1,0)","v":0},null,{"$f":"IF($C28=AP$4,1,0)","v":0},null,{"$f":"IF($C28=AR$4,1,0)","v":0},null,{"$f":"IF($C28=AT$4,1,0)","v":0},null,{"$f":"IF($C28=AV$4,1,0)","v":0},null,{"$f":"IF($C28=AX$4,1,0)","v":0},null,{"$f":"IF($C28=AZ$4,1,0)","v":0},null,{"$f":"IF($C28=BB$4,1,0)","v":0},null,{"$f":"IF($C28=BD$4,1,0)","v":0},null,{"$f":"IF($C28=BF$4,1,0)","v":0},null,{"$f":"IF($C28=BH$4,1,0)","v":0},null,{"$f":"IF($C28=BJ$4,1,0)","v":0},null,{"$f":"IF($C28=BL$4,1,0)","v":0},null,{"$f":"IF($C28=BN$4,1,0)","v":0},null,{"$f":"IF($C28=BP$4,1,0)","v":0},null,{"$f":"IF($C28=BR$4,1,0)","v":0},null,{"$f":"IF($C28=BT$4,1,0)","v":0},null,{"$f":"IF($C28=BV$4,1,0)","v":0},null,{"$f":"IF($C28=BX$4,1,0)","v":0},null,{"$f":"IF($C28=BZ$4,1,0)","v":0},null,{"$f":"IF($C28=CB$4,1,0)","v":0},null,{"$f":"IF($C28=CD$4,1,0)","v":0},null,{"$f":"IF($C28=CF$4,1,0)","v":0},null,{"$f":"IF($C28=CH$4,1,0)","v":0},null,{"$f":"IF($C28=CJ$4,1,0)","v":0},null,{"$f":"IF($C28=CL$4,1,0)","v":0},null,{"$f":"IF($C28=CN$4,1,0)","v":0},null,{"$f":"IF($C28=CP$4,1,0)","v":0},null,{"$f":"IF($C28=CR$4,1,0)","v":0},null,{"$f":"IF($C28=CT$4,1,0)","v":0},null,{"$f":"IF($C28=CV$4,1,0)","v":0},null,{"$f":"IF($C28=CX$4,1,0)","v":0},null,{"$f":"IF($C28=CZ$4,1,0)","v":0},null,{"$f":"IF($C28=DB$4,1,0)","v":0},null,{"$f":"IF($C28=DD$4,1,0)","v":0},null,{"$f":"IF($C28=DF$4,1,0)","v":0},null,{"$f":"IF($C28=DH$4,1,0)","v":0},null,{"$f":"IF($C28=DJ$4,1,0)","v":0},null,{"$f":"IF($C28=DL$4,1,0)","v":0},null,{"$f":"IF($C28=DN$4,1,0)","v":0},null,{"$f":"IF($C28=DP$4,1,0)","v":0},null,{"$f":"IF($C28=DR$4,1,0)","v":0},null,{"$f":"IF($C28=DT$4,1,0)","v":0},null,{"$f":"IF($C28=DV$4,1,0)","v":0},null,{"$f":"IF($C28=DX$4,1,0)","v":0}]
[null,null,4,{"$f":"HLOOKUP($C29,'Dados Gerais'!$D$5:$BK$10,6)","v":"BOMBEIRO CIVIL BÁSICO DIURNO"},null,null,{"$f":"HLOOKUP($C29,'Dados Gerais'!$D$5:$BK$14,10)","v":36},null,null,{"$f":"IF($C29=J$4,1,0)","v":0},null,0,null,0,null,1,null,0,null,0,null,0,null,0,null,0,null,0,null,0,null,0,null,0,null,0,null,0,null,0,null,0,null,0,null,0,null,0,null,0,null,0,null,0,null,0,null,0,null,0,null,0,null,0,null,0,null,0,null,0,null,0,null,0,null,0,null,0,null,0,null,0,null,0,null,0,null,0,null,0,null,0,null,0,null,0,null,0,null,0,null,0,null,0,null,0,null,0,null,0,null,0,null,0,null,0,null,0,null,0,null,0,null,0,null,0,null,0]
[null,null,5,{"$f":"HLOOKUP($C30,'Dados Gerais'!$D$5:$BK$10,6)","v":"BOMBEIRO CIVIL BÁSICO NOTURNO"},null,null,{"$f":"HLOOKUP($C30,'Dados Gerais'!$D$5:$BK$14,10)","v":28},null,null,{"$f":"IF($C30=J$4,1,0)","v":0},null,0,null,0,null,0,null,1,null,0,null,0,null,0,null,0,null,0,null,0,null,0,null,0,null,0,null,0,null,0,null,0,null,0,null,0,null,0,null,0,null,0,null,0,null,0,null,0,null,0,null,0,null,0,null,0,null,0,null,0,null,0,null,0,null,0,null,0,null,0,null,0,null,0,null,0,null,0,null,0,null,0,null,0,null,0,null,0,null,0,null,0,null,0,null,0,null,0,null,0,null,0,null,0,null,0,null,0,null,0,null,0,null,0,null,0,null,0]
[null,null,null,null,null,null,null,null,null,{"$f":"IF($C31=J$4,1,0)","v":0},null,0,null,0,null,0,null,0,null,0,null,0,null,0,null,0,null,0,null,0,null,0,null,0,null,0,null,0,null,0,null,0,null,0,null,0,null,0,null,0,null,0,null,0,null,0,null,0,null,0,null,0,null,0,null,0,null,0,null,0,null,0,null,0,null,0,null,0,null,0,null,0,null,0,null,0,null,0,null,0,null,0,null,0,null,0,null,0,null,0,null,0,null,0,null,0,null,0,null,0,null,0,null,0,null,0,null,0,null,0,null,0,null,0,null,0,null,0]
[]
[null,null,"ITEM","DESCRIÇÃO","QUANT ANUAL POR POSTO","UNIDADE","VALOR"]
[]
[null,null,1,"Capa de chuva confeccionada em tecido de náilon emborrachado, com uma face em poliamida e a outra em PVC, emendas através de costuras impermeabilizadas, fechamento frontal, com capuz fixo ajustado por cadarços com regulador e ponteiras em PVC, punhos ajustados com elástico, com faicha reflexiva de elevado brilho, com a logomarca da brigada de incêncio da Câmara dos Deputados.   ",1,"UND",{"$f":"G15","v":42.245000000000005},null,null,null,{"$f":"IF(SUM(J$29:J$30)>0,$E35*$G35,0)","v":0},null,{"$f":"IF(SUM(L$29:L$30)>0,$E35*$G35,0)","v":0},null,{"$f":"IF(SUM($J$29:$J$30)>0,$E35*$G35,0)","v":0},null,{"$f":"IF(SUM($P$29:$P$30)>0,$E35*$G35,0)","v":42.245000000000005},null,{"$f":"IF(SUM($P$29:$P$30)>0,$E35*$G35,0)","v":42.245000000000005},null,{"$f":"IF(SUM($J$29:$J$30)>0,$E35*$G35,0)","v":0},null,{"$f":"IF(SUM(V$29:V$30)>0,$E35*$G35,0)","v":0},null,{"$f":"IF(SUM(X$29:X$30)>0,$E35*$G35,0)","v":0},null,{"$f":"IF(SUM(Z$29:Z$30)>0,$E35*$G35,0)","v":0},null,{"$f":"IF(SUM($J$29:$J$30)>0,$E35*$G35,0)","v":0},null,{"$f":"IF(SUM($J$29:$J$30)>0,$E35*$G35,0)","v":0},null,{"$f":"IF(SUM($J$29:$J$30)>0,$E35*$G35,0)","v":0},null,{"$f":"IF(SUM($J$29:$J$30)>0,$E35*$G35,0)","v":0},null,{"$f":"IF(SUM($J$29:$J$30)>0,$E35*$G35,0)","v":0},null,{"$f":"IF(SUM($J$29:$J$30)>0,$E35*$G35,0)","v":0},null,{"$f":"IF(SUM($J$29:$J$30)>0,$E35*$G35,0)","v":0},null,{"$f":"IF(SUM($J$29:$J$30)>0,$E35*$G35,0)","v":0},null,{"$f":"IF(SUM($J$29:$J$30)>0,$E35*$G35,0)","v":0},null,{"$f":"IF(SUM($J$29:$J$30)>0,$E35*$G35,0)","v":0},null,{"$f":"IF(SUM($J$29:$J$30)>0,$E35*$G35,0)","v":0},null,{"$f":"IF(SUM($J$29:$J$30)>0,$E35*$G35,0)","v":0},null,{"$f":"IF(SUM($J$29:$J$30)>0,$E35*$G35,0)","v":0},null,{"$f":"IF(SUM($J$29:$J$30)>0,$E35*$G35,0)","v":0},null,{"$f":"IF(SUM($J$29:$J$30)>0,$E35*$G35,0)","v":0},null,{"$f":"IF(SUM($J$29:$J$30)>0,$E35*$G35,0)","v":0},null,{"$f":"IF(SUM($J$29:$J$30)>0,$E35*$G35,0)","v":0},null,{"$f":"IF(SUM($J$29:$J$30)>0,$E35*$G35,0)","v":0},null,{"$f":"IF(SUM($J$29:$J$30)>0,$E35*$G35,0)","v":0},null,{"$f":"IF(SUM($J$29:$J$30)>0,$E35*$G35,0)","v":0},null,{"$f":"IF(SUM($J$29:$J$30)>0,$E35*$G35,0)","v":0},null,{"$f":"IF(SUM($J$29:$J$30)>0,$E35*$G35,0)","v":0},null,{"$f":"IF(SUM($J$29:$J$30)>0,$E35*$G35,0)","v":0},null,{"$f":"IF(SUM($J$29:$J$30)>0,$E35*$G35,0)","v":0},null,{"$f":"IF(SUM($J$29:$J$30)>0,$E35*$G35,0)","v":0},null,{"$f":"IF(SUM($J$29:$J$30)>0,$E35*$G35,0)","v":0},null,{"$f":"IF(SUM($J$29:$J$30)>0,$E35*$G35,0)","v":0},null,{"$f":"IF(SUM($J$29:$J$30)>0,$E35*$G35,0)","v":0},null,{"$f":"IF(SUM($J$29:$J$30)>0,$E35*$G35,0)","v":0},null,{"$f":"IF(SUM($J$29:$J$30)>0,$E35*$G35,0)","v":0},null,{"$f":"IF(SUM($J$29:$J$30)>0,$E35*$G35,0)","v":0},null,{"$f":"IF(SUM($J$29:$J$30)>0,$E35*$G35,0)","v":0},null,{"$f":"IF(SUM($J$29:$J$30)>0,$E35*$G35,0)","v":0},null,{"$f":"IF(SUM($J$29:$J$30)>0,$E35*$G35,0)","v":0},null,{"$f":"IF(SUM($J$29:$J$30)>0,$E35*$G35,0)","v":0},null,{"$f":"IF(SUM($J$29:$J$30)>0,$E35*$G35,0)","v":0},null,{"$f":"IF(SUM($J$29:$J$30)>0,$E35*$G35,0)","v":0},null,{"$f":"IF(SUM($J$29:$J$30)>0,$E35*$G35,0)","v":0},null,{"$f":"IF(SUM($J$29:$J$30)>0,$E35*$G35,0)","v":0},null,{"$f":"IF(SUM($J$29:$J$30)>0,$E35*$G35,0)","v":0},null,{"$f":"IF(SUM($J$29:$J$30)>0,$E35*$G35,0)","v":0},null,{"$f":"IF(SUM($J$29:$J$30)>0,$E35*$G35,0)","v":0},null,{"$f":"IF(SUM($J$29:$J$30)>0,$E35*$G35,0)","v":0},null,{"$f":"IF(SUM($J$29:$J$30)>0,$E35*$G35,0)","v":0},null,{"$f":"IF(SUM($J$29:$J$30)>0,$E35*$G35,0)","v":0},null,{"$f":"IF(SUM($J$29:$J$30)>0,$E35*$G35,0)","v":0},null,{"$f":"IF(SUM($J$29:$J$30)>0,$E35*$G35,0)","v":0},null,{"$f":"IF(SUM($J$29:$J$30)>0,$E35*$G35,0)","v":0},null,{"$f":"IF(SUM($J$29:$J$30)>0,$E35*$G35,0)","v":0},null,{"$f":"IF(SUM($J$29:$J$30)>0,$E35*$G35,0)","v":0},null,{"$f":"IF(SUM($J$29:$J$30)>0,$E35*$G35,0)","v":0}]
[null,null,2,"Protetor auricular tipo plug em silicone, lavável com proteção de 18 dB(A) de atenuação pelo método NRRsf. Marca 3M ou similar.",2,"UND",{"$f":"G16","v":1.95},null,null,null,{"$f":"IF(SUM(J$29:J$30)>0,$E36*$G36,0)","v":0},null,{"$f":"IF(SUM(L$29:L$30)>0,$E36*$G36,0)","v":0},null,{"$f":"IF(SUM($J$29:$J$30)>0,$E36*$G36,0)","v":0},null,{"$f":"IF(SUM($P$29:$P$30)>0,$E36*$G36,0)","v":3.9},null,3.9,null,{"$f":"IF(SUM($J$29:$J$30)>0,$E36*$G36,0)","v":0},null,{"$f":"IF(SUM(V$29:V$30)>0,$E36*$G36,0)","v":0},null,{"$f":"IF(SUM(X$29:X$30)>0,$E36*$G36,0)","v":0},null,{"$f":"IF(SUM(Z$29:Z$30)>0,$E36*$G36,0)","v":0},null,{"$f":"IF(SUM($J$29:$J$30)>0,$E36*$G36,0)","v":0},null,{"$f":"IF(SUM($J$29:$J$30)>0,$E36*$G36,0)","v":0},null,{"$f":"IF(SUM($J$29:$J$30)>0,$E36*$G36,0)","v":0},null,{"$f":"IF(SUM($J$29:$J$30)>0,$E36*$G36,0)","v":0},null,{"$f":"IF(SUM($J$29:$J$30)>0,$E36*$G36,0)","v":0},null,{"$f":"IF(SUM($J$29:$J$30)>0,$E36*$G36,0)","v":0},null,{"$f":"IF(SUM($J$29:$J$30)>0,$E36*$G36,0)","v":0},null,{"$f":"IF(SUM($J$29:$J$30)>0,$E36*$G36,0)","v":0},null,{"$f":"IF(SUM($J$29:$J$30)>0,$E36*$G36,0)","v":0},null,{"$f":"IF(SUM($J$29:$J$30)>0,$E36*$G36,0)","v":0},null,{"$f":"IF(SUM($J$29:$J$30)>0,$E36*$G36,0)","v":0},null,{"$f":"IF(SUM($J$29:$J$30)>0,$E36*$G36,0)","v":0},null,{"$f":"IF(SUM($J$29:$J$30)>0,$E36*$G36,0)","v":0},null,{"$f":"IF(SUM($J$29:$J$30)>0,$E36*$G36,0)","v":0},null,{"$f":"IF(SUM($J$29:$J$30)>0,$E36*$G36,0)","v":0},null,{"$f":"IF(SUM($J$29:$J$30)>0,$E36*$G36,0)","v":0},null,{"$f":"IF(SUM($J$29:$J$30)>0,$E36*$G36,0)","v":0},null,{"$f":"IF(SUM($J$29:$J$30)>0,$E36*$G36,0)","v":0},null,{"$f":"IF(SUM($J$29:$J$30)>0,$E36*$G36,0)","v":0},null,{"$f":"IF(SUM($J$29:$J$30)>0,$E36*$G36,0)","v":0},null,{"$f":"IF(SUM($J$29:$J$30)>0,$E36*$G36,0)","v":0},null,{"$f":"IF(SUM($J$29:$J$30)>0,$E36*$G36,0)","v":0},null,{"$f":"IF(SUM($J$29:$J$30)>0,$E36*$G36,0)","v":0},null,{"$f":"IF(SUM($J$29:$J$30)>0,$E36*$G36,0)","v":0},null,{"$f":"IF(SUM($J$29:$J$30)>0,$E36*$G36,0)","v":0},null,{"$f":"IF(SUM($J$29:$J$30)>0,$E36*$G36,0)","v":0},null,{"$f":"IF(SUM($J$29:$J$30)>0,$E36*$G36,0)","v":0},null,{"$f":"IF(SUM($J$29:$J$30)>0,$E36*$G36,0)","v":0},null,{"$f":"IF(SUM($J$29:$J$30)>0,$E36*$G36,0)","v":0},null,{"$f":"IF(SUM($J$29:$J$30)>0,$E36*$G36,0)","v":0},null,{"$f":"IF(SUM($J$29:$J$30)>0,$E36*$G36,0)","v":0},null,{"$f":"IF(SUM($J$29:$J$30)>0,$E36*$G36,0)","v":0},null,{"$f":"IF(SUM($J$29:$J$30)>0,$E36*$G36,0)","v":0},null,{"$f":"IF(SUM($J$29:$J$30)>0,$E36*$G36,0)","v":0},null,{"$f":"IF(SUM($J$29:$J$30)>0,$E36*$G36,0)","v":0},null,{"$f":"IF(SUM($J$29:$J$30)>0,$E36*$G36,0)","v":0},null,{"$f":"IF(SUM($J$29:$J$30)>0,$E36*$G36,0)","v":0},null,{"$f":"IF(SUM($J$29:$J$30)>0,$E36*$G36,0)","v":0},null,{"$f":"IF(SUM($J$29:$J$30)>0,$E36*$G36,0)","v":0},null,{"$f":"IF(SUM($J$29:$J$30)>0,$E36*$G36,0)","v":0},null,{"$f":"IF(SUM($J$29:$J$30)>0,$E36*$G36,0)","v":0},null,{"$f":"IF(SUM($J$29:$J$30)>0,$E36*$G36,0)","v":0},null,{"$f":"IF(SUM($J$29:$J$30)>0,$E36*$G36,0)","v":0},null,{"$f":"IF(SUM($J$29:$J$30)>0,$E36*$G36,0)","v":0},null,{"$f":"IF(SUM($J$29:$J$30)>0,$E36*$G36,0)","v":0},null,{"$f":"IF(SUM($J$29:$J$30)>0,$E36*$G36,0)","v":0},null,{"$f":"IF(SUM($J$29:$J$30)>0,$E36*$G36,0)","v":0},null,{"$f":"IF(SUM($J$29:$J$30)>0,$E36*$G36,0)","v":0},null,{"$f":"IF(SUM($J$29:$J$30)>0,$E36*$G36,0)","v":0},null,{"$f":"IF(SUM($J$29:$J$30)>0,$E36*$G36,0)","v":0},null,{"$f":"IF(SUM($J$29:$J$30)>0,$E36*$G36,0)","v":0}]
[null,null,3,"Luvas de segurança confeccionada com vaqueta, com formato de cinco dedos, com reforço na palma e entre o polegar e o indicador, cano curto (10 cm). Marca de ref. Giovanni B. S. Bonatto",2,"PAR",21.414999999999999,null,null,null,{"$f":"IF(SUM(J$8:J$11)>0,$E37*$G37,0)","v":0},null,{"$f":"IF(SUM(L$29:L$30)>0,$E37*$G37,0)","v":0},null,{"$f":"IF(SUM($J$29:$J$30)>0,$E37*$G37,0)","v":0},null,42.83,null,42.83,null,{"$f":"IF(SUM($J$29:$J$30)>0,$E37*$G37,0)","v":0},null,{"$f":"IF(SUM(V$29:V$30)>0,$E37*$G37,0)","v":0},null,{"$f":"IF(SUM(X$8:X$11)>0,$E37*$G37,0)","v":0},null,{"$f":"IF(SUM(Z$8:Z$11)>0,$E37*$G37,0)","v":0},null,{"$f":"IF(SUM(AB$8:AB$11)>0,$E37*$G37,0)","v":0},null,{"$f":"IF(SUM(AD$8:AD$11)>0,$E37*$G37,0)","v":0},null,{"$f":"IF(SUM(AF$8:AF$11)>0,$E37*$G37,0)","v":0},null,{"$f":"IF(SUM(AH$8:AH$11)>0,$E37*$G37,0)","v":0},null,{"$f":"IF(SUM(AJ$8:AJ$11)>0,$E37*$G37,0)","v":0},null,{"$f":"IF(SUM(AL$8:AL$11)>0,$E37*$G37,0)","v":0},null,{"$f":"IF(SUM(AN$8:AN$11)>0,$E37*$G37,0)","v":0},null,{"$f":"IF(SUM(AP$8:AP$11)>0,$E37*$G37,0)","v":0},null,{"$f":"IF(SUM(AR$8:AR$11)>0,$E37*$G37,0)","v":0},null,{"$f":"IF(SUM(AT$8:AT$11)>0,$E37*$G37,0)","v":0},null,{"$f":"IF(SUM(AV$8:AV$11)>0,$E37*$G37,0)","v":0},null,{"$f":"IF(SUM(AX$8:AX$11)>0,$E37*$G37,0)","v":0},null,{"$f":"IF(SUM(AZ$8:AZ$11)>0,$E37*$G37,0)","v":0},null,{"$f":"IF(SUM(BB$8:BB$11)>0,$E37*$G37,0)","v":0},null,{"$f":"IF(SUM(BD$8:BD$11)>0,$E37*$G37,0)","v":0},null,{"$f":"IF(SUM(BF$8:BF$11)>0,$E37*$G37,0)","v":0},null,{"$f":"IF(SUM(BH$8:BH$11)>0,$E37*$G37,0)","v":0},null,{"$f":"IF(SUM(BJ$8:BJ$11)>0,$E37*$G37,0)","v":0},null,{"$f":"IF(SUM(BL$8:BL$11)>0,$E37*$G37,0)","v":0},null,{"$f":"IF(SUM(BN$8:BN$11)>0,$E37*$G37,0)","v":0},null,{"$f":"IF(SUM(BP$8:BP$11)>0,$E37*$G37,0)","v":0},null,{"$f":"IF(SUM(BR$8:BR$11)>0,$E37*$G37,0)","v":0},null,{"$f":"IF(SUM(BT$8:BT$11)>0,$E37*$G37,0)","v":0},null,{"$f":"IF(SUM(BV$8:BV$11)>0,$E37*$G37,0)","v":0},null,{"$f":"IF(SUM(BX$8:BX$11)>0,$E37*$G37,0)","v":0},null,{"$f":"IF(SUM(BZ$8:BZ$11)>0,$E37*$G37,0)","v":0},null,{"$f":"IF(SUM(CB$8:CB$11)>0,$E37*$G37,0)","v":0},null,{"$f":"IF(SUM(CD$8:CD$11)>0,$E37*$G37,0)","v":0},null,{"$f":"IF(SUM(CF$8:CF$11)>0,$E37*$G37,0)","v":0},null,{"$f":"IF(SUM(CH$8:CH$11)>0,$E37*$G37,0)","v":0},null,{"$f":"IF(SUM(CJ$8:CJ$11)>0,$E37*$G37,0)","v":0},null,{"$f":"IF(SUM(CL$8:CL$11)>0,$E37*$G37,0)","v":0},null,{"$f":"IF(SUM(CN$8:CN$11)>0,$E37*$G37,0)","v":0},null,{"$f":"IF(SUM(CP$8:CP$11)>0,$E37*$G37,0)","v":0},null,{"$f":"IF(SUM(CR$8:CR$11)>0,$E37*$G37,0)","v":0},null,{"$f":"IF(SUM(CT$8:CT$11)>0,$E37*$G37,0)","v":0},null,{"$f":"IF(SUM(CV$8:CV$11)>0,$E37*$G37,0)","v":0},null,{"$f":"IF(SUM(CX$8:CX$11)>0,$E37*$G37,0)","v":0},null,{"$f":"IF(SUM(CZ$8:CZ$11)>0,$E37*$G37,0)","v":0},null,{"$f":"IF(SUM(DB$8:DB$11)>0,$E37*$G37,0)","v":0},null,{"$f":"IF(SUM(DD$8:DD$11)>0,$E37*$G37,0)","v":0},null,{"$f":"IF(SUM(DF$8:DF$11)>0,$E37*$G37,0)","v":0},null,{"$f":"IF(SUM(DH$8:DH$11)>0,$E37*$G37,0)","v":0},null,{"$f":"IF(SUM(DJ$8:DJ$11)>0,$E37*$G37,0)","v":0},null,{"$f":"IF(SUM(DL$8:DL$11)>0,$E37*$G37,0)","v":0},null,{"$f":"IF(SUM(DN$8:DN$11)>0,$E37*$G37,0)","v":0},null,{"$f":"IF(SUM(DP$8:DP$11)>0,$E37*$G37,0)","v":0},null,{"$f":"IF(SUM(DR$8:DR$11)>0,$E37*$G37,0)","v":0},null,{"$f":"IF(SUM(DT$8:DT$11)>0,$E37*$G37,0)","v":0},null,{"$f":"IF(SUM(DV$8:DV$11)>0,$E37*$G37,0)","v":0},null,{"$f":"IF(SUM(DX$8:DX$11)>0,$E37*$G37,0)","v":0}]
[null,null,4,"Luva de malha pigmentada, tricotada em 4 fios de algodão e poliéster, com pigmentos em PVC antiderrapante na palma e face dos dedos, e punho com elástico, na cor branca. Marca Vonder ou similar.",2,"PAR",2.2400000000000002,null,null,null,0,null,0,null,0,null,4.4800000000000004,null,4.4800000000000004,null,0,null,0,null,0,null,0,null,0,null,0,null,0,null,0,null,0,null,0,null,0,null,0,null,0,null,0,null,0,null,0,null,0,null,0,null,0,null,0,null,0,null,0,null,0,null,0,null,0,null,0,null,0,null,0,null,0,null,0,null,0,null,0,null,0,null,0,null,0,null,0,null,0,null,0,null,0,null,0,null,0,null,0,null,0,null,0,null,0,null,0,null,0,null,0,null,0,null,0,null,0,null,0,null,0,null,0,null,0]
[null,null,5,"Óculos ampla visão, em Acrílico. a serem utilizados em procedimentos que possam gerar respingos de material orgânico e atingir a conjuntiva ocular. Devem ter anteparo em borracha na borda superior, lateral e inferior. Ajuste por meio de tirante elastico. Marca Danny (modelo SILO S8/2 ) ou similar.",2,"UND",40,null,null,null,0,null,0,null,0,null,80,null,80,null,0,null,0,null,0,null,0,null,0,null,0,null,0,null,0,null,0,null,0,null,0,null,0,null,0,null,0,null,0,null,0,null,0,null,0,null,0,null,0,null,0,null,0,null,0,null,0,null,0,null,0,null,0,null,0,null,0,null,0,null,0,null,0,null,0,null,0,null,0,null,0,null,0,null,0,null,0,null,0,null,0,null,0,null,0,null,0,null,0,null,0,null,0,null,0,null,0,null,0,null,0,null,0,null,0,null,0,null,0]
[null,null,6,"JOELHEIRA, na cor Preta, confeccionada em tecido resistente na parte externa, e interior em malha respirável, possui couraça em TPU com rebites metálicos na cor do produto; ajuste maleável triplo, clip de engate rápido, acolchoamento por placa de EVA e etiqueta de identificação. Ref. INVICTUS, modelo  Protec",1,"PAR",259,null,null,null,0,null,0,null,0,null,259,null,259,null,0,null,0,null,0,null,0,null,0,null,0,null,0,null,0,null,0,null,0,null,0,null,0,null,0,null,0,null,0,null,0,null,0,null,0,null,0,null,0,null,0,null,0,null,0,null,0,null,0,null,0,null,0,null,0,null,0,null,0,null,0,null,0,null,0,null,0,null,0,null,0,null,0,null,0,null,0,null,0,null,0,null,0,null,0,null,0,null,0,null,0,null,0,null,0,null,0,null,0,null,0,null,0,null,0,null,0,null,0]
[null,null,7,"Respirador de meia peça facial, compatibilidade com filtros químicos, mecânicos ou combinados, encaixes para dois filtros/cartuchos. Diferentes opções de tamanhos para proporcionar vedação adequada aos tipos de rostos dos usuários. Ref.: 3M, modelo 6201",1,"UND",166.26499999999999,null,null,null,0,null,0,null,0,null,166.26499999999999,null,166.26499999999999,null,0,null,0,null,0,null,0,null,0,null,0,null,0,null,0,null,0,null,0,null,0,null,0,null,0,null,0,null,0,null,0,null,0,null,0,null,0,null,0,null,0,null,0,null,0,null,0,null,0,null,0,null,0,null,0,null,0,null,0,null,0,null,0,null,0,null,0,null,0,null,0,null,0,null,0,null,0,null,0,null,0,null,0,null,0,null,0,null,0,null,0,null,0,null,0,null,0,null,0,null,0,null,0,null,0,null,0,null,0]
[null,null,8,"Cartucho químico para Vapores orgânicos e gases ácidos compatível com o respirador de meia peça facial Ref. 6003 3M ",2,"PAR",98.990000000000009,null,null,null,0,null,0,null,0,null,197.98000000000002,null,197.98000000000002,null,0,null,0,null,0,null,0,null,0,null,0,null,0,null,0,null,0,null,0,null,0,null,0,null,0,null,0,null,0,null,0,null,0,null,0,null,0,null,0,null,0,null,0,null,0,null,0,null,0,null,0,null,0,null,0,null,0,null,0,null,0,null,0,null,0,null,0,null,0,null,0,null,0,null,0,null,0,null,0,null,0,null,0,null,0,null,0,null,0,null,0,null,0,null,0,null,0,null,0,null,0,null,0,null,0,null,0,null,0]
[null,null,9,"Filtro mecânico para poeiras, névoas e fumos. a ser utilizado de forma combinada com o cartucho. Compatível com o respirador de meia peça facial a ser adquirido. Ref: 5N11 3M",2,"UND",50.995000000000005,null,null,null,0,null,0,null,0,null,101.99000000000001,null,101.99000000000001,null,0,null,0,null,0,null,0,null,0,null,0,null,0,null,0,null,0,null,0,null,0,null,0,null,0,null,0,null,0,null,0,null,0,null,0,null,0,null,0,null,0,null,0,null,0,null,0,null,0,null,0,null,0,null,0,null,0,null,0,null,0,null,0,null,0,null,0,null,0,null,0,null,0,null,0,null,0,null,0,null,0,null,0,null,0,null,0,null,0,null,0,null,0,null,0,null,0,null,0,null,0,null,0,null,0,null,0,null,0]
[null,null,10,"Retentor para filtro. Compatível com o respirador de meia peça facial a ser adquirido. Ref.: 3M 501",2,"UND",10.685,null,null,null,0,null,0,null,0,null,21.37,null,21.37,null,0,null,0,null,0,null,0,null,0,null,0,null,0,null,0,null,0,null,0,null,0,null,0,null,0,null,0,null,0,null,0,null,0,null,0,null,0,null,0,null,0,null,0,null,0,null,0,null,0,null,0,null,0,null,0,null,0,null,0,null,0,null,0,null,0,null,0,null,0,null,0,null,0,null,0,null,0,null,0,null,0,null,0,null,0,null,0,null,0,null,0,null,0,null,0,null,0,null,0,null,0,null,0,null,0,null,0,null,0]
[null,null,11,"CAPACETE DE SEGURANÇA com carneira e jugular do tipo III (sem aba); com casco rígido; sem porosidade; não deverá ser condutor de corrente elétrica; na cor vermelha. Ref.:  Ultra Safe",1,"UND",62.94,null,null,null,{"$f":"IF(SUM(J$29:J$30)>0,$E45*$G45,0)","v":0},null,0,null,0,null,62.94,null,62.94,null,0,null,0,null,{"$f":"IF(SUM(X$29:X$30)>0,$E45*$G45,0)","v":0},null,{"$f":"IF(SUM(Z$29:Z$30)>0,$E45*$G45,0)","v":0},null,{"$f":"IF(SUM($J$29:$J$30)>0,$E45*$G45,0)","v":0},null,{"$f":"IF(SUM($J$29:$J$30)>0,$E45*$G45,0)","v":0},null,{"$f":"IF(SUM($J$29:$J$30)>0,$E45*$G45,0)","v":0},null,{"$f":"IF(SUM($J$29:$J$30)>0,$E45*$G45,0)","v":0},null,{"$f":"IF(SUM($J$29:$J$30)>0,$E45*$G45,0)","v":0},null,{"$f":"IF(SUM($J$29:$J$30)>0,$E45*$G45,0)","v":0},null,{"$f":"IF(SUM($J$29:$J$30)>0,$E45*$G45,0)","v":0},null,{"$f":"IF(SUM($J$29:$J$30)>0,$E45*$G45,0)","v":0},null,{"$f":"IF(SUM($J$29:$J$30)>0,$E45*$G45,0)","v":0},null,{"$f":"IF(SUM($J$29:$J$30)>0,$E45*$G45,0)","v":0},null,{"$f":"IF(SUM($J$29:$J$30)>0,$E45*$G45,0)","v":0},null,{"$f":"IF(SUM($J$29:$J$30)>0,$E45*$G45,0)","v":0},null,{"$f":"IF(SUM($J$29:$J$30)>0,$E45*$G45,0)","v":0},null,{"$f":"IF(SUM($J$29:$J$30)>0,$E45*$G45,0)","v":0},null,{"$f":"IF(SUM($J$29:$J$30)>0,$E45*$G45,0)","v":0},null,{"$f":"IF(SUM($J$29:$J$30)>0,$E45*$G45,0)","v":0},null,{"$f":"IF(SUM($J$29:$J$30)>0,$E45*$G45,0)","v":0},null,{"$f":"IF(SUM($J$29:$J$30)>0,$E45*$G45,0)","v":0},null,{"$f":"IF(SUM($J$29:$J$30)>0,$E45*$G45,0)","v":0},null,{"$f":"IF(SUM($J$29:$J$30)>0,$E45*$G45,0)","v":0},null,{"$f":"IF(SUM($J$29:$J$30)>0,$E45*$G45,0)","v":0},null,{"$f":"IF(SUM($J$29:$J$30)>0,$E45*$G45,0)","v":0},null,{"$f":"IF(SUM($J$29:$J$30)>0,$E45*$G45,0)","v":0},null,{"$f":"IF(SUM($J$29:$J$30)>0,$E45*$G45,0)","v":0},null,{"$f":"IF(SUM($J$29:$J$30)>0,$E45*$G45,0)","v":0},null,{"$f":"IF(SUM($J$29:$J$30)>0,$E45*$G45,0)","v":0},null,{"$f":"IF(SUM($J$29:$J$30)>0,$E45*$G45,0)","v":0},null,{"$f":"IF(SUM($J$29:$J$30)>0,$E45*$G45,0)","v":0},null,{"$f":"IF(SUM($J$29:$J$30)>0,$E45*$G45,0)","v":0},null,{"$f":"IF(SUM($J$29:$J$30)>0,$E45*$G45,0)","v":0},null,{"$f":"IF(SUM($J$29:$J$30)>0,$E45*$G45,0)","v":0},null,{"$f":"IF(SUM($J$29:$J$30)>0,$E45*$G45,0)","v":0},null,{"$f":"IF(SUM($J$29:$J$30)>0,$E45*$G45,0)","v":0},null,{"$f":"IF(SUM($J$29:$J$30)>0,$E45*$G45,0)","v":0},null,{"$f":"IF(SUM($J$29:$J$30)>0,$E45*$G45,0)","v":0},null,{"$f":"IF(SUM($J$29:$J$30)>0,$E45*$G45,0)","v":0},null,{"$f":"IF(SUM($J$29:$J$30)>0,$E45*$G45,0)","v":0},null,{"$f":"IF(SUM($J$29:$J$30)>0,$E45*$G45,0)","v":0},null,{"$f":"IF(SUM($J$29:$J$30)>0,$E45*$G45,0)","v":0},null,{"$f":"IF(SUM($J$29:$J$30)>0,$E45*$G45,0)","v":0},null,{"$f":"IF(SUM($J$29:$J$30)>0,$E45*$G45,0)","v":0},null,{"$f":"IF(SUM($J$29:$J$30)>0,$E45*$G45,0)","v":0},null,{"$f":"IF(SUM($J$29:$J$30)>0,$E45*$G45,0)","v":0},null,{"$f":"IF(SUM($J$29:$J$30)>0,$E45*$G45,0)","v":0},null,{"$f":"IF(SUM($J$29:$J$30)>0,$E45*$G45,0)","v":0},null,{"$f":"IF(SUM($J$29:$J$30)>0,$E45*$G45,0)","v":0},null,{"$f":"IF(SUM($J$29:$J$30)>0,$E45*$G45,0)","v":0},null,{"$f":"IF(SUM($J$29:$J$30)>0,$E45*$G45,0)","v":0},null,{"$f":"IF(SUM($J$29:$J$30)>0,$E45*$G45,0)","v":0},null,{"$f":"IF(SUM($J$29:$J$30)>0,$E45*$G45,0)","v":0},null,{"$f":"IF(SUM($J$29:$J$30)>0,$E45*$G45,0)","v":0}]

{"sheet":"Não Rel - EPI","index":14,"n_rows":20,"n_cols":15,"rows_kept":20,"cut":false,"hidden":false,"merged":[[2,1,2,4],[3,1,3,11]]}
[]
[]
[]
[null,"EPIS NÃO RELACIONADOS DIRETAMENTE A UM POSTO DE TRABALHO - AQUISIÇÃO"]
[]
[]
[null,null,null,"ITEM","DESCRIÇÃO","QUANT ANUAL","UNIDADE","CUSTO UNITÁRIO","CUSTO ANUAL","BDI (%)","PREÇO TOTAL","FONTE"]
[]
[null,null,null,1,"Vestimenta de proteção para aproximação e combate a incêndio estrutural, composta por:\n- BLUSÃO, 3 camadas, confeccionada em meta-aramida, para-aramida e fibra antiestética, acabamento em Rip Stop, barreira de vapor formada por feltro de aramida laminado com filme respirável, barreira térmica formada por feltro de aramida costurado com tecido antichamas. Faixas refletivas no tórax e nas mangas, reforço no cotovelo, fechamento frontal com zíper e velcro, bolso para rádio, porta lanterna com passante e dois bolsos inferiores com tampa. Cor preta. Ref.: S.O.S. Sul Resgate.\n- CALÇA de proteção, 3 camadas, confeccionada em meta-aramida, para-aramida e fibras antiestáticas, acabamento em rip stop, barreira de vapor formada por feltro de aramida laminado com filme respirável, barreira térmica formada por feltro de aramida costurado com tecido antichamas. Faixas refletivas nas pernas. Braguilha na vertical com fechamento por velcro, reforço no joelho, dois bolsos nas laterais com tampa, com suspensório modelo H em elástico antichamas, com parte traseira e parte frontal com ajustador e fechamento por engates. Cor preta. Ref.: S.O.S. Sul Resgate",16,"CONJ",3862.5,{"$f":"H9*F9","v":61800},{"$f":"BDI!E26","v":0.23139999999999999},{"$f":"ROUND(I9*(1+J9),2)","v":76100.52},"COTAÇÃO"]
[null,null,null,2,"Capacete de segurança para BOMBEIROS composto de casco injetado em termoplástico (poliamida) VERMELHO com tiras refletivas, conjunto de absorção contra impacto e risco elétrico confeccionado em placa de espuma moldada em poliuretano com reforço de aramida, conjunto de suspensão composto de carneira com cremalheira horizontal para regulagem com sistema de catraca, revestida com almofadas de absorção para proteção em couro antialérgico, presas através de tiras de fixação, tira jugular ergonômica de encaixe rápido com pontos de apoio e laterais almofadadas, visor interno retrátil de policarbonato transparente, visor externo retrátil de termoplástico com revestimento metalizado por ouro. Em conformidade com a norma EN 443. Ref.: MSA modelo Gallet F1XF",16,"UN",2324.52,{"$f":"H10*F10","v":37192.32},{"$f":"J9","v":0.23139999999999999},{"$f":"ROUND(I10*(1+J10),2)","v":45798.62},"COTAÇÃO"]
[null,null,null,3,"Capuz TIPO BALACLAVA em malha de fibra de aramida de 300 g/m², com uma ou duas camadas; antichamas; abertura total na face; resistente à temperatura de até 250 ºC de aproximação. Ref.: Hércules ",16,"UN",128.495,{"$f":"H11*F11","v":2055.92},{"$f":"J10","v":0.23139999999999999},{"$f":"ROUND(I11*(1+J11),2)","v":2531.66},"COTAÇÃO"]
[null,null,null,4,"Calçado de segurança tipo bota, para uso no combate a incêndio, confeccionado em borracha vulcanizada na cor preta, forro em tecido retardante à chamas, biqueira interna em aço, palmilha de aço, camada isolante elétrica separada do solado através de feltro isolante térmico, proteção de tíbia e sua borda superior, com duas alças. Ref.: Hercules",16,"PAR",835.32500000000005,13365.2,0.23139999999999999,16457.91,"COTAÇÃO"]
[null,null,null,5,"\nLuva de proteção contra incêndios, modelo 5 dedos, cor predominante preta, confeccionada em aramida, barreira de umidade em poliuretano respirável, forração interna dupla antialérgica em aramida, reforços em couro na palma e dorso e tiras de ajuste e fixação com velcro. Punho de 5cm aproximadamente. Ref.: JOBE LUV",16,"PAR",418.495,6695.92,0.23139999999999999,8245.36,"COTAÇÃO"]
[null,null,null,6,"Luva de segurança confeccionada em borracha natural, com pó bioadsorvível, ambidestra e superfície lisa - caixa com 100 unidades.",60,"CX",30.630000000000003,1837.8000000000002,0.23139999999999999,2263.0700000000002,"COTAÇÃO"]
[null,null,null,7,"Máscara Cirúrgica Tripla. Fabricada em não tecido 100% polipropileno. - Não estéril - Tripla camada com filtro - Três pregas horizontais - Clipe nasal - Soldada eletronicamente por ultrassom - Disponível na cor branca - Descartável e de uso único. Caixa com 50 unidades cada. Ref: DESCARPACK",60,"CX",8.5,510,0.23139999999999999,628.01,"COTAÇÃO"]
[null,null,null,8,"Fita de sinalização (zebrada), com listas laranja e preta intercaladas-rolo 200 m x 70 mm. Ref.: 3M ",20,"UND",9.6550000000000011,193.10000000000002,0.23139999999999999,237.78,"COTAÇÃO"]
[null,null,null,9,"Vestimenta de segurança para apicultor, composto por: \n- CALÇA em tecido Brim,100% algodão, com elástico nos tornozelos e na cintura. \n- JALECO em tecido Brim,100% algodão, com fechamento através de amarras no pescoço e elástico nos punhos e na cintura. Acompanha chapéu de palha duplo com protetor facial em tela. \nRef: Tecmater ",6,"CONJ",202.43,1214.58,0.23139999999999999,1495.63,"COTAÇÃO"]
[]
[null,null,null,null,null,null,null,null,null,"SOMATÓRIO TOTAL MENSAL",{"$f":"K20/12","v":12813.213333333335}]
[null,null,null,null,null,null,null,null,null,"SOMATÓRIO TOTAL ANUAL",{"$f":"SUM(K8:K18)","v":153758.56000000003},null,null,{"$f":"SUM($I$9:$I$17)","v":124864.84000000001},"por ano sem bdi"]

{"sheet":"Equip Rel","index":15,"n_rows":80,"n_cols":136,"rows_kept":80,"cut":false,"hidden":true,"merged":[[9,1,9,3],[10,1,10,14]]}
[null,null,"CÂMARA DOS DEPUTADOS"]
[null,null,"DEPARTAMENTO TÉCNICO"]
[null,null,"Coordenação de Planejamento e Gestão"]
[]
[null,null,"Data:",{"$f":"'Dados Gerais'!#REF!","v":{"$error":"#REF!"}}]
[null,null,"Processo:",{"$f":"'Dados Gerais'!#REF!","v":{"$error":"#REF!"}}]
[null,null,"Objeto:",{"$f":"'Dados Gerais'!#REF!","v":{"$error":"#REF!"}}]
[]
[]
[]
[null,"EQUIPAMENTOS RELACIONADOS AO POSTO - PAGAMENTO DA DEPRECIAÇÃO / MANUTENÇÃO",null,null,null,null,null,null,null,null,null,null,null,null,null,null,1,null,{"$f":"Q11+1","v":2},null,{"$f":"S11+1","v":3},null,{"$f":"U11+1","v":4},null,{"$f":"W11+1","v":5},null,{"$f":"Y11+1","v":6},null,{"$f":"AA11+1","v":7},null,{"$f":"AC11+1","v":8},null,{"$f":"AE11+1","v":9},null,{"$f":"AG11+1","v":10},null,{"$f":"AI11+1","v":11},null,{"$f":"AK11+1","v":12},null,{"$f":"AM11+1","v":13},null,{"$f":"AO11+1","v":14},null,{"$f":"AQ11+1","v":15},null,{"$f":"AS11+1","v":16},null,{"$f":"AU11+1","v":17},null,{"$f":"AW11+1","v":18},null,{"$f":"AY11+1","v":19},null,{"$f":"BA11+1","v":20},null,{"$f":"BC11+1","v":21},null,{"$f":"BE11+1","v":22},null,{"$f":"BG11+1","v":23},null,{"$f":"BI11+1","v":24},null,{"$f":"BK11+1","v":25},null,{"$f":"BM11+1","v":26},null,{"$f":"BO11+1","v":27},null,{"$f":"BQ11+1","v":28},null,{"$f":"BS11+1","v":29},null,{"$f":"BU11+1","v":30},null,{"$f":"BW11+1","v":31},null,{"$f":"BY11+1","v":32},null,{"$f":"CA11+1","v":33},null,{"$f":"CC11+1","v":34},null,{"$f":"CE11+1","v":35},null,{"$f":"CG11+1","v":36},null,{"$f":"CI11+1","v":37},null,{"$f":"CK11+1","v":38},null,{"$f":"CM11+1","v":39},null,{"$f":"CO11+1","v":40},null,{"$f":"CQ11+1","v":41},null,{"$f":"CS11+1","v":42},null,{"$f":"CU11+1","v":43},null,{"$f":"CW11+1","v":44},null,{"$f":"CY11+1","v":45},null,{"$f":"DA11+1","v":46},null,{"$f":"DC11+1","v":47},null,{"$f":"DE11+1","v":48},null,{"$f":"DG11+1","v":49},null,{"$f":"DI11+1","v":50},null,{"$f":"DK11+1","v":51},null,{"$f":"DM11+1","v":52},null,{"$f":"DO11+1","v":53},null,{"$f":"DQ11+1","v":54},null,{"$f":"DS11+1","v":55},null,{"$f":"DU11+1","v":56},null,{"$f":"DW11+1","v":57},null,{"$f":"DY11+1","v":58},null,{"$f":"EA11+1","v":59},null,{"$f":"EC11+1","v":60}]
[]
[null,null,null,null,null,null,null,null,null,null,null,null,null,null,null,null,{"$f":"SUM(R12:R61)","v":0},null,{"$f":"SUM(T12:T61)","v":0},null,{"$f":"SUM(V12:V61)","v":0},null,{"$f":"SUM(X12:X61)","v":0},null,{"$f":"SUM(Z12:Z61)","v":0},null,{"$f":"SUM(AB12:AB61)","v":0},null,{"$f":"SUM(AD12:AD61)","v":0},null,{"$f":"SUM(AF12:AF61)","v":0},null,{"$f":"SUM(AH12:AH61)","v":0},null,{"$f":"SUM(AJ12:AJ61)","v":0},null,{"$f":"SUM(AL12:AL61)","v":0},null,{"$f":"SUM(AN12:AN61)","v":0},null,{"$f":"SUM(AP12:AP61)","v":0},null,{"$f":"SUM(AR12:AR61)","v":0},null,{"$f":"SUM(AT12:AT61)","v":0},null,{"$f":"SUM(AV12:AV61)","v":0},null,{"$f":"SUM(AX12:AX61)","v":0},null,{"$f":"SUM(AZ12:AZ61)","v":0},null,{"$f":"SUM(BB12:BB61)","v":0},null,{"$f":"SUM(BD12:BD61)","v":0},null,{"$f":"SUM(BF12:BF61)","v":0},null,{"$f":"SUM(BH12:BH61)","v":0},null,{"$f":"SUM(BJ12:BJ61)","v":0},null,{"$f":"SUM(BL12:BL61)","v":0},null,{"$f":"SUM(BN12:BN61)","v":0},null,{"$f":"SUM(BP12:BP61)","v":0},null,{"$f":"SUM(BR12:BR61)","v":0},null,{"$f":"SUM(BT12:BT61)","v":0},null,{"$f":"SUM(BV12:BV61)","v":0},null,{"$f":"SUM(BX12:BX61)","v":0},null,{"$f":"SUM(BZ12:BZ61)","v":0},null,{"$f":"SUM(CB12:CB61)","v":0},null,{"$f":"SUM(CD12:CD61)","v":0},null,{"$f":"SUM(CF12:CF61)","v":0},null,{"$f":"SUM(CH12:CH61)","v":0},null,{"$f":"SUM(CJ12:CJ61)","v":0},null,{"$f":"SUM(CL12:CL61)","v":0},null,{"$f":"SUM(CN12:CN61)","v":0},null,{"$f":"SUM(CP12:CP61)","v":0},null,{"$f":"SUM(CR12:CR61)","v":0},null,{"$f":"SUM(CT12:CT61)","v":0},null,{"$f":"SUM(CV12:CV61)","v":0},null,{"$f":"SUM(CX12:CX61)","v":0},null,{"$f":"SUM(CZ12:CZ61)","v":0},null,{"$f":"SUM(DB12:DB61)","v":0},null,{"$f":"SUM(DD12:DD61)","v":0},null,{"$f":"SUM(DF12:DF61)","v":0},null,{"$f":"SUM(DH12:DH61)","v":0},null,{"$f":"SUM(DJ12:DJ61)","v":0},null,{"$f":"SUM(DL12:DL61)","v":0},null,{"$f":"SUM(DN12:DN61)","v":0},null,{"$f":"SUM(DP12:DP61)","v":0},null,{"$f":"SUM(DR12:DR61)","v":0},null,{"$f":"SUM(DT12:DT61)","v":0},null,{"$f":"SUM(DV12:DV61)","v":0},null,{"$f":"SUM(DX12:DX61)","v":0},null,{"$f":"SUM(DZ12:DZ61)","v":0},null,{"$f":"SUM(EB12:EB61)","v":0},null,{"$f":"SUM(ED12:ED61)","v":0},null,{"$f":"SUM(EF12:EF61)","v":0}]
[null,null,"CATEGORIAS",null,"QUANTIDADE"]
[null,null,null,null,null,null,null,null,null,null,null,null,null,null,null,null,{"$f":"IF($C15=Q$11,1,0)","v":0},null,{"$f":"IF($C15=S$11,1,0)","v":0},null,{"$f":"IF($C15=U$11,1,0)","v":0},null,{"$f":"IF($C15=W$11,1,0)","v":0},null,{"$f":"IF($C15=Y$11,1,0)","v":0},null,{"$f":"IF($C15=AA$11,1,0)","v":0},null,{"$f":"IF($C15=AC$11,1,0)","v":0},null,{"$f":"IF($C15=AE$11,1,0)","v":0},null,{"$f":"IF($C15=AG$11,1,0)","v":0},null,{"$f":"IF($C15=AI$11,1,0)","v":0},null,{"$f":"IF($C15=AK$11,1,0)","v":0},null,{"$f":"IF($C15=AM$11,1,0)","v":0},null,{"$f":"IF($C15=AO$11,1,0)","v":0},null,{"$f":"IF($C15=AQ$11,1,0)","v":0},null,{"$f":"IF($C15=AS$11,1,0)","v":0},null,{"$f":"IF($C15=AU$11,1,0)","v":0},null,{"$f":"IF($C15=AW$11,1,0)","v":0},null,{"$f":"IF($C15=AY$11,1,0)","v":0},null,{"$f":"IF($C15=BA$11,1,0)","v":0},null,{"$f":"IF($C15=BC$11,1,0)","v":0},null,{"$f":"IF($C15=BE$11,1,0)","v":0},null,{"$f":"IF($C15=BG$11,1,0)","v":0},null,{"$f":"IF($C15=BI$11,1,0)","v":0},null,{"$f":"IF($C15=BK$11,1,0)","v":0},null,{"$f":"IF($C15=BM$11,1,0)","v":0},null,{"$f":"IF($C15=BO$11,1,0)","v":0},null,{"$f":"IF($C15=BQ$11,1,0)","v":0},null,{"$f":"IF($C15=BS$11,1,0)","v":0},null,{"$f":"IF($C15=BU$11,1,0)","v":0},null,{"$f":"IF($C15=BW$11,1,0)","v":0},null,{"$f":"IF($C15=BY$11,1,0)","v":0},null,{"$f":"IF($C15=CA$11,1,0)","v":0},null,{"$f":"IF($C15=CC$11,1,0)","v":0},null,{"$f":"IF($C15=CE$11,1,0)","v":0},null,{"$f":"IF($C15=CG$11,1,0)","v":0},null,{"$f":"IF($C15=CI$11,1,0)","v":0},null,{"$f":"IF($C15=CK$11,1,0)","v":0},null,{"$f":"IF($C15=CM$11,1,0)","v":0},null,{"$f":"IF($C15=CO$11,1,0)","v":0},null,{"$f":"IF($C15=CQ$11,1,0)","v":0},null,{"$f":"IF($C15=CS$11,1,0)","v":0},null,{"$f":"IF($C15=CU$11,1,0)","v":0},null,{"$f":"IF($C15=CW$11,1,0)","v":0},null,{"$f":"IF($C15=CY$11,1,0)","v":0},null,{"$f":"IF($C15=DA$11,1,0)","v":0},null,{"$f":"IF($C15=DC$11,1,0)","v":0},null,{"$f":"IF($C15=DE$11,1,0)","v":0},null,{"$f":"IF($C15=DG$11,1,0)","v":0},null,{"$f":"IF($C15=DI$11,1,0)","v":0},null,{"$f":"IF($C15=DK$11,1,0)","v":0},null,{"$f":"IF($C15=DM$11,1,0)","v":0},null,{"$f":"IF($C15=DO$11,1,0)","v":0},null,{"$f":"IF($C15=DQ$11,1,0)","v":0},null,{"$f":"IF($C15=DS$11,1,0)","v":0},null,{"$f":"IF($C15=DU$11,1,0)","v":0},null,{"$f":"IF($C15=DW$11,1,0)","v":0},null,{"$f":"IF($C15=DY$11,1,0)","v":0},null,{"$f":"IF($C15=EA$11,1,0)","v":0},null,{"$f":"IF($C15=EC$11,1,0)","v":0},null,{"$f":"IF($C15=EE$11,1,0)","v":0}]
[null,null,null,{"$f":"HLOOKUP($C16,'Dados Gerais'!$D$5:$BK$10,6)","v":{"$error":"#N/A"}},{"$f":"HLOOKUP($C16,'Dados Gerais'!$D$5:$BK$14,10)","v":{"$error":"#N/A"}},null,null,null,null,null,null,null,null,null,null,null,{"$f":"IF($C16=Q$11,1,0)","v":0},null,{"$f":"IF($C16=S$11,1,0)","v":0},null,{"$f":"IF($C16=U$11,1,0)","v":0},null,{"$f":"IF($C16=W$11,1,0)","v":0},null,{"$f":"IF($C16=Y$11,1,0)","v":0},null,{"$f":"IF($C16=AA$11,1,0)","v":0},null,{"$f":"IF($C16=AC$11,1,0)","v":0},null,{"$f":"IF($C16=AE$11,1,0)","v":0},null,{"$f":"IF($C16=AG$11,1,0)","v":0},null,{"$f":"IF($C16=AI$11,1,0)","v":0},null,{"$f":"IF($C16=AK$11,1,0)","v":0},null,{"$f":"IF($C16=AM$11,1,0)","v":0},null,{"$f":"IF($C16=AO$11,1,0)","v":0},null,{"$f":"IF($C16=AQ$11,1,0)","v":0},null,{"$f":"IF($C16=AS$11,1,0)","v":0},null,{"$f":"IF($C16=AU$11,1,0)","v":0},null,{"$f":"IF($C16=AW$11,1,0)","v":0},null,{"$f":"IF($C16=AY$11,1,0)","v":0},null,{"$f":"IF($C16=BA$11,1,0)","v":0},null,{"$f":"IF($C16=BC$11,1,0)","v":0},null,{"$f":"IF($C16=BE$11,1,0)","v":0},null,{"$f":"IF($C16=BG$11,1,0)","v":0},null,{"$f":"IF($C16=BI$11,1,0)","v":0},null,{"$f":"IF($C16=BK$11,1,0)","v":0},null,{"$f":"IF($C16=BM$11,1,0)","v":0},null,{"$f":"IF($C16=BO$11,1,0)","v":0},null,{"$f":"IF($C16=BQ$11,1,0)","v":0},null,{"$f":"IF($C16=BS$11,1,0)","v":0},null,{"$f":"IF($C16=BU$11,1,0)","v":0},null,{"$f":"IF($C16=BW$11,1,0)","v":0},null,{"$f":"IF($C16=BY$11,1,0)","v":0},null,{"$f":"IF($C16=CA$11,1,0)","v":0},null,{"$f":"IF($C16=CC$11,1,0)","v":0},null,{"$f":"IF($C16=CE$11,1,0)","v":0},null,{"$f":"IF($C16=CG$11,1,0)","v":0},null,{"$f":"IF($C16=CI$11,1,0)","v":0},null,{"$f":"IF($C16=CK$11,1,0)","v":0},null,{"$f":"IF($C16=CM$11,1,0)","v":0},null,{"$f":"IF($C16=CO$11,1,0)","v":0},null,{"$f":"IF($C16=CQ$11,1,0)","v":0},null,{"$f":"IF($C16=CS$11,1,0)","v":0},null,{"$f":"IF($C16=CU$11,1,0)","v":0},null,{"$f":"IF($C16=CW$11,1,0)","v":0},null,{"$f":"IF($C16=CY$11,1,0)","v":0},null,{"$f":"IF($C16=DA$11,1,0)","v":0},null,{"$f":"IF($C16=DC$11,1,0)","v":0},null,{"$f":"IF($C16=DE$11,1,0)","v":0},null,{"$f":"IF($C16=DG$11,1,0)","v":0},null,{"$f":"IF($C16=DI$11,1,0)","v":0},null,{"$f":"IF($C16=DK$11,1,0)","v":0},null,{"$f":"IF($C16=DM$11,1,0)","v":0},null,{"$f":"IF($C16=DO$11,1,0)","v":0},null,{"$f":"IF($C16=DQ$11,1,0)","v":0},null,{"$f":"IF($C16=DS$11,1,0)","v":0},null,{"$f":"IF($C16=DU$11,1,0)","v":0},null,{"$f":"IF($C16=DW$11,1,0)","v":0},null,{"$f":"IF($C16=DY$11,1,0)","v":0},null,{"$f":"IF($C16=EA$11,1,0)","v":0},null,{"$f":"IF($C16=EC$11,1,0)","v":0},null,{"$f":"IF($C16=EE$11,1,0)","v":0}]
[null,null,null,null,null,null,null,null,null,null,null,null,null,null,null,null,{"$f":"IF($C17=Q$11,1,0)","v":0},null,{"$f":"IF($C17=S$11,1,0)","v":0},null,{"$f":"IF($C17=U$11,1,0)","v":0},null,{"$f":"IF($C17=W$11,1,0)","v":0},null,{"$f":"IF($C17=Y$11,1,0)","v":0},null,{"$f":"IF($C17=AA$11,1,0)","v":0},null,{"$f":"IF($C17=AC$11,1,0)","v":0},null,{"$f":"IF($C17=AE$11,1,0)","v":0},null,{"$f":"IF($C17=AG$11,1,0)","v":0},null,{"$f":"IF($C17=AI$11,1,0)","v":0},null,{"$f":"IF($C17=AK$11,1,0)","v":0},null,{"$f":"IF($C17=AM$11,1,0)","v":0},null,{"$f":"IF($C17=AO$11,1,0)","v":0},null,{"$f":"IF($C17=AQ$11,1,0)","v":0},null,{"$f":"IF($C17=AS$11,1,0)","v":0},null,{"$f":"IF($C17=AU$11,1,0)","v":0},null,{"$f":"IF($C17=AW$11,1,0)","v":0},null,{"$f":"IF($C17=AY$11,1,0)","v":0},null,{"$f":"IF($C17=BA$11,1,0)","v":0},null,{"$f":"IF($C17=BC$11,1,0)","v":0},null,{"$f":"IF($C17=BE$11,1,0)","v":0},null,{"$f":"IF($C17=BG$11,1,0)","v":0},null,{"$f":"IF($C17=BI$11,1,0)","v":0},null,{"$f":"IF($C17=BK$11,1,0)","v":0},null,{"$f":"IF($C17=BM$11,1,0)","v":0},null,{"$f":"IF($C17=BO$11,1,0)","v":0},null,{"$f":"IF($C17=BQ$11,1,0)","v":0},null,{"$f":"IF($C17=BS$11,1,0)","v":0},null,{"$f":"IF($C17=BU$11,1,0)","v":0},null,{"$f":"IF($C17=BW$11,1,0)","v":0},null,{"$f":"IF($C17=BY$11,1,0)","v":0},null,{"$f":"IF($C17=CA$11,1,0)","v":0},null,{"$f":"IF($C17=CC$11,1,0)","v":0},null,{"$f":"IF($C17=CE$11,1,0)","v":0},null,{"$f":"IF($C17=CG$11,1,0)","v":0},null,{"$f":"IF($C17=CI$11,1,0)","v":0},null,{"$f":"IF($C17=CK$11,1,0)","v":0},null,{"$f":"IF($C17=CM$11,1,0)","v":0},null,{"$f":"IF($C17=CO$11,1,0)","v":0},null,{"$f":"IF($C17=CQ$11,1,0)","v":0},null,{"$f":"IF($C17=CS$11,1,0)","v":0},null,{"$f":"IF($C17=CU$11,1,0)","v":0},null,{"$f":"IF($C17=CW$11,1,0)","v":0},null,{"$f":"IF($C17=CY$11,1,0)","v":0},null,{"$f":"IF($C17=DA$11,1,0)","v":0},null,{"$f":"IF($C17=DC$11,1,0)","v":0},null,{"$f":"IF($C17=DE$11,1,0)","v":0},null,{"$f":"IF($C17=DG$11,1,0)","v":0},null,{"$f":"IF($C17=DI$11,1,0)","v":0},null,{"$f":"IF($C17=DK$11,1,0)","v":0},null,{"$f":"IF($C17=DM$11,1,0)","v":0},null,{"$f":"IF($C17=DO$11,1,0)","v":0},null,{"$f":"IF($C17=DQ$11,1,0)","v":0},null,{"$f":"IF($C17=DS$11,1,0)","v":0},null,{"$f":"IF($C17=DU$11,1,0)","v":0},null,{"$f":"IF($C17=DW$11,1,0)","v":0},null,{"$f":"IF($C17=DY$11,1,0)","v":0},null,{"$f":"IF($C17=EA$11,1,0)","v":0},null,{"$f":"IF($C17=EC$11,1,0)","v":0},null,{"$f":"IF($C17=EE$11,1,0)","v":0}]
[]
[null,null,"PAGAMENTO DA DEPRECIAÇÃO"]
[null,null,"ITEM","DESCRIÇÃO","QUANT ANUAL","CONTA SIAFI","VALOR DE AQ.","% RESIDUAL","VIDA ÚTIL","DEP. MENSAL","CUSTO TOTAL","BDI (%)","PREÇO TOTAL","FONTE","REFERÊNCIA"]
[]
[null,null,null,null,null,null,null,null,null,{"$f":"G22*(1-H22)/(I22*12)","v":{"$error":"#DIV/0!"}},{"$f":"J22*E22","v":{"$error":"#DIV/0!"}},{"$f":"BDI!E26","v":0.23139999999999999},{"$f":"ROUND(K22*(1+L22),2)","v":{"$error":"#DIV/0!"}},"COTAÇÃO"]
[]
[]
[null,null,"PAGAMENTO DA MANUTENÇÃO"]
[null,null,"ITEM","DESCRIÇÃO",null,null,null,"K (calculado)","MENSAL DEPR.","% MAN X DEP","MENSAL MAN.","BDI (%)","PREÇO TOTAL"]
[]
[null,null,null,null,null,null,null,{"$f":"H35","v":0.23950080000000007},{"$f":"M22","v":{"$error":"#DIV/0!"}},{"$f":"H28","v":0.23950080000000007},{"$f":"I28*H28","v":{"$error":"#DIV/0!"}},{"$f":"L22","v":0.23139999999999999},{"$f":"ROUND(K28*(1+L28),2)","v":{"$error":"#DIV/0!"}}]
[]
[null,null,null,null,"K1","K2","K3","K4"]
[null,null,null,null,1,1,0.8,0.8]
[null,null,null,null,"K5","K6","K7","K8"]
[null,null,null,null,1,0.6,0.5,1.1000000000000001]
[null,null,null,null,"K9","K10","K11","RESULTADO"]
[null,null,null,"* a descrição de cada coeficiente segue abaixo",0.9,0.9,1.4,{"$f":"E31*F31*G31*H31*E33*F33*G33*H33*E35*F35*G35","v":0.23950080000000007}]
[]
[]
[null,null,"MATERIAL DE CONSUMO ASSOCIADO"]
[null,null,"ITEM","DESCRIÇÃO",null,null,null,"QUANTID/ANO","UNIDADE","VALOR DE AQ.","MENSAL MAT","BDI (%)","PREÇO TOTAL"]
[]
[null,null,null,null,null,null,null,null,null,null,{"$f":"J41*H41/12","v":0},{"$f":"L28","v":0.23139999999999999},{"$f":"ROUND(K41*(1+L41),2)","v":0}]
[]
[]
[null,null,"MATERIAL DE CONSUMO ASSOCIADO"]
[null,null,"ITEM","DESCRIÇÃO",null,null,null,null,null,null,null,null,"PREÇO TOTAL"]
[]
[null,null,1,"Componente DEPRECIAÇÃO - POR POSTO",null,null,null,null,null,null,null,null,{"$f":"M22","v":{"$error":"#DIV/0!"}}]
[null,null,2,"Componente MANUTENÇÃO - POR POSTO",null,null,null,null,null,null,null,null,{"$f":"M28","v":{"$error":"#DIV/0!"}}]
[null,null,3,"Componente MATERIAL DE CONSUMO ASSOCIADO - POR POSTO",null,null,null,null,null,null,null,null,{"$f":"M41","v":0}]
[]
[null,null,null,null,null,null,null,null,null,null,null,"SOMATÓRIO TOTAL MENSAL - POR POSTO",{"$f":"SUM(M46:M50)","v":{"$error":"#DIV/0!"}},null,null,null,null,{"$f":"IF(SUM(Q$15:Q$17)>0,$M51,0)","v":0},null,{"$f":"IF(SUM(S$15:S$17)>0,$M51,0)","v":0},null,{"$f":"IF(SUM(U$15:U$17)>0,$M51,0)","v":0},null,{"$f":"IF(SUM(W$15:W$17)>0,$M51,0)","v":0},null,{"$f":"IF(SUM(Y$15:Y$17)>0,$M51,0)","v":0},null,{"$f":"IF(SUM(AA$15:AA$17)>0,$M51,0)","v":0},null,{"$f":"IF(SUM(AC$15:AC$17)>0,$M51,0)","v":0},null,{"$f":"IF(SUM(AE$15:AE$17)>0,$M51,0)","v":0},null,{"$f":"IF(SUM(AG$15:AG$17)>0,$M51,0)","v":0},null,{"$f":"IF(SUM(AI$15:AI$17)>0,$M51,0)","v":0},null,{"$f":"IF(SUM(AK$15:AK$17)>0,$M51,0)","v":0},null,{"$f":"IF(SUM(AM$15:AM$17)>0,$M51,0)","v":0},null,{"$f":"IF(SUM(AO$15:AO$17)>0,$M51,0)","v":0},null,{"$f":"IF(SUM(AQ$15:AQ$17)>0,$M51,0)","v":0},null,{"$f":"IF(SUM(AS$15:AS$17)>0,$M51,0)","v":0},null,{"$f":"IF(SUM(AU$15:AU$17)>0,$M51,0)","v":0},null,{"$f":"IF(SUM(AW$15:AW$17)>0,$M51,0)","v":0},null,{"$f":"IF(SUM(AY$15:AY$17)>0,$M51,0)","v":0},null,{"$f":"IF(SUM(BA$15:BA$17)>0,$M51,0)","v":0},null,{"$f":"IF(SUM(BC$15:BC$17)>0,$M51,0)","v":0},null,{"$f":"IF(SUM(BE$15:BE$17)>0,$M51,0)","v":0},null,{"$f":"IF(SUM(BG$15:BG$17)>0,$M51,0)","v":0},null,{"$f":"IF(SUM(BI$15:BI$17)>0,$M51,0)","v":0},null,{"$f":"IF(SUM(BK$15:BK$17)>0,$M51,0)","v":0},null,{"$f":"IF(SUM(BM$15:BM$17)>0,$M51,0)","v":0},null,{"$f":"IF(SUM(BO$15:BO$17)>0,$M51,0)","v":0},null,{"$f":"IF(SUM(BQ$15:BQ$17)>0,$M51,0)","v":0},null,{"$f":"IF(SUM(BS$15:BS$17)>0,$M51,0)","v":0},null,{"$f":"IF(SUM(BU$15:BU$17)>0,$M51,0)","v":0},null,{"$f":"IF(SUM(BW$15:BW$17)>0,$M51,0)","v":0},null,{"$f":"IF(SUM(BY$15:BY$17)>0,$M51,0)","v":0},null,{"$f":"IF(SUM(CA$15:CA$17)>0,$M51,0)","v":0},null,{"$f":"IF(SUM(CC$15:CC$17)>0,$M51,0)","v":0},null,{"$f":"IF(SUM(CE$15:CE$17)>0,$M51,0)","v":0},null,{"$f":"IF(SUM(CG$15:CG$17)>0,$M51,0)","v":0},null,{"$f":"IF(SUM(CI$15:CI$17)>0,$M51,0)","v":0},null,{"$f":"IF(SUM(CK$15:CK$17)>0,$M51,0)","v":0},null,{"$f":"IF(SUM(CM$15:CM$17)>0,$M51,0)","v":0},null,{"$f":"IF(SUM(CO$15:CO$17)>0,$M51,0)","v":0},null,{"$f":"IF(SUM(CQ$15:CQ$17)>0,$M51,0)","v":0},null,{"$f":"IF(SUM(CS$15:CS$17)>0,$M51,0)","v":0},null,{"$f":"IF(SUM(CU$15:CU$17)>0,$M51,0)","v":0},null,{"$f":"IF(SUM(CW$15:CW$17)>0,$M51,0)","v":0},null,{"$f":"IF(SUM(CY$15:CY$17)>0,$M51,0)","v":0},null,{"$f":"IF(SUM(DA$15:DA$17)>0,$M51,0)","v":0},null,{"$f":"IF(SUM(DC$15:DC$17)>0,$M51,0)","v":0},null,{"$f":"IF(SUM(DE$15:DE$17)>0,$M51,0)","v":0},null,{"$f":"IF(SUM(DG$15:DG$17)>0,$M51,0)","v":0},null,{"$f":"IF(SUM(DI$15:DI$17)>0,$M51,0)","v":0},null,{"$f":"IF(SUM(DK$15:DK$17)>0,$M51,0)","v":0},null,{"$f":"IF(SUM(DM$15:DM$17)>0,$M51,0)","v":0},null,{"$f":"IF(SUM(DO$15:DO$17)>0,$M51,0)","v":0},null,{"$f":"IF(SUM(DQ$15:DQ$17)>0,$M51,0)","v":0},null,{"$f":"IF(SUM(DS$15:DS$17)>0,$M51,0)","v":0},null,{"$f":"IF(SUM(DU$15:DU$17)>0,$M51,0)","v":0},null,{"$f":"IF(SUM(DW$15:DW$17)>0,$M51,0)","v":0},null,{"$f":"IF(SUM(DY$15:DY$17)>0,$M51,0)","v":0},null,{"$f":"IF(SUM(EA$15:EA$17)>0,$M51,0)","v":0},null,{"$f":"IF(SUM(EC$15:EC$17)>0,$M51,0)","v":0},null,{"$f":"IF(SUM(EE$15:EE$17)>0,$M51,0)","v":0}]
[null,null,null,null,null,null,null,null,null,null,null,"SOMATÓRIO TOTAL ANUAL - POR POSTO",{"$f":"M51*12","v":{"$error":"#DIV/0!"}}]
[]
[]
[null,null,"MATERIAL DE CONSUMO ASSOCIADO"]
[null,null,"MEMÓRIA DE CÁLCULO DO COEFICIENTE DE CORRELAÇÃO MANUTENÇÃO X DEPRECIAÇÃO (K)"]
[]
[null,null,"JUSTIFICATIVAS",null,"TIPO","K1",null,"Condições de Trab","K4",null,"Tempo Vida (anos)","K6",null,"Temperatura","K8"]
[null,null,null,null,"Guindaste",0.5,null,"Em espera",0.4,null,1,0.6,null,"Muito quente (> 40º C)",1.3]
[null,null,"K1","Arbitrado 1","Caminhão-comum",0.8,null,"Leves",0.8,null,2,0.7,null,"Quente (30º a 40º C)",1.1000000000000001]
[null,null,"K2","Considerado o operador médio","Fora-de-estrada",1,null,"Médias",1,null,3,0.8,null,"Médio (10º a 30º C)",1]
[null,null,"K3","Consideradas ferramentas de primeira qualidade","Carregadeira",1,null,"Pesadas",1.4,null,4,0.9,null,"Frio (< 10º C)",1.2]
[null,null,"K4","Consições leves","Escavadeira",1.4,null,"Severas",2,null,5,1]
[null,null,"K5","Considerando manutenção normal","Motoescrêiper",1.1000000000000001,null,null,null,null,6,1,null,"Ritmo de Trabalho","K9"]
[null,null,"K6","Equipamentos novos","Trator de esteira",1.2,null,"Manutenção","K5",null,7,1,null,"Folgado",0.9]
[null,null,"K7","220h por mês, 252 dias por ano",null,null,null,"Excelente",0.6,null,8,1.2,null,"Médio ",1]
[null,null,"K8","Clima quente, acima de 30º C","Qualid do Operador","K2",null,"Boa",0.8,null,9,1.3,null,"Com pressa",1.5]
[null,null,"K9","Ritmo de trabalho usualmente folgado","Excelente",0.8,null,"Média",1,null,10,1.4]
[null,null,"K10","Considerado o operador médio","Boa",0.9,null,"Ruim ",1.5,null,11,2,null,"Conh do Serviço","K10"]
[null,null,"K11","Foi considerada a opção de aluguel a terceiros, ainda que a simulação seja dos custos do contratado, contudo a execução dos serviços é em local de terceiros","Média",1,null,"Inexistente",3,null,15,2,null,"Grande ",0.8]
[null,null,null,null,"Ruim",1.2,null,null,null,null,null,null,null,"Médio     ",0.9]
[null,null,null,null,"Péssima",2,null,"Horas de Uso ","K7",6000,1,null,null,"Pouco ",1]
[null,null,null,null,null,null,null,1000,0.5,8000,1.3]
[null,null,null,null,"Qualidade do Equip","K3",null,2000,0.5,10000,1.6,null,null,"Tipo do Serviço","K11"]
[null,null,null,null,"De primeira",0.8,null,3000,0.6,12000,1.9,null,null,"Mina ou Pedreira",0.8]
[null,null,null,null,"Média",1,null,4000,0.7,15000,2.2999999999999998,null,null,"Construção Geral",1]
[null,null,null,null,"Ruim",1.5,null,5000,0.9,20000,3,null,null,"Aluguel a Terceiros",1.4]
[]
[null,null,null,null,"Fonte: "]
[null,null,null,null,"MATTOS, Aldo Dórea. Como preparar orçamentos de obras. São Paulo: Pini, 2006. 281 p., il"]

{"sheet":"Não Rel - Depr","index":16,"n_rows":100,"n_cols":15,"rows_kept":100,"cut":false,"hidden":false,"merged":[[2,1,2,3],[3,1,3,14]]}
[]
[]
[]
[null,"EQUIPAMENTOS NÃO RELACIONADOS DIRETAMENTE A UM POSTO DE TRABALHO - PAGAMENTO DA DEPRECIAÇÃO / MANUTENÇÃO"]
[]
[]
[null,null,"PAGAMENTO DA DEPRECIAÇÃO"]
[null,null,"ITEM","DESCRIÇÃO","QUANT ANUAL","CONTA SIAFI","VALOR DE AQ.","% RESIDUAL","VIDA ÚTIL","DEP. MENSAL","CUSTO TOTAL","BDI (%)","PREÇO TOTAL","FONTE","REFERÊNCIA"]
[]
[null,null,1,"TALA MOLDÁVEL - MATERIAL: Talas reguláveis para imobilização tipo EVA. Tamanho EG *",10,"12311.01.05",22.583333333333332,0.1,10,{"$f":"G10*(1-H10)/(I10*12)","v":0.169375},{"$f":"J10*E10","v":1.6937500000000001},{"$f":"BDI!$E$26","v":0.23139999999999999},{"$f":"ROUND(K10*(1+L10),2)","v":2.09},"COTAÇÃO"]
[null,null,2,"TALA MOLDÁVEL - MATERIAL: Talas reguláveis para imobilização tipo EVA. Tamanho G *",10,"12311.01.05",16.830000000000002,0.1,10,0.126225,1.2622500000000001,{"$f":"BDI!$E$26","v":0.23139999999999999},1.55,"COTAÇÃO"]
[null,null,3,"TALA MOLDÁVEL - MATERIAL: Talas reguláveis para imobilização tipo EVA. Tamanho M *",10,"12311.01.05",14.4,0.1,10,0.10800000000000001,1.08,{"$f":"BDI!$E$26","v":0.23139999999999999},1.33,"COTAÇÃO"]
[null,null,4,"TALA MOLDÁVEL - MATERIAL: Talas reguláveis para imobilização tipo EVA. Tamanho P *",10,"12311.01.05",12.35,0.1,10,9.2624999999999999E-2,0.92625000000000002,{"$f":"BDI!$E$26","v":0.23139999999999999},1.1399999999999999,"COTAÇÃO"]
[null,null,5,"TALA MOLDÁVEL - MATERIAL: Talas reguláveis para imobilização tipo EVA. Tamanho PP *",10,"12311.01.05",10.889999999999999,0.1,10,8.1674999999999984E-2,0.81674999999999986,{"$f":"BDI!$E$26","v":0.23139999999999999},1.01,"COTAÇÃO"]
[null,null,6,"PRANCHA LONGA EM POLIPROPILENO *",10,"12311.01.05",389.65750000000003,0.1,10,2.9224312500000003,29.224312500000003,{"$f":"BDI!$E$26","v":0.23139999999999999},35.99,"COTAÇÃO"]
[null,null,7,"IMOBILIZADOR DE CABEÇA*",10,"12311.01.05",140.79666666666665,0.1,10,1.0559749999999999,10.559749999999999,{"$f":"BDI!$E$26","v":0.23139999999999999},13,"COTAÇÃO"]
[null,null,8,"CINTO ARANHA*",10,"12311.01.05",79.772500000000008,0.1,10,0.59829375000000007,5.9829375000000002,{"$f":"BDI!$E$26","v":0.23139999999999999},7.37,"COTAÇÃO"]
[null,null,9,"MÁSCARA PARA RESPIRAÇÃO CARDIO PULMONAR – POCKET MASK: - confeccionada em material livre de látex e atóxico; - reutilizável e de fácil desinfecção; - de material transparente para melhor visualização do procedimento; - com válvula unidirecional removível de alta eficiência; - com almofada macia para evitar fuga de ar e possibilitar maior conforto ao paciente; - válvula descartável com filtro para evitar a contaminação cruzada.*",68,"12311.01.05",92.266666666666666,0.1,10,0.69200000000000006,47.056000000000004,{"$f":"BDI!$E$26","v":0.23139999999999999},57.94,"COTAÇÃO"]
[null,null,10,"COLAR CERVICAL AJUSTÁVEL:\n- quatro em um, tipo \"Stifneck\"; - transparente à radiação; - confeccionado em duas camadas, uma camada em espuma resistente, e outra camada protetora e sustentadora em plástico resistente, ajustável ao tamanho do pescoço e cabeça, com fecho em velcro; - com travas que asseguram o tamanho selecionado; - trilhos de ajuste para manter o alinhamento simétrico a cada tamanho; Adulto.* Marca de ref. AMBU",10,"12311.01.05",65.406666666666666,0.1,10,0.49054999999999999,4.9055,{"$f":"BDI!$E$26","v":0.23139999999999999},6.04,"COTAÇÃO"]
[null,null,11,"REANIMADOR MANUAL (AMBÚ) - Equipamento de resgate e uso hospitalar/ambulatorial de fácil uso e esterilização. Infantil: 500ml *",10,"12311.01.05",157.32499999999999,0.1,10,1.1799375000000001,11.799375000000001,{"$f":"BDI!$E$26","v":0.23139999999999999},14.53,"COTAÇÃO"]
[null,null,12,"REANIMADOR MANUAL (AMBÚ) - Equipamento de resgate e uso hospitalar/ambulatorial de fácil uso e esterilização. Adulto: 1600ml *",10,"12311.01.05",156.54,0.1,10,{"$f":"G21*(1-H21)/(I21*12)","v":1.17405},{"$f":"J21*E21","v":11.740500000000001},{"$f":"BDI!$E$26","v":0.23139999999999999},{"$f":"ROUND(K21*(1+L21),2)","v":14.46},"COTAÇÃO"]
[null,null,13,"TESOURA DE RESGATE:\n- tesoura especial para atendimento pré-hospitalar; - destinada ao corte de roupas; - com lâminas ponta romba; - com cabo que proporcione uma ótima pegada; - dentes serrilhados em um dos lados para facilitar o corte de tecidos mais espessos; - orifício próximo ao cabo para cortar fios de pequena espessura; feita em aço, com cabo em polipropileno; comprimento total 19cm.*",10,"12311.01.05",42,0.1,10,0.31500000000000006,3.1500000000000004,{"$f":"BDI!$E$26","v":0.23139999999999999},3.88,"COTAÇÃO"]
[null,null,14,"TORNIQUETES TÁTICOS:\n- Torniquete de aperto manual, composto por: um único sistema de fivela (em polímero ou aço) simples para tracionamento rápido e remoção de folgas; barra de tracionamento com sobressaltos nas extremidades, de localização fixa, que após aplicação do torniquete, ao ser girada no próprio eixo, traciona o sistema, produzindo a oclusão sanguínea no membro; - entrada chanfrada bilateral para trava rápida da barra de tracionamento, deve suportar o tracionamento para correta oclusão sanguínea; - fita afixada com solda ultrassônica ao torniquete, para fechar a entrada chanfrada bilateral depois da barra de tracionamento travada, com espaço para escrita a caneta; placa de estabilização com bordas arredondadas para não pinçar a pele do operador; recomendado pelo Comitê para o Tactical CombatCasualty Care (Co TCCC); possibilidade de auto aplicação com uma das mãos; - deverá possuir Certificado de Aprovação (CA) válido.*",20,"12311.01.05",240,0.1,10,1.8,36,{"$f":"BDI!$E$26","v":0.23139999999999999},44.33,"COTAÇÃO"]
[null,null,15,"BANDAGEM DE EMERGÊNCIA MODELO ISRAELENSE 15 CM (6 POL):\nBandagem elástica composta por: barra de pressão e barra de fechamento presas firmemente e de igual largura à bandagem; curativo não aderente costurado à bandagem no lado oposto ao lado de fixação da barra depressão; estéril.*",10,"12311.01.05",62.5,0.1,10,0.46875,4.6875,{"$f":"BDI!$E$26","v":0.23139999999999999},5.77,"COTAÇÃO"]
[null,null,16,"BANDAGEM DE EMERGÊNCIA MODELO ISRAELENSE 10 CM (4 POL):\nBandagem elástica composta por: barra de pressão e barra de fechamento presas firmemente e de igual largura à bandagem; curativo não aderente costurado à bandagem no lado oposto ao lado de fixação da barra depressão; estéril.*",10,"12311.01.05",68,0.1,10,0.51,5.0999999999999996,{"$f":"BDI!$E$26","v":0.23139999999999999},6.28,"COTAÇÃO"]
[null,null,17,"SELO DE TÓRAX VALVULADO:\n- Deve aderir ao corpo mesmo em ambiente molhado, mesmo com o corpo intensamente suado, mesmo com fluidos sanguíneos ou outros fluidos corporais presentes na superfície de aplicação; Não deve perder a adesão entre -40°C a 65°C; Deve possuir três canais com válvulas de alívio de pressão do pneumotórax hipertensivo; Dimensões aproximadas: 15cm x 15cm.*",10,"12311.01.05",122.93333333333334,0.1,10,0.92200000000000004,9.2200000000000006,{"$f":"BDI!$E$26","v":0.23139999999999999},11.35,"COTAÇÃO"]
[null,null,18,"SELO DE TÓRAX OCLUSIVO NÃO VALVULADO\n- Deve aderir ao corpo mesmo em ambiente molhado, mesmo com o corpo intensamente suado, mesmo com fluidos sanguíneos ou outros fluidos corporais presentes na superfície de aplicação; Não deve perder a adesão entre -40°C a 65°C; Não valvulado; Dimensões aproximadas: 15cm x 15cm.*",10,"12311.01.05",158.25,0.1,10,1.1868750000000001,11.868750000000002,{"$f":"BDI!$E$26","v":0.23139999999999999},14.62,"COTAÇÃO"]
[null,null,19,"AFERIDOR DE PRESSÃO - CARACTERÍSTICA(S): Aferidor de pressão digital automático de pulso - Com classificação de pressão e sensor de arritmia*",10,"12311.01.05",169.64499999999998,0.1,10,1.2723374999999999,12.723374999999999,{"$f":"BDI!$E$26","v":0.23139999999999999},15.67,"COTAÇÃO"]
[null,null,20,"OXÍMETRO DE DEDO:\n- Visor em tecnologia OLED, melhor visualização em qualquer condição de luminosidade; - Informa Saturação (SpO2) e Frequência Cardíaca; - Curva Plestimográfica.*",10,"12311.01.05",71.42,0.1,10,0.53565000000000007,5.3565000000000005,{"$f":"BDI!$E$26","v":0.23139999999999999},6.6,"COTAÇÃO"]
[null,null,21,"TERMÔMETRO DIGITAL INFRAVERMELHO*",10,"12311.01.05",85.575000000000003,0.1,10,0.64181250000000001,6.4181249999999999,{"$f":"BDI!$E$26","v":0.23139999999999999},7.9,"COTAÇÃO"]
[null,null,22,"MANTA TÉRMICA:\nCobertor Térmico para Resgate Aluminizado; confeccionada em polietileno aluminizado; não deforma; Prova d’água; resistente ao atrito com o solo; reflete o calor externo mantendo o calor interno; Comprimento aproximado: 2,10 m e Largura aproximada: 1,40 m.*",20,"12311.01.05",6.3450000000000006,0.1,10,4.7587500000000005E-2,0.9517500000000001,{"$f":"BDI!$E$26","v":0.23139999999999999},1.17,"COTAÇÃO"]
[null,null,23,"ESCADA DOBRÁVEL EM ALUMÍNIO DOBRÁVEL, 5 DEGRAUS *",8,"12311.01.99",168.27500000000001,0.1,10,{"$f":"G32*(1-H32)/(I32*12)","v":1.2620625000000001},{"$f":"J32*E32","v":10.096500000000001},{"$f":"BDI!$E$26","v":0.23139999999999999},{"$f":"ROUND(K32*(1+L32),2)","v":12.43},"COTAÇÃO"]
[null,null,24,"LANTERNA alcance 45metros, mínimo 140 lumens, 3 modos de iluminação (alto/econômico e SOS), alimentação por pilhas, anti-explosivas. Autonomia 1h30min de uso contínuo. *",68,"12311.01.99",50.66,0.1,10,0.37995000000000001,25.836600000000001,{"$f":"BDI!$E$26","v":0.23139999999999999},31.82,"COTAÇÃO"]
[null,null,25,"ALAVANCA DE 1,50 - MATERIAL: Alavanca de aço 1,50mx28mm *",3,"12311.01.99",362.4,0.1,10,2.7179999999999995,8.1539999999999981,{"$f":"BDI!$E$26","v":0.23139999999999999},10.039999999999999,"COTAÇÃO"]
[null,null,26,"KIT DE CHAVES DE FENDA - MATERIAL: Aço - CARACTERÍSTICA(S): Chaves de fenda 5/16x14, 3/16x12, 5/16x10, 3/16x8 *",8,"12311.01.99",43.22,0.1,10,0.32415000000000005,2.5932000000000004,{"$f":"BDI!$E$26","v":0.23139999999999999},3.19,"COTAÇÃO"]
[null,null,27,"KIT DE CHAVES DE BOCA - MATERIAL: Aço - CARACTERÍSTICA(S): Chaves de boca ns. 6, 8, 12, 13, 14, 16, 19 e 22 *",8,"12311.01.99",108,0.1,10,0.81,6.48,{"$f":"BDI!$E$26","v":0.23139999999999999},7.98,"COTAÇÃO"]
[null,null,28,"MARTELO DE UNHA - MATERIAL: Martelo de aço 33cm com cabo de madeira *",8,"12311.01.99",35.614999999999995,0.1,10,0.26711249999999997,2.1368999999999998,{"$f":"BDI!$E$26","v":0.23139999999999999},2.63,"COTAÇÃO"]
[null,null,29,"MARTELO BOLA - CARACTERÍSTICA(S): Martelo de aço, tipo bola, 800g, com cabo de madeira *",8,"12311.01.99",69.835000000000008,0.1,10,{"$f":"G38*(1-H38)/(I38*12)","v":0.52376250000000002},{"$f":"J38*E38","v":4.1901000000000002},{"$f":"BDI!$E$26","v":0.23139999999999999},{"$f":"ROUND(K38*(1+L38),2)","v":5.16},"COTAÇÃO"]
[null,null,30,"CAIXA DE FERRAMENTAS - Caixa Sanfonada 40cm com 5 compartimentos, pintura de alta resistência a pó com tratamento anti ferrugem, com alças fixas na parte superior. Material: Aço.*",8,"12311.01.99",125.465,0.1,10,0.94098750000000009,7.5279000000000007,{"$f":"BDI!$E$26","v":0.23139999999999999},9.27,"COTAÇÃO"]
[null,null,31,"PÁ - CARACTERÍSTICA(S): Pá de bico com cabo de 71cm *",3,"12311.01.99",42.555,0.1,10,0.31916250000000002,0.95748750000000005,{"$f":"BDI!$E$26","v":0.23139999999999999},1.18,"COTAÇÃO"]
[null,null,32,"ENXADA - CARACTERÍSTICA(S): Enxada Larga Forjada Leve com Cabo de Madeira 1,50m *",3,"12311.01.99",48.284999999999997,0.1,10,0.3621375,1.0864125,{"$f":"BDI!$E$26","v":0.23139999999999999},1.34,"COTAÇÃO"]
[null,null,33,"ALICATE UNIVERSAL - MATERIAL: Fabricado em aço cromo-vanádio, com cabo antideslizante com abas protetoras *",3,"12311.01.99",33.549999999999997,0.1,10,{"$f":"G42*(1-H42)/(I42*12)","v":0.25162499999999999},{"$f":"J42*E42","v":0.75487499999999996},{"$f":"BDI!$E$26","v":0.23139999999999999},{"$f":"ROUND(K42*(1+L42),2)","v":0.93},"COTAÇÃO"]
[]
[]
[null,null,"PAGAMENTO DA MANUTENÇÃO"]
[null,null,"ITEM","DESCRIÇÃO",null,null,null,"K (calculado)","MENSAL DEPR.","% MAN X DEP","MENSAL MAN.","BDI (%)","PREÇO TOTAL"]
[]
[null,null,null,null,null,null,null,{"$f":"H55","v":0.38556000000000001},{"$f":"SUM(M10:M42)","v":359.99},{"$f":"H48","v":0.38556000000000001},{"$f":"I48*H48","v":138.7977444},{"$f":"BDI!E26","v":0.23139999999999999},{"$f":"ROUND(K48*(1+L48),2)","v":170.92}]
[]
[null,null,null,null,"K1","K2","K3","K4"]
[null,null,null,null,0.85,1,0.8,1]
[null,null,null,null,"K5","K6","K7","K8"]
[null,null,null,null,1,0.6,0.5,1]
[null,null,null,null,"K9","K10","K11","RESULTADO"]
[null,null,null,"* a descrição de cada coeficiente segue abaixo",1.5,0.9,1.4,{"$f":"E51*F51*G51*H51*E53*F53*G53*H53*E55*F55*G55","v":0.38556000000000001}]
[]
[]
[null,null,"MATERIAL DE CONSUMO ASSOCIADO"]
[null,null,"ITEM","DESCRIÇÃO",null,null,null,"QUANTID/ANO","UNIDADE","VALOR DE AQ.","MENSAL MAT","BDI (%)","PREÇO TOTAL"]
[]
[null,null,null,null,null,null,null,null,null,null,{"$f":"J61*H61/12","v":0},{"$f":"BDI!E26","v":0.23139999999999999},{"$f":"ROUND(K61*(1+L61),2)","v":0}]
[]
[]
[null,null,"MATERIAL DE CONSUMO ASSOCIADO"]
[null,null,"ITEM","DESCRIÇÃO",null,null,null,null,null,null,null,null,"PREÇO TOTAL"]
[]
[null,null,1,"Componente DEPRECIAÇÃO",null,null,null,null,null,null,null,null,{"$f":"I48","v":359.99}]
[null,null,2,"Componente MANUTENÇÃO",null,null,null,null,null,null,null,null,{"$f":"M48","v":170.92}]
[null,null,3,"Componente MATERIAL DE CONSUMO ASSOCIADO",null,null,null,null,null,null,null,null,{"$f":"M61","v":0}]
[]
[null,null,null,null,null,null,null,null,null,null,null,"SOMATÓRIO TOTAL MENSAL",{"$f":"SUM(M66:M70)","v":530.91}]
[null,null,null,null,null,null,null,null,null,null,null,"SOMATÓRIO TOTAL ANUAL",{"$f":"M71*12","v":6370.92}]
[]
[]
[null,null,"MATERIAL DE CONSUMO ASSOCIADO"]
[null,null,"MEMÓRIA DE CÁLCULO DO COEFICIENTE DE CORRELAÇÃO MANUTENÇÃO X DEPRECIAÇÃO (K)"]
[]
[null,null,"JUSTIFICATIVAS",null,"TIPO","K1",null,"Condições de Trab","K4",null,"Tempo Vida (anos)","K6",null,"Temperatura","K8"]
[null,null,null,null,"Guindaste",0.5,null,"Em espera",0.4,null,1,0.6,null,"Muito quente (> 40º C)",1.3]
[null,null,"K1","Considerado o valor médio de 0,85","Caminhão-comum",0.8,null,"Leves",0.8,null,2,0.7,null,"Quente (30º a 40º C)",1.1000000000000001]
[null,null,"K2","Considerado o operador médio","Fora-de-estrada",1,null,"Médias",1,null,3,0.8,null,"Médio (10º a 30º C)",1]
[null,null,"K3","Consideradas ferramentas de primeira qualidade","Carregadeira",1,null,"Pesadas",1.4,null,4,0.9,null,"Frio (< 10º C)",1.2]
[null,null,"K4","Há todo o tipo de trabalho, foi considerado o valor médio","Escavadeira",1.4,null,"Severas",2,null,5,1]
[null,null,"K5","Considerando manutenção normal","Motoescrêiper",1.1000000000000001,null,null,null,null,6,1,null,"Ritmo de Trabalho","K9"]
[null,null,"K6","Equipamentos novos","Trator de esteira",1.2,null,"Manutenção","K5",null,7,1,null,"Folgado",0.9]
[null,null,"K7","220h por mês, 252 dias por ano",null,null,null,"Excelente",0.6,null,8,1.2,null,"Médio ",1]
[null,null,"K8","Clima médio","Qualid do Operador","K2",null,"Boa",0.8,null,9,1.3,null,"Com pressa",1.5]
[null,null,"K9","Ritmo de trabalho usualmente com pressa","Excelente",0.8,null,"Média",1,null,10,1.4]
[null,null,"K10","Considerado o operador médio","Boa",0.9,null,"Ruim ",1.5,null,11,2,null,"Conh do Serviço","K10"]
[null,null,"K11","Foi considerada a opção de aluguel a terceiros, ainda que a simulação seja dos custos do contratado, contudo a execução dos serviços é em local de terceiros","Média",1,null,"Inexistente",3,null,15,2,null,"Grande ",0.8]
[null,null,null,null,"Ruim",1.2,null,null,null,null,null,null,null,"Médio     ",0.9]
[null,null,null,null,"Péssima",2,null,"Horas de Uso ","K7",6000,1,null,null,"Pouco ",1]
[null,null,null,null,null,null,null,1000,0.5,8000,1.3]
[null,null,null,null,"Qualidade do Equip","K3",null,2000,0.5,10000,1.6,null,null,"Tipo do Serviço","K11"]
[null,null,null,null,"De primeira",0.8,null,3000,0.6,12000,1.9,null,null,"Mina ou Pedreira",0.8]
[null,null,null,null,"Média",1,null,4000,0.7,15000,2.2999999999999998,null,null,"Construção Geral",1]
[null,null,null,null,"Ruim",1.5,null,5000,0.9,20000,3,null,null,"Aluguel a Terceiros",1.4]
[]
[null,null,null,null,"Fonte: "]
[null,null,null,null,"MATTOS, Aldo Dórea. Como preparar orçamentos de obras. São Paulo: Pini, 2006. 281 p., il"]

{"sheet":"Não Rel - Mat Consumo","index":17,"n_rows":25,"n_cols":14,"rows_kept":25,"cut":false,"hidden":false,"merged":[[2,1,2,4],[3,1,3,13]]}
[]
[]
[]
[null,"MATERIAIS NÃO RELACIONADOS DIRETAMENTE A UM POSTO DE TRABALHO - AQUISIÇÃO SOB DEMANDA"]
[]
[]
[null,null,"ITEM","CÓDIGO","DESCRIÇÃO","MÉDIA CONSUMO MENSAL","QUANT ANUAL","UNIDADE","CUSTO UNITÁRIO","CUSTO TOTAL","BDI (%)","PREÇO TOTAL","FONTE","REFERÊNCIA"]
[]
[null,null,1,null,"COMPRESSAS DE GAZE - MATERIAL: Compressa de gaze 7,5x7,5 cm - CARACTERÍSTICA(S): 11 fios estéreis – pacote com 10 unidades cada.",null,30,"Pacote",0.73,{"$f":"I9*G9","v":21.9},{"$f":"BDI!E26","v":0.23139999999999999},{"$f":"ROUND(J9*(1+K9),2)","v":26.97},"Cotação"]
[null,null,2,null,"COMPRESSA CAMPO OPERATÓRIO - Alva 38g; tamanho 45x50cm, 4 camadas, 100% algodão, com 50 unidades cada pacote.",null,5,"Pacote",56.41,{"$f":"I10*G10","v":282.04999999999995},{"$f":"K9","v":0.23139999999999999},{"$f":"ROUND(J10*(1+K10),2)","v":347.32},"Cotação"]
[null,null,3,null,"ATADURAS DE CREPE Tamanho: 10cmx1,8m - pacote com 12 unidades cada - MATERIAL: Crepom.",null,8,"Pacote",6.7,53.6,{"$f":"K10","v":0.23139999999999999},66,"Cotação"]
[null,null,4,null,"ATADURAS DE CREPE Tamanho: 15cmx1,8m - pacote com 12 unidades cada - MATERIAL: Crepom.",null,8,"Pacote",12.990000000000002,103.92000000000002,0.23139999999999999,127.97,"Cotação"]
[null,null,5,null,"ATADURAS DE CREPE Tamanho: 20cmx1,8m - pacote com 12 unidades cada - MATERIAL: Crepom.",null,8,"Pacote",21.865000000000002,174.92000000000002,0.23139999999999999,215.4,"Cotação"]
[null,null,6,null,"ATADURA ELÁSTICA DE ALTA COMPRESSÃO E ELASTICIDADE - Tamanho 10 cm x 1,3 m; com presilha de fixação.",null,20,"Unidade",11.328333333333333,226.56666666666666,0.23139999999999999,278.99,"Cotação"]
[null,null,7,null,"ATADURA ELÁSTICA DE ALTA COMPRESSÃO E ELASTICIDADE - Tamanho 15 cm x 1,3 m; com presilha de fixação.",null,20,"Unidade",17.763333333333335,355.26666666666671,0.23139999999999999,437.48,"Cotação"]
[null,null,8,null,"PLÁSTICO PROTETOR DE QUEIMADURAS E VISCERAÇÕES - MATERIAL: Confeccionado em polietileno de baixa densidade, atóxico, transparente, 90cmx1,20m.",null,10,"Unidade",1.9849999999999999,19.849999999999998,0.23139999999999999,24.44,"Cotação"]
[null,null,9,null,"FRASCO DE SORO FISIOLÓGICO - MATERIAL: Solução Fisiológica de Cloreto de sódio 0.9%, 250ml.",null,24,"Frasco",4.6950000000000003,112.68,0.23139999999999999,138.75,"Cotação"]
[null,null,10,null,"FLACONETES DE SORO FISIOLÓGICO - Solução Fisiológica de Cloreto de sódio 0.9%, 10ml.",null,200,"Frasco",1.2033333333333334,240.66666666666669,0.23139999999999999,296.36,"Cotação"]
[null,null,11,null,"ÁLCOOL ETÍLICO HIDRATADO 70° INPM - MATERIAL: Álcool 70%",null,48,"Litro",5.3250000000000002,255.60000000000002,0.23139999999999999,314.75,"Cotação"]
[null,null,12,null,"ESPARADRAPO IMPERMEÁVEL - Branco - 10cm x 4,5m.",null,20,"Unidade",9.25,185,0.23139999999999999,227.81,"Cotação"]
[null,null,13,null,"FITA ADESIVA (CREPE) - 15mmx50mm.",null,20,"Unidade",6.3900000000000006,127.80000000000001,0.23139999999999999,157.37,"Cotação"]
[null,null,14,null,"FITA ADESIVA 45mmx45Mm - transparente.",null,20,"Unidade",6.2149999999999999,124.3,0.23139999999999999,153.06,"Cotação"]
[]
[null,null,null,null,null,null,null,null,null,null,"SOMATÓRIO TOTAL MENSAL",{"$f":"L25/12","v":234.38916666666668}]
[null,null,null,null,null,null,null,null,null,null,"SOMATÓRIO TOTAL ANUAL",{"$f":"SUM(L8:L23)","v":2812.67}]

{"sheet":"SREP","index":18,"n_rows":75,"n_cols":15,"rows_kept":75,"cut":false,"hidden":false,"merged":[[2,1,2,3],[3,1,3,14]]}
[]
[]
[]
[null,"SISTEMA DE REGISTRO ELETRÔNICO DE PRESENÇA - SREP"]
[]
[]
[null,null,"PAGAMENTO DA DEPRECIAÇÃO"]
[null,null,"ITEM","DESCRIÇÃO","QUANT ANUAL","CONTA SIAFI","VALOR DE AQ.","% RESIDUAL","VIDA ÚTIL","DEP. MENSAL","CUSTO TOTAL","BDI (%)","PREÇO TOTAL","FONTE","REFERÊNCIA"]
[]
[null,null,1,"Equipamento de Registro Eletrônico de Ponto, de parede, com teclado externo e leitor biométrico, em conformidade com a Portaria 1.510/2009 do MT",3,"12311.01.24\n(máquinas e equip\neletrônicos)",1597,0.1,10,{"$f":"G10*(1-H10)/(I10*12)","v":11.977499999999999},{"$f":"J10*E10","v":35.932499999999997},{"$f":"BDI!E26","v":0.23139999999999999},{"$f":"ROUND(K10*(1+L10),2)","v":44.25},"COTAÇÃO"]
[]
[]
[null,null,"PAGAMENTO DA MANUTENÇÃO"]
[null,null,"ITEM","DESCRIÇÃO",null,null,null,"K (calculado)","MENSAL DEPR.","% MAN X DEP","MENSAL MAN.","BDI (%)","PREÇO TOTAL"]
[]
[null,null,2,"Todos os itens",null,null,null,{"$f":"H23","v":0.27215999999999996},{"$f":"K10","v":35.932499999999997},{"$f":"H16","v":0.27215999999999996},{"$f":"I16*H16","v":9.7793891999999971},{"$f":"L10","v":0.23139999999999999},{"$f":"ROUND(K16*(1+L16),2)","v":12.04}]
[]
[null,null,null,null,"K1","K2","K3","K4"]
[null,null,null,null,0.5,1,0.8,1]
[null,null,null,null,"K5","K6","K7","K8"]
[null,null,null,null,1,0.6,0.6,1]
[null,null,null,null,"K9","K10","K11","RESULTADO"]
[null,null,null,"* a descrição de cada coeficiente segue abaixo",1.5,0.9,1.4,{"$f":"E19*F19*G19*H19*E21*F21*G21*H21*E23*F23*G23","v":0.27215999999999996}]
[]
[]
[null,null,"PAGAMENTO DO SOFTWARE"]
[null,null,"ITEM","DESCRIÇÃO",null,null,null,null,"QUANTIDADE","UNIDADE","UNIT. MENSAL","BDI (%)","PREÇO TOTAL"]
[]
[null,null,3,"Software Ponto Secullum 4 - manutenção e suporte técnico com backup - Web Nuvem - Mensalidade até 200 usuários",null,null,null,null,1,"Licença/mês",538.91999999999996,{"$f":"L35","v":0.23139999999999999},{"$f":"ROUND(K29*(1+L29),2)","v":663.63},"COTAÇÃO"]
[]
[]
[null,null,"MATERIAL DE CONSUMO ASSOCIADO"]
[null,null,"ITEM","DESCRIÇÃO",null,null,null,"QUANTID/ANO","UNIDADE","VALOR DE AQ.","MENSAL MAT","BDI (%)","PREÇO TOTAL"]
[]
[null,null,4,"Bobina térmica específica para o registrador eletrônico de ponto, com papel termossensível, superfície de impressão externa ao rolo, durabilidade de impressão mínima de 5 anos e comprimento mínimo de 300m","* estimado um gasto anual de 16 bobinas",null,null,{"$f":"ROUNDUP(SUM(Remunerações!E16)*4*22*12*0.05/300,0)","v":13},"Bobina",36.700000000000003,{"$f":"J35*H35/12","v":39.758333333333333},{"$f":"L16","v":0.23139999999999999},{"$f":"ROUND(K35*(1+L35),2)","v":48.96},"COTAÇÃO"]
[]
[]
[null,null,"MATERIAL DE CONSUMO ASSOCIADO"]
[null,null,"ITEM","DESCRIÇÃO",null,null,null,null,null,null,null,null,"PREÇO TOTAL"]
[]
[null,null,1,"Componente DEPRECIAÇÃO",null,null,null,null,null,null,null,null,{"$f":"M10","v":44.25}]
[null,null,2,"Componente MANUTENÇÃO",null,null,null,null,null,null,null,null,{"$f":"M16","v":12.04}]
[null,null,3,"Componente SOFTWARE",null,null,null,null,null,null,null,null,{"$f":"M29","v":663.63}]
[null,null,4,"Componente MATERIAL DE CONSUMO ASSOCIADO",null,null,null,null,null,null,null,null,{"$f":"M35","v":48.96}]
[]
[null,null,null,null,null,null,null,null,null,null,null,"SOMATÓRIO TOTAL MENSAL",{"$f":"SUM(M40:M45)","v":768.88}]
[null,null,null,null,null,null,null,null,null,null,null,"SOMATÓRIO TOTAL ANUAL",{"$f":"M46*12","v":9226.56}]
[]
[]
[null,null,"MATERIAL DE CONSUMO ASSOCIADO"]
[null,null,"MEMÓRIA DE CÁLCULO DO COEFICIENTE DE CORRELAÇÃO MANUTENÇÃO X DEPRECIAÇÃO (K)"]
[]
[null,null,"JUSTIFICATIVAS",null,"TIPO","K1",null,"Condições de Trab","K4",null,"Tempo Vida (anos)","K6",null,"Temperatura","K8"]
[null,null,null,null,"Guindaste",0.5,null,"Em espera",0.4,null,1,0.6,null,"Muito quente (> 40º C)",1.3]
[null,null,"K1","Considerado o valor mínimo de 0,5","Caminhão-comum",0.8,null,"Leves",0.8,null,2,0.7,null,"Quente (30º a 40º C)",1.1000000000000001]
[null,null,"K2","Considerado o operador médio","Fora-de-estrada",1,null,"Médias",1,null,3,0.8,null,"Médio (10º a 30º C)",1]
[null,null,"K3","Consideradas ferramentas de primeira qualidade","Carregadeira",1,null,"Pesadas",1.4,null,4,0.9,null,"Frio (< 10º C)",1.2]
[null,null,"K4","Foi considerado condições médias","Escavadeira",1.4,null,"Severas",2,null,5,1]
[null,null,"K5","Considerando manutenção normal","Motoescrêiper",1.1000000000000001,null,null,null,null,6,1,null,"Ritmo de Trabalho","K9"]
[null,null,"K6","Equipamentos novos","Trator de esteira",1.2,null,"Manutenção","K5",null,7,1,null,"Folgado",0.9]
[null,null,"K7","10h por dia, 252 dias por ano",null,null,null,"Excelente",0.6,null,8,1.2,null,"Médio ",1]
[null,null,"K8","Clima médio","Qualid do Operador","K2",null,"Boa",0.8,null,9,1.3,null,"Com pressa",1.5]
[null,null,"K9","Ritmo de trabalho usualmente com pressa","Excelente",0.8,null,"Média",1,null,10,1.4]
[null,null,"K10","Considerado o operador médio","Boa",0.9,null,"Ruim ",1.5,null,11,2,null,"Conh do Serviço","K10"]
[null,null,"K11","Foi considerada a opção de aluguel a terceiros, ainda que a simulação seja dos custos do contratado, contudo a execução dos serviços é em local de terceiros","Média",1,null,"Inexistente",3,null,15,2,null,"Grande ",0.8]
[null,null,null,null,"Ruim",1.2,null,null,null,null,null,null,null,"Médio     ",0.9]
[null,null,null,null,"Péssima",2,null,"Horas de Uso ","K7",6000,1,null,null,"Pouco ",1]
[null,null,null,null,null,null,null,1000,0.5,8000,1.3]
[null,null,null,null,"Qualidade do Equip","K3",null,2000,0.5,10000,1.6,null,null,"Tipo do Serviço","K11"]
[null,null,null,null,"De primeira",0.8,null,3000,0.6,12000,1.9,null,null,"Mina ou Pedreira",0.8]
[null,null,null,null,"Média",1,null,4000,0.7,15000,2.2999999999999998,null,null,"Construção Geral",1]
[null,null,null,null,"Ruim",1.5,null,5000,0.9,20000,3,null,null,"Aluguel a Terceiros",1.4]
[]
[null,null,null,null,"Fonte: "]
[null,null,null,null,"MATTOS, Aldo Dórea. Como preparar orçamentos de obras. São Paulo: Pini, 2006. 281 p., il"]

{"sheet":"Não Rel - Mat Cons Durável","index":19,"n_rows":38,"n_cols":15,"rows_kept":38,"cut":false,"hidden":true,"merged":[[2,1,2,4],[3,1,3,14]]}
[]
[]
[]
[null,"MATERIAIS DE CONSUMO PERMANENTE NÃO RELACIONADOS DIRETAMENTE A UM POSTO DE TRABALHO - AQUISIÇÃO SOB DEMANDA"]
[]
[]
[null,null,"ITEM","CÓDIGO","DESCRIÇÃO","ESTOQUE INICIAL","MÉDIA CONSUMO MENSAL","QTDE. ANUAL","UNIDADE","CUSTO UNITÁRIO","CUSTO TOTAL","BDI (%)","PREÇO TOTAL","FONTE","REFERÊNCIA"]
[]
[null,null,1,null,"Balde Plástico 12 Litros",null,8,166,"Unidade",null,{"$f":"J9*H9","v":0},{"$f":"BDI!E26","v":0.23139999999999999},{"$f":"ROUND(K9*(1+L9),2)","v":0},"Cotação"]
[null,null,2,null,"Balde plástico 20 litros",null,2,44,"Unidade",null,{"$f":"J10*H10","v":0},{"$f":"L9","v":0.23139999999999999},{"$f":"ROUND(K10*(1+L10),2)","v":0},"Cotação"]
[null,null,3,null,"Balde Plástico 60 Litros",null,1,16,"Unidade",null,0,{"$f":"L10","v":0.23139999999999999},0,"Cotação"]
[null,null,4,null,"Capa para chuva com capuz, cor amarela, longa, tamanho G",null,2,32,"Unidade",null,0,0.23139999999999999,0,"Cotação"]
[null,null,5,null,"Chapéu legionário (com proteção p/ nuca)",null,2,44,"Unidade",null,0,0.23139999999999999,0,"Cotação"]
[null,null,6,null,"Conjunto completo para limpeza de rodapé (cabo, suporte e fibra) (ref. Braslimpia ST 304 e FP262 ou similar)",null,0,8,"Unidade",null,0,0.23139999999999999,0,"Cotação"]
[null,null,7,null,"Conjunto completo para Mop pó, com amarração (cabo, armação e cabeleira) (ref. Mop seco Euro CJ 60E ou similar)",null,0,8,"Unidade",null,0,0.23139999999999999,0,"Cotação"]
[null,null,8,null,"Espátula de aço com cabo de madeira 4\" 101x185mm, cabo amarelo (ref. Max Ferramentas ou similar)",null,2,36,"Unidade",null,0,0.23139999999999999,0,"Cotação"]
[null,null,9,null,"Extensão elétrica com carretel 2 X 2,5mm² X 50,00 m – suporte com carretel injetado em polipropileno com diâmetro de 290mm com 3 tomadas universais",null,0,10,"Unidade",null,0,0.23139999999999999,0,"Cotação"]
[null,null,10,null,"Fita para isolamento de área zebrada amarelo e preta ultra resistente 7,6cm x 200m",null,0,10,"Unidade",null,0,0.23139999999999999,0,"Cotação"]
[null,null,11,null,"Macacão de segurança Tipo 6 (ref. SteelgenVicsa, Steelflex ou outro de desempenho e qualidade similar ou superior).",null,4,60,"Unidade",null,0,0.23139999999999999,0,"Cotação"]
[null,null,12,null,"Mangueira Top cristal Ø3/4”x 250m em PVC flexível, camada em poliester trançado, para pressões de 6 bar (ref. Tramontina Mult Johnson ou outro de desempenho e qualidade similar ou superior)",null,0,5,"Unidade",null,0,0.23139999999999999,0,"Cotação"]
[null,null,13,null,"Pá para lixo, plástica, com cabo longo 90 cm (ref. 15300 marca Tomki São Bernardo, Madetec Johnson ou outro de desempenho e qualidade similar ou superior)",null,2,44,"Unidade",null,0,0.23139999999999999,0,"Cotação"]
[null,null,14,null,"Placa de sinalização em vinil para piso molhado",null,0,40,"Unidade",null,0,0.23139999999999999,0,"Cotação"]
[null,null,15,null,"Pulverizador Costal Simétrico 20L (ref.Guarany, Vulcan,Vonder ou outro de desempenho e qualidade similar ou superior).",null,0,2,"Unidade",null,0,0.23139999999999999,0,"Cotação"]
[null,null,16,null,"Rodo P/ Pia de Banheiro manual anatômico – (ref. Guirado, Bettani ou Dalcim ou outro de desempenho e qualidade similar ou superior)",null,1,27,"Unidade",null,0,0.23139999999999999,0,"Cotação"]
[null,null,17,null,"Rodo de 40cm de madeira/plástico (borracha dupla) com cabo 1,50 m – marcas Tomki, Guirado, Bettani, Dalcim ou outro de desempenho e qualidade similar ou superior)",null,10,200,"Unidade",null,0,0.23139999999999999,0,"Cotação"]
[null,null,18,null,"Rodo de 60cm de madeira/plástico (borracha dupla) com cabo 1,50m (ref. Tomki, Guirado, Bettani, Dalcim ou outro de desempenho e qualidade similar ou superior)",null,8,131,"Unidade",null,0,0.23139999999999999,0,"Cotação"]
[null,null,19,null,"Rodo de 90cm de madeira/plástico (borracha dupla) com cabo 1,50m (ref. Tomki, Guirado, Bettani, Dalcim ou outro de desempenho e qualidade similar ou superior)",null,2,39,"Unidade",null,0,0.23139999999999999,0,"Cotação"]
[null,null,20,null,"Saco para aspirador doméstico pequeno descartável (ref. Eletrolux Silent Prof ou Leo da Soteco ou outro de desempenho e qualidade similar ou superior)",null,3,48,"Unidade",null,0,0.23139999999999999,0,"Cotação"]
[null,null,21,null,"Saco para aspirador industrial água e pó descartável (ref. Karcher A2104 ou Eletrolux GT 3000 Pro ou outro de desempenho e qualidade similar ou superior)",null,2,28,"Unidade",null,0,0.23139999999999999,0,"Cotação"]
[null,null,22,null,"Suporte para papel higiênico (ref. Santher ou outro de desempenho e qualidade similar ou superior)",null,2,369,"Unidade",null,0,0.23139999999999999,0,"Cotação"]
[null,null,23,null,"Suporte para papel toalha (ref. Santher ou outro de desempenho e qualidade similar ou superior)",null,2,409,"Unidade",null,0,0.23139999999999999,0,"Cotação"]
[null,null,24,null,"Suporte para saboneteira (ref. Santher ou outro de desempenho e qualidade similar ou superior)",null,2,254,"Unidade",null,0,0.23139999999999999,0,"Cotação"]
[null,null,25,null,"Vassoura de Pêlo 40cm nylon com cabo 1,50 m (ref. Tomki, Guirado, Bettani, Dalcim ou outro de desempenho e qualidade similar ou superior)",null,2,36,"Unidade",null,0,{"$f":"L31","v":0.23139999999999999},{"$f":"ROUND(K33*(1+L33),2)","v":0},"Cotação"]
[null,null,26,null,"Vassoura Piaçava nº 3 com cabo 1,50m (ref. Guirado, Bettani, Dalcim ou outro de desempenho e qualidade similar ou superior)",null,8,126,"Unidade",null,{"$f":"J34*H34","v":0},{"$f":"L31","v":0.23139999999999999},0,"Cotação"]
[null,null,27,null,"Vassoura para Vaso Sanitário com cabo de madeira (ref. Guirado, Bettani, Dalcim ou outro de desempenho e qualidade similar ou superior)",null,10,180,"Unidade",null,0,{"$f":"L32","v":0.23139999999999999},0,"Cotação"]
[]
[null,null,null,null,null,null,null,null,null,null,null,"SOMATÓRIO TOTAL MENSAL",{"$f":"M38/12","v":0}]
[null,null,null,null,null,null,null,null,null,null,null,"SOMATÓRIO TOTAL ANUAL",{"$f":"SUM(M8:M36)","v":0}]

{"sheet":"Não Rel - Serviços","index":20,"n_rows":11,"n_cols":13,"rows_kept":11,"cut":false,"hidden":true,"merged":[[1,1,1,4],[2,1,2,12]]}
[]
[]
[null,"SERVIÇOS NÃO RELACIONADOS DIRETAMENTE A UM POSTO DE TRABALHO - SOB DEMANDA"]
[]
[]
[null,null,"ITEM","CÓDIGO","DESCRIÇÃO","QUANT ANUAL","UNIDADE","CUSTO UNITÁRIO","CUSTO TOTAL","BDI (%)","PREÇO TOTAL","FONTE","REFERÊNCIA"]
[]
[null,null,1,null,"Serviços de desinsetização e desratização em uma área de 59.203 m²",null,"aplicações",8422.5,{"$f":"H8*F8","v":0},{"$f":"BDI!E26","v":0.23139999999999999},{"$f":"ROUND(I8*(1+J8),2)","v":0},"Cotação"]
[]
[null,null,null,null,null,null,null,null,null,"SOMATÓRIO TOTAL MENSAL",{"$f":"K11/12","v":0}]
[null,null,null,null,null,null,null,null,null,"SOMATÓRIO TOTAL ANUAL",{"$f":"SUM(K7:K9)","v":0}]

{"sheet":"Not. Demanda","index":21,"n_rows":51,"n_cols":8,"rows_kept":51,"cut":false,"hidden":true,"merged":[[1,1,1,3],[2,1,2,7]]}
[]
[]
[null,"ADICIONAL NOTURNO SOB DEMANDA"]
[]
[]
[null,null,"CATEGORIAS",null,null,null,"HORAS / MÊS","% NOTURNA"]
[]
[null,null,8,{"$f":"HLOOKUP($C8,'Dados Gerais'!$D$5:$BK$10,6)","v":"BOMBEIRO CIVIL BÁSICO NOTURNO"},null,null,null,0.22500000000000001]
[null,null,9,{"$f":"HLOOKUP($C9,'Dados Gerais'!$D$5:$BK$10,6)","v":"BOMBEIRO CIVIL BÁSICO NOTURNO"},null,null,null,0.22500000000000001]
[]
[]
[null,null,"AJUSTE DE HORAS FICTAS",null,"AJUSTE H.NOT","HORA NORMAL","H.FICTAS/MÊS","H.ÚTEIS/MÊS"]
[]
[null,null,8,{"$f":"HLOOKUP($C14,'Dados Gerais'!$D$5:$BK$10,6)","v":"BOMBEIRO CIVIL BÁSICO NOTURNO"},60,60,{"$f":"G8*(F14/E14)","v":0},{"$f":"HLOOKUP(C14,'Dados Gerais'!$D$5:$L$16,12,0)","v":{"$error":"#N/A"}}]
[null,null,9,{"$f":"HLOOKUP($C15,'Dados Gerais'!$D$5:$BK$10,6)","v":"BOMBEIRO CIVIL BÁSICO NOTURNO"},60,60,{"$f":"G9*(F15/E15)","v":0},{"$f":"HLOOKUP(C15,'Dados Gerais'!$D$5:$L$16,12,0)","v":{"$error":"#N/A"}}]
[]
[]
[null,null,"VALOR DO ADICIONAL NOTURNO",null,null,"SALÁRIO MÊS","VL.H.NORMAL","ADIC.H.FICTAS"]
[]
[null,null,8,{"$f":"HLOOKUP($C20,'Dados Gerais'!$D$5:$BK$10,6)","v":"BOMBEIRO CIVIL BÁSICO NOTURNO"},null,{"$f":"HLOOKUP(C20,'Dados Gerais'!$D$5:$L$12,8,0)","v":{"$error":"#N/A"}},{"$f":"F20/H14","v":{"$error":"#N/A"}},{"$f":"G20*(H8)","v":{"$error":"#N/A"}}]
[null,null,9,{"$f":"HLOOKUP($C21,'Dados Gerais'!$D$5:$BK$10,6)","v":"BOMBEIRO CIVIL BÁSICO NOTURNO"},null,{"$f":"HLOOKUP(C21,'Dados Gerais'!$D$5:$L$12,8,0)","v":{"$error":"#N/A"}},{"$f":"F21/H15","v":{"$error":"#N/A"}},{"$f":"G21*(H9)","v":{"$error":"#N/A"}}]
[]
[]
[null,null,"RESUMO DO ADICIONAL NOTURNO SOB DEMANDA"]
[null,null,"TOTAIS MENSAIS",null,null,null,"PREÇO MENSAL"]
[]
[null,null,8,{"$f":"HLOOKUP($C27,'Dados Gerais'!$D$5:$BK$10,6)","v":"BOMBEIRO CIVIL BÁSICO NOTURNO"},null,null,{"$f":"H20*G14","v":{"$error":"#N/A"}}]
[null,null,9,{"$f":"HLOOKUP($C28,'Dados Gerais'!$D$5:$BK$10,6)","v":"BOMBEIRO CIVIL BÁSICO NOTURNO"},null,null,{"$f":"H21*G15","v":{"$error":"#N/A"}}]
[]
[null,null,null,null,null,"SOMATÓRIO TOTAL MENSAL",{"$f":"SUM(G27:G29)","v":{"$error":"#N/A"}}]
[null,null,null,null,null,"SOMATÓRIO TOTAL ANUAL",{"$f":"G30*12","v":{"$error":"#N/A"}}]
[]
[]
[null,null,"ENCARGOS SOCIAIS E BDI SOBRE ADICIONAL NOTURNO SOB DEMANDA"]
[null,null,"TOTAIS MENSAIS",null,null,"PERCENTUAIS","PREÇO MENSAL"]
[]
[null,null,null,"ENCARGOS SOCIAIS",null,{"$f":"'Encargos Sociais'!$E$46","v":0.73899999999999999},{"$f":"F37*G30","v":{"$error":"#N/A"}}]
[null,null,null,"BDI",null,{"$f":"BDI!$E$26","v":0.23139999999999999},{"$f":"F38*(G30+G37)","v":{"$error":"#N/A"}}]
[]
[null,null,null,null,null,"SOMATÓRIO TOTAL MENSAL",{"$f":"SUM(G37:G39)","v":{"$error":"#N/A"}}]
[null,null,null,null,null,"SOMATÓRIO TOTAL ANUAL",{"$f":"G40*12","v":{"$error":"#N/A"}}]
[]
[]
[null,null,"VALOR TOTAL ADICIONAL NOTURNO SOB DEMANDA (COM ENCARGOS SOCIAIS E BDI INCLUSOS)"]
[null,null,"TOTAIS MENSAIS",null,null,"PERCENTUAIS","PREÇO MENSAL"]
[]
[null,null,null,"ENCARGOS SOCIAIS",null,{"$f":"'Encargos Sociais'!$E$46","v":0.73899999999999999},{"$f":"G27+G37","v":{"$error":"#N/A"}}]
[null,null,null,"BDI",null,{"$f":"BDI!$E$26","v":0.23139999999999999},{"$f":"G28+G38","v":{"$error":"#N/A"}}]
[]
[null,null,null,null,null,"SOMATÓRIO TOTAL MENSAL",{"$f":"SUM(G47:G49)","v":{"$error":"#N/A"}}]
[null,null,null,null,null,"SOMATÓRIO TOTAL ANUAL",{"$f":"G50*12","v":{"$error":"#N/A"}}]

{"sheet":"Mat Cons","index":22,"n_rows":28,"n_cols":128,"rows_kept":28,"cut":false,"hidden":true,"merged":[[9,1,9,3],[10,1,10,5]]}
[null,null,"CÂMARA DOS DEPUTADOS"]
[null,null,"DEPARTAMENTO TÉCNICO"]
[null,null,"Coordenação de Planejamento e Gestão"]
[]
[null,null,"Data:",{"$f":"'Dados Gerais'!#REF!","v":{"$error":"#REF!"}}]
[null,null,"Processo:",{"$f":"'Dados Gerais'!#REF!","v":{"$error":"#REF!"}}]
[null,null,"Objeto:",{"$f":"'Dados Gerais'!#REF!","v":{"$error":"#REF!"}}]
[]
[]
[]
[null,"MATERIAIS DE CONSUMO RELACIONADOS AO POSTO - AQUISIÇÃO",null,null,null,null,null,null,1,null,{"$f":"I11+1","v":2},null,{"$f":"K11+1","v":3},null,{"$f":"M11+1","v":4},null,{"$f":"O11+1","v":5},null,{"$f":"Q11+1","v":6},null,{"$f":"S11+1","v":7},null,{"$f":"U11+1","v":8},null,{"$f":"W11+1","v":9},null,{"$f":"Y11+1","v":10},null,{"$f":"AA11+1","v":11},null,{"$f":"AC11+1","v":12},null,{"$f":"AE11+1","v":13},null,{"$f":"AG11+1","v":14},null,{"$f":"AI11+1","v":15},null,{"$f":"AK11+1","v":16},null,{"$f":"AM11+1","v":17},null,{"$f":"AO11+1","v":18},null,{"$f":"AQ11+1","v":19},null,{"$f":"AS11+1","v":20},null,{"$f":"AU11+1","v":21},null,{"$f":"AW11+1","v":22},null,{"$f":"AY11+1","v":23},null,{"$f":"BA11+1","v":24},null,{"$f":"BC11+1","v":25},null,{"$f":"BE11+1","v":26},null,{"$f":"BG11+1","v":27},null,{"$f":"BI11+1","v":28},null,{"$f":"BK11+1","v":29},null,{"$f":"BM11+1","v":30},null,{"$f":"BO11+1","v":31},null,{"$f":"BQ11+1","v":32},null,{"$f":"BS11+1","v":33},null,{"$f":"BU11+1","v":34},null,{"$f":"BW11+1","v":35},null,{"$f":"BY11+1","v":36},null,{"$f":"CA11+1","v":37},null,{"$f":"CC11+1","v":38},null,{"$f":"CE11+1","v":39},null,{"$f":"CG11+1","v":40},null,{"$f":"CI11+1","v":41},null,{"$f":"CK11+1","v":42},null,{"$f":"CM11+1","v":43},null,{"$f":"CO11+1","v":44},null,{"$f":"CQ11+1","v":45},null,{"$f":"CS11+1","v":46},null,{"$f":"CU11+1","v":47},null,{"$f":"CW11+1","v":48},null,{"$f":"CY11+1","v":49},null,{"$f":"DA11+1","v":50},null,{"$f":"DC11+1","v":51},null,{"$f":"DE11+1","v":52},null,{"$f":"DG11+1","v":53},null,{"$f":"DI11+1","v":54},null,{"$f":"DK11+1","v":55},null,{"$f":"DM11+1","v":56},null,{"$f":"DO11+1","v":57},null,{"$f":"DQ11+1","v":58},null,{"$f":"DS11+1","v":59},null,{"$f":"DU11+1","v":60}]
[]
[null,null,null,null,null,null,null,null,{"$f":"ROUND(SUM(J12:J65),2)","v":0},null,{"$f":"ROUND(SUM(L12:L65),2)","v":0},null,{"$f":"ROUND(SUM(N12:N65),2)","v":0},null,{"$f":"ROUND(SUM(P12:P65),2)","v":0},null,{"$f":"ROUND(SUM(R12:R65),2)","v":0},null,{"$f":"ROUND(SUM(T12:T65),2)","v":0},null,{"$f":"ROUND(SUM(V12:V65),2)","v":0},null,{"$f":"ROUND(SUM(X12:X65),2)","v":0},null,{"$f":"ROUND(SUM(Z12:Z65),2)","v":0},null,{"$f":"ROUND(SUM(AB12:AB65),2)","v":0},null,{"$f":"ROUND(SUM(AD12:AD65),2)","v":0},null,{"$f":"ROUND(SUM(AF12:AF65),2)","v":0},null,{"$f":"ROUND(SUM(AH12:AH65),2)","v":0},null,{"$f":"ROUND(SUM(AJ12:AJ65),2)","v":0},null,{"$f":"ROUND(SUM(AL12:AL65),2)","v":0},null,{"$f":"ROUND(SUM(AN12:AN65),2)","v":0},null,{"$f":"ROUND(SUM(AP12:AP65),2)","v":0},null,{"$f":"ROUND(SUM(AR12:AR65),2)","v":0},null,{"$f":"ROUND(SUM(AT12:AT65),2)","v":0},null,{"$f":"ROUND(SUM(AV12:AV65),2)","v":0},null,{"$f":"ROUND(SUM(AX12:AX65),2)","v":0},null,{"$f":"ROUND(SUM(AZ12:AZ65),2)","v":0},null,{"$f":"ROUND(SUM(BB12:BB65),2)","v":0},null,{"$f":"ROUND(SUM(BD12:BD65),2)","v":0},null,{"$f":"ROUND(SUM(BF12:BF65),2)","v":0},null,{"$f":"ROUND(SUM(BH12:BH65),2)","v":0},null,{"$f":"ROUND(SUM(BJ12:BJ65),2)","v":0},null,{"$f":"ROUND(SUM(BL12:BL65),2)","v":0},null,{"$f":"ROUND(SUM(BN12:BN65),2)","v":0},null,{"$f":"ROUND(SUM(BP12:BP65),2)","v":0},null,{"$f":"ROUND(SUM(BR12:BR65),2)","v":0},null,{"$f":"ROUND(SUM(BT12:BT65),2)","v":0},null,{"$f":"ROUND(SUM(BV12:BV65),2)","v":0},null,{"$f":"ROUND(SUM(BX12:BX65),2)","v":0},null,{"$f":"ROUND(SUM(BZ12:BZ65),2)","v":0},null,{"$f":"ROUND(SUM(CB12:CB65),2)","v":0},null,{"$f":"ROUND(SUM(CD12:CD65),2)","v":0},null,{"$f":"ROUND(SUM(CF12:CF65),2)","v":0},null,{"$f":"ROUND(SUM(CH12:CH65),2)","v":0},null,{"$f":"ROUND(SUM(CJ12:CJ65),2)","v":0},null,{"$f":"ROUND(SUM(CL12:CL65),2)","v":0},null,{"$f":"ROUND(SUM(CN12:CN65),2)","v":0},null,{"$f":"ROUND(SUM(CP12:CP65),2)","v":0},null,{"$f":"ROUND(SUM(CR12:CR65),2)","v":0},null,{"$f":"ROUND(SUM(CT12:CT65),2)","v":0},null,{"$f":"ROUND(SUM(CV12:CV65),2)","v":0},null,{"$f":"ROUND(SUM(CX12:CX65),2)","v":0},null,{"$f":"ROUND(SUM(CZ12:CZ65),2)","v":0},null,{"$f":"ROUND(SUM(DB12:DB65),2)","v":0},null,{"$f":"ROUND(SUM(DD12:DD65),2)","v":0},null,{"$f":"ROUND(SUM(DF12:DF65),2)","v":0},null,{"$f":"ROUND(SUM(DH12:DH65),2)","v":0},null,{"$f":"ROUND(SUM(DJ12:DJ65),2)","v":0},null,{"$f":"ROUND(SUM(DL12:DL65),2)","v":0},null,{"$f":"ROUND(SUM(DN12:DN65),2)","v":0},null,{"$f":"ROUND(SUM(DP12:DP65),2)","v":0},null,{"$f":"ROUND(SUM(DR12:DR65),2)","v":0},null,{"$f":"ROUND(SUM(DT12:DT65),2)","v":0},null,{"$f":"ROUND(SUM(DV12:DV65),2)","v":0},null,{"$f":"ROUND(SUM(DX12:DX65),2)","v":0}]
[null,null,"CATEGORIAS",null,null,"QUANTIDADE"]
[null,null,null,null,null,null,null,null,{"$f":"IF($C15=I$11,1,0)","v":0}]
[null,null,null,null,null,null,null,null,0,null,{"$f":"IF($C16=K$11,1,0)","v":0},null,{"$f":"IF($C16=M$11,1,0)","v":0},null,{"$f":"IF($C16=O$11,1,0)","v":0},null,{"$f":"IF($C16=Q$11,1,0)","v":0},null,{"$f":"IF($C16=S$11,1,0)","v":0},null,{"$f":"IF($C16=U$11,1,0)","v":0},null,{"$f":"IF($C16=W$11,1,0)","v":0},null,{"$f":"IF($C16=Y$11,1,0)","v":0},null,{"$f":"IF($C16=AA$11,1,0)","v":0},null,{"$f":"IF($C16=AC$11,1,0)","v":0},null,{"$f":"IF($C16=AE$11,1,0)","v":0},null,{"$f":"IF($C16=AG$11,1,0)","v":0},null,{"$f":"IF($C16=AI$11,1,0)","v":0},null,{"$f":"IF($C16=AK$11,1,0)","v":0},null,{"$f":"IF($C16=AM$11,1,0)","v":0},null,{"$f":"IF($C16=AO$11,1,0)","v":0},null,{"$f":"IF($C16=AQ$11,1,0)","v":0},null,{"$f":"IF($C16=AS$11,1,0)","v":0},null,{"$f":"IF($C16=AU$11,1,0)","v":0},null,{"$f":"IF($C16=AW$11,1,0)","v":0},null,{"$f":"IF($C16=AY$11,1,0)","v":0},null,{"$f":"IF($C16=BA$11,1,0)","v":0},null,{"$f":"IF($C16=BC$11,1,0)","v":0},null,{"$f":"IF($C16=BE$11,1,0)","v":0},null,{"$f":"IF($C16=BG$11,1,0)","v":0},null,{"$f":"IF($C16=BI$11,1,0)","v":0},null,{"$f":"IF($C16=BK$11,1,0)","v":0},null,{"$f":"IF($C16=BM$11,1,0)","v":0},null,{"$f":"IF($C16=BO$11,1,0)","v":0},null,{"$f":"IF($C16=BQ$11,1,0)","v":0},null,{"$f":"IF($C16=BS$11,1,0)","v":0},null,{"$f":"IF($C16=BU$11,1,0)","v":0},null,{"$f":"IF($C16=BW$11,1,0)","v":0},null,{"$f":"IF($C16=BY$11,1,0)","v":0},null,{"$f":"IF($C16=CA$11,1,0)","v":0},null,{"$f":"IF($C16=CC$11,1,0)","v":0},null,{"$f":"IF($C16=CE$11,1,0)","v":0},null,{"$f":"IF($C16=CG$11,1,0)","v":0},null,{"$f":"IF($C16=CI$11,1,0)","v":0},null,{"$f":"IF($C16=CK$11,1,0)","v":0},null,{"$f":"IF($C16=CM$11,1,0)","v":0},null,{"$f":"IF($C16=CO$11,1,0)","v":0},null,{"$f":"IF($C16=CQ$11,1,0)","v":0},null,{"$f":"IF($C16=CS$11,1,0)","v":0},null,{"$f":"IF($C16=CU$11,1,0)","v":0},null,{"$f":"IF($C16=CW$11,1,0)","v":0},null,{"$f":"IF($C16=CY$11,1,0)","v":0},null,{"$f":"IF($C16=DA$11,1,0)","v":0},null,{"$f":"IF($C16=DC$11,1,0)","v":0},null,{"$f":"IF($C16=DE$11,1,0)","v":0},null,{"$f":"IF($C16=DG$11,1,0)","v":0},null,{"$f":"IF($C16=DI$11,1,0)","v":0},null,{"$f":"IF($C16=DK$11,1,0)","v":0},null,{"$f":"IF($C16=DM$11,1,0)","v":0},null,{"$f":"IF($C16=DO$11,1,0)","v":0},null,{"$f":"IF($C16=DQ$11,1,0)","v":0},null,{"$f":"IF($C16=DS$11,1,0)","v":0},null,{"$f":"IF($C16=DU$11,1,0)","v":0},null,{"$f":"IF($C16=DW$11,1,0)","v":0}]
[null,null,null,null,null,null,null,null,0,null,0,null,0,null,0,null,0,null,0,null,0,null,0,null,0,null,0,null,0,null,0,null,0,null,0,null,0,null,0,null,0,null,0,null,0,null,0,null,0,null,0,null,0,null,0,null,0,null,0,null,0,null,0,null,0,null,0,null,0,null,0,null,0,null,0,null,0,null,0,null,0,null,0,null,0,null,0,null,0,null,0,null,0,null,0,null,0,null,0,null,0,null,0,null,0,null,0,null,0,null,0,null,0,null,0,null,0,null,0,null,0,null,0,null,0,null,0]
[null,null,null,null,null,null,null,null,0,null,0,null,0,null,0,null,0,null,0,null,0,null,0,null,0,null,0,null,0,null,0,null,0,null,0,null,0,null,0,null,0,null,0,null,0,null,0,null,0,null,0,null,0,null,0,null,0,null,0,null,0,null,0,null,0,null,0,null,0,null,0,null,0,null,0,null,0,null,0,null,0,null,0,null,0,null,0,null,0,null,0,null,0,null,0,null,0,null,0,null,0,null,0,null,0,null,0,null,0,null,0,null,0,null,0,null,0,null,0,null,0,null,0,null,0,null,0]
[null,null,null,null,null,null,null,null,0,null,0,null,0,null,0,null,0,null,0,null,0,null,0,null,0,null,0,null,0,null,0,null,0,null,0,null,0,null,0,null,0,null,0,null,0,null,0,null,0,null,0,null,0,null,0,null,0,null,0,null,0,null,0,null,0,null,0,null,0,null,0,null,0,null,0,null,0,null,0,null,0,null,0,null,0,null,0,null,0,null,0,null,0,null,0,null,0,null,0,null,0,null,0,null,0,null,0,null,0,null,0,null,0,null,0,null,0,null,0,null,0,null,0,null,0,null,0]
[null,null,null,null,null,null,null,null,0,null,0,null,0,null,0,null,0,null,0,null,0,null,0,null,0,null,0,null,0,null,0,null,0,null,0,null,0,null,0,null,0,null,0,null,0,null,0,null,0,null,0,null,0,null,0,null,0,null,0,null,0,null,0,null,0,null,0,null,0,null,0,null,0,null,0,null,0,null,0,null,0,null,0,null,0,null,0,null,0,null,0,null,0,null,0,null,0,null,0,null,0,null,0,null,0,null,0,null,0,null,0,null,0,null,0,null,0,null,0,null,0,null,0,null,0,null,0]
[null,null,null,null,null,null,null,null,0,null,0,null,0,null,0,null,0,null,0,null,0,null,0,null,0,null,0,null,0,null,0,null,0,null,0,null,0,null,0,null,0,null,0,null,0,null,0,null,0,null,0,null,0,null,0,null,0,null,0,null,0,null,0,null,0,null,0,null,0,null,0,null,0,null,0,null,0,null,0,null,0,null,0,null,0,null,0,null,0,null,0,null,0,null,0,null,0,null,0,null,0,null,0,null,0,null,0,null,0,null,0,null,0,null,0,null,0,null,0,null,0,null,0,null,0,null,0]
[null,null,null,null,null,null,null,null,0]
[]
[null,null,"ITEM","DESCRIÇÃO","QUANT ANUAL","VALOR"]
[null,null,null,null,null,null,null,null,null,{"$f":"IF(SUM(I$15:I$22)>0,$E25*$F25,0)","v":0},null,{"$f":"IF(SUM(K$15:K$22)>0,$E25*$F25,0)","v":0},null,{"$f":"IF(SUM(M$15:M$22)>0,$E25*$F25,0)","v":0},null,{"$f":"IF(SUM(O$15:O$22)>0,$E25*$F25,0)","v":0},null,{"$f":"IF(SUM(Q$15:Q$22)>0,$E25*$F25,0)","v":0},null,{"$f":"IF(SUM(S$15:S$22)>0,$E25*$F25,0)","v":0},null,{"$f":"IF(SUM(U$15:U$22)>0,$E25*$F25,0)","v":0},null,{"$f":"IF(SUM(W$15:W$22)>0,$E25*$F25,0)","v":0},null,{"$f":"IF(SUM(Y$15:Y$22)>0,$E25*$F25,0)","v":0},null,{"$f":"IF(SUM(AA$15:AA$22)>0,$E25*$F25,0)","v":0},null,{"$f":"IF(SUM(AC$15:AC$22)>0,$E25*$F25,0)","v":0},null,{"$f":"IF(SUM(AE$15:AE$22)>0,$E25*$F25,0)","v":0},null,{"$f":"IF(SUM(AG$15:AG$22)>0,$E25*$F25,0)","v":0},null,{"$f":"IF(SUM(AI$15:AI$22)>0,$E25*$F25,0)","v":0},null,{"$f":"IF(SUM(AK$15:AK$22)>0,$E25*$F25,0)","v":0},null,{"$f":"IF(SUM(AM$15:AM$22)>0,$E25*$F25,0)","v":0},null,{"$f":"IF(SUM(AO$15:AO$22)>0,$E25*$F25,0)","v":0},null,{"$f":"IF(SUM(AQ$15:AQ$22)>0,$E25*$F25,0)","v":0},null,{"$f":"IF(SUM(AS$15:AS$22)>0,$E25*$F25,0)","v":0},null,{"$f":"IF(SUM(AU$15:AU$22)>0,$E25*$F25,0)","v":0},null,{"$f":"IF(SUM(AW$15:AW$22)>0,$E25*$F25,0)","v":0},null,{"$f":"IF(SUM(AY$15:AY$22)>0,$E25*$F25,0)","v":0},null,{"$f":"IF(SUM(BA$15:BA$22)>0,$E25*$F25,0)","v":0},null,{"$f":"IF(SUM(BC$15:BC$22)>0,$E25*$F25,0)","v":0},null,{"$f":"IF(SUM(BE$15:BE$22)>0,$E25*$F25,0)","v":0},null,{"$f":"IF(SUM(BG$15:BG$22)>0,$E25*$F25,0)","v":0},null,{"$f":"IF(SUM(BI$15:BI$22)>0,$E25*$F25,0)","v":0},null,{"$f":"IF(SUM(BK$15:BK$22)>0,$E25*$F25,0)","v":0},null,{"$f":"IF(SUM(BM$15:BM$22)>0,$E25*$F25,0)","v":0},null,{"$f":"IF(SUM(BO$15:BO$22)>0,$E25*$F25,0)","v":0},null,{"$f":"IF(SUM(BQ$15:BQ$22)>0,$E25*$F25,0)","v":0},null,{"$f":"IF(SUM(BS$15:BS$22)>0,$E25*$F25,0)","v":0},null,{"$f":"IF(SUM(BU$15:BU$22)>0,$E25*$F25,0)","v":0},null,{"$f":"IF(SUM(BW$15:BW$22)>0,$E25*$F25,0)","v":0},null,{"$f":"IF(SUM(BY$15:BY$22)>0,$E25*$F25,0)","v":0},null,{"$f":"IF(SUM(CA$15:CA$22)>0,$E25*$F25,0)","v":0},null,{"$f":"IF(SUM(CC$15:CC$22)>0,$E25*$F25,0)","v":0},null,{"$f":"IF(SUM(CE$15:CE$22)>0,$E25*$F25,0)","v":0},null,{"$f":"IF(SUM(CG$15:CG$22)>0,$E25*$F25,0)","v":0},null,{"$f":"IF(SUM(CI$15:CI$22)>0,$E25*$F25,0)","v":0},null,{"$f":"IF(SUM(CK$15:CK$22)>0,$E25*$F25,0)","v":0},null,{"$f":"IF(SUM(CM$15:CM$22)>0,$E25*$F25,0)","v":0},null,{"$f":"IF(SUM(CO$15:CO$22)>0,$E25*$F25,0)","v":0},null,{"$f":"IF(SUM(CQ$15:CQ$22)>0,$E25*$F25,0)","v":0},null,{"$f":"IF(SUM(CS$15:CS$22)>0,$E25*$F25,0)","v":0},null,{"$f":"IF(SUM(CU$15:CU$22)>0,$E25*$F25,0)","v":0},null,{"$f":"IF(SUM(CW$15:CW$22)>0,$E25*$F25,0)","v":0},null,{"$f":"IF(SUM(CY$15:CY$22)>0,$E25*$F25,0)","v":0},null,{"$f":"IF(SUM(DA$15:DA$22)>0,$E25*$F25,0)","v":0},null,{"$f":"IF(SUM(DC$15:DC$22)>0,$E25*$F25,0)","v":0},null,{"$f":"IF(SUM(DE$15:DE$22)>0,$E25*$F25,0)","v":0},null,{"$f":"IF(SUM(DG$15:DG$22)>0,$E25*$F25,0)","v":0},null,{"$f":"IF(SUM(DI$15:DI$22)>0,$E25*$F25,0)","v":0},null,{"$f":"IF(SUM(DK$15:DK$22)>0,$E25*$F25,0)","v":0},null,{"$f":"IF(SUM(DM$15:DM$22)>0,$E25*$F25,0)","v":0},null,{"$f":"IF(SUM(DO$15:DO$22)>0,$E25*$F25,0)","v":0},null,{"$f":"IF(SUM(DQ$15:DQ$22)>0,$E25*$F25,0)","v":0},null,{"$f":"IF(SUM(DS$15:DS$22)>0,$E25*$F25,0)","v":0},null,{"$f":"IF(SUM(DU$15:DU$22)>0,$E25*$F25,0)","v":0},null,{"$f":"IF(SUM(DW$15:DW$22)>0,$E25*$F25,0)","v":0}]
[null,null,null,null,null,null,null,null,null,{"$f":"IF(SUM(I$15:I$22)>0,$E26*$F26,0)","v":0},null,{"$f":"IF(SUM(K$15:K$22)>0,$E26*$F26,0)","v":0},null,{"$f":"IF(SUM(M$15:M$22)>0,$E26*$F26,0)","v":0},null,{"$f":"IF(SUM(O$15:O$22)>0,$E26*$F26,0)","v":0},null,{"$f":"IF(SUM(Q$15:Q$22)>0,$E26*$F26,0)","v":0},null,{"$f":"IF(SUM(S$15:S$22)>0,$E26*$F26,0)","v":0},null,{"$f":"IF(SUM(U$15:U$22)>0,$E26*$F26,0)","v":0},null,{"$f":"IF(SUM(W$15:W$22)>0,$E26*$F26,0)","v":0},null,{"$f":"IF(SUM(Y$15:Y$22)>0,$E26*$F26,0)","v":0},null,{"$f":"IF(SUM(AA$15:AA$22)>0,$E26*$F26,0)","v":0},null,{"$f":"IF(SUM(AC$15:AC$22)>0,$E26*$F26,0)","v":0},null,{"$f":"IF(SUM(AE$15:AE$22)>0,$E26*$F26,0)","v":0},null,{"$f":"IF(SUM(AG$15:AG$22)>0,$E26*$F26,0)","v":0},null,{"$f":"IF(SUM(AI$15:AI$22)>0,$E26*$F26,0)","v":0},null,{"$f":"IF(SUM(AK$15:AK$22)>0,$E26*$F26,0)","v":0},null,{"$f":"IF(SUM(AM$15:AM$22)>0,$E26*$F26,0)","v":0},null,{"$f":"IF(SUM(AO$15:AO$22)>0,$E26*$F26,0)","v":0},null,{"$f":"IF(SUM(AQ$15:AQ$22)>0,$E26*$F26,0)","v":0},null,{"$f":"IF(SUM(AS$15:AS$22)>0,$E26*$F26,0)","v":0},null,{"$f":"IF(SUM(AU$15:AU$22)>0,$E26*$F26,0)","v":0},null,{"$f":"IF(SUM(AW$15:AW$22)>0,$E26*$F26,0)","v":0},null,{"$f":"IF(SUM(AY$15:AY$22)>0,$E26*$F26,0)","v":0},null,{"$f":"IF(SUM(BA$15:BA$22)>0,$E26*$F26,0)","v":0},null,{"$f":"IF(SUM(BC$15:BC$22)>0,$E26*$F26,0)","v":0},null,{"$f":"IF(SUM(BE$15:BE$22)>0,$E26*$F26,0)","v":0},null,{"$f":"IF(SUM(BG$15:BG$22)>0,$E26*$F26,0)","v":0},null,{"$f":"IF(SUM(BI$15:BI$22)>0,$E26*$F26,0)","v":0},null,{"$f":"IF(SUM(BK$15:BK$22)>0,$E26*$F26,0)","v":0},null,{"$f":"IF(SUM(BM$15:BM$22)>0,$E26*$F26,0)","v":0},null,{"$f":"IF(SUM(BO$15:BO$22)>0,$E26*$F26,0)","v":0},null,{"$f":"IF(SUM(BQ$15:BQ$22)>0,$E26*$F26,0)","v":0},null,{"$f":"IF(SUM(BS$15:BS$22)>0,$E26*$F26,0)","v":0},null,{"$f":"IF(SUM(BU$15:BU$22)>0,$E26*$F26,0)","v":0},null,{"$f":"IF(SUM(BW$15:BW$22)>0,$E26*$F26,0)","v":0},null,{"$f":"IF(SUM(BY$15:BY$22)>0,$E26*$F26,0)","v":0},null,{"$f":"IF(SUM(CA$15:CA$22)>0,$E26*$F26,0)","v":0},null,{"$f":"IF(SUM(CC$15:CC$22)>0,$E26*$F26,0)","v":0},null,{"$f":"IF(SUM(CE$15:CE$22)>0,$E26*$F26,0)","v":0},null,{"$f":"IF(SUM(CG$15:CG$22)>0,$E26*$F26,0)","v":0},null,{"$f":"IF(SUM(CI$15:CI$22)>0,$E26*$F26,0)","v":0},null,{"$f":"IF(SUM(CK$15:CK$22)>0,$E26*$F26,0)","v":0},null,{"$f":"IF(SUM(CM$15:CM$22)>0,$E26*$F26,0)","v":0},null,{"$f":"IF(SUM(CO$15:CO$22)>0,$E26*$F26,0)","v":0},null,{"$f":"IF(SUM(CQ$15:CQ$22)>0,$E26*$F26,0)","v":0},null,{"$f":"IF(SUM(CS$15:CS$22)>0,$E26*$F26,0)","v":0},null,{"$f":"IF(SUM(CU$15:CU$22)>0,$E26*$F26,0)","v":0},null,{"$f":"IF(SUM(CW$15:CW$22)>0,$E26*$F26,0)","v":0},null,{"$f":"IF(SUM(CY$15:CY$22)>0,$E26*$F26,0)","v":0},null,{"$f":"IF(SUM(DA$15:DA$22)>0,$E26*$F26,0)","v":0},null,{"$f":"IF(SUM(DC$15:DC$22)>0,$E26*$F26,0)","v":0},null,{"$f":"IF(SUM(DE$15:DE$22)>0,$E26*$F26,0)","v":0},null,{"$f":"IF(SUM(DG$15:DG$22)>0,$E26*$F26,0)","v":0},null,{"$f":"IF(SUM(DI$15:DI$22)>0,$E26*$F26,0)","v":0},null,{"$f":"IF(SUM(DK$15:DK$22)>0,$E26*$F26,0)","v":0},null,{"$f":"IF(SUM(DM$15:DM$22)>0,$E26*$F26,0)","v":0},null,{"$f":"IF(SUM(DO$15:DO$22)>0,$E26*$F26,0)","v":0},null,{"$f":"IF(SUM(DQ$15:DQ$22)>0,$E26*$F26,0)","v":0},null,{"$f":"IF(SUM(DS$15:DS$22)>0,$E26*$F26,0)","v":0},null,{"$f":"IF(SUM(DU$15:DU$22)>0,$E26*$F26,0)","v":0},null,{"$f":"IF(SUM(DW$15:DW$22)>0,$E26*$F26,0)","v":0}]
[null,null,null,null,null,null,null,null,null,{"$f":"IF(SUM(I$15:I$22)>0,$E27*$F27,0)","v":0},null,{"$f":"IF(SUM(K$15:K$22)>0,$E27*$F27,0)","v":0},null,{"$f":"IF(SUM(M$15:M$22)>0,$E27*$F27,0)","v":0},null,{"$f":"IF(SUM(O$15:O$22)>0,$E27*$F27,0)","v":0},null,{"$f":"IF(SUM(Q$15:Q$22)>0,$E27*$F27,0)","v":0},null,{"$f":"IF(SUM(S$15:S$22)>0,$E27*$F27,0)","v":0},null,{"$f":"IF(SUM(U$15:U$22)>0,$E27*$F27,0)","v":0},null,{"$f":"IF(SUM(W$15:W$22)>0,$E27*$F27,0)","v":0},null,{"$f":"IF(SUM(Y$15:Y$22)>0,$E27*$F27,0)","v":0},null,{"$f":"IF(SUM(AA$15:AA$22)>0,$E27*$F27,0)","v":0},null,{"$f":"IF(SUM(AC$15:AC$22)>0,$E27*$F27,0)","v":0},null,{"$f":"IF(SUM(AE$15:AE$22)>0,$E27*$F27,0)","v":0},null,{"$f":"IF(SUM(AG$15:AG$22)>0,$E27*$F27,0)","v":0},null,{"$f":"IF(SUM(AI$15:AI$22)>0,$E27*$F27,0)","v":0},null,{"$f":"IF(SUM(AK$15:AK$22)>0,$E27*$F27,0)","v":0},null,{"$f":"IF(SUM(AM$15:AM$22)>0,$E27*$F27,0)","v":0},null,{"$f":"IF(SUM(AO$15:AO$22)>0,$E27*$F27,0)","v":0},null,{"$f":"IF(SUM(AQ$15:AQ$22)>0,$E27*$F27,0)","v":0},null,{"$f":"IF(SUM(AS$15:AS$22)>0,$E27*$F27,0)","v":0},null,{"$f":"IF(SUM(AU$15:AU$22)>0,$E27*$F27,0)","v":0},null,{"$f":"IF(SUM(AW$15:AW$22)>0,$E27*$F27,0)","v":0},null,{"$f":"IF(SUM(AY$15:AY$22)>0,$E27*$F27,0)","v":0},null,{"$f":"IF(SUM(BA$15:BA$22)>0,$E27*$F27,0)","v":0},null,{"$f":"IF(SUM(BC$15:BC$22)>0,$E27*$F27,0)","v":0},null,{"$f":"IF(SUM(BE$15:BE$22)>0,$E27*$F27,0)","v":0},null,{"$f":"IF(SUM(BG$15:BG$22)>0,$E27*$F27,0)","v":0},null,{"$f":"IF(SUM(BI$15:BI$22)>0,$E27*$F27,0)","v":0},null,{"$f":"IF(SUM(BK$15:BK$22)>0,$E27*$F27,0)","v":0},null,{"$f":"IF(SUM(BM$15:BM$22)>0,$E27*$F27,0)","v":0},null,{"$f":"IF(SUM(BO$15:BO$22)>0,$E27*$F27,0)","v":0},null,{"$f":"IF(SUM(BQ$15:BQ$22)>0,$E27*$F27,0)","v":0},null,{"$f":"IF(SUM(BS$15:BS$22)>0,$E27*$F27,0)","v":0},null,{"$f":"IF(SUM(BU$15:BU$22)>0,$E27*$F27,0)","v":0},null,{"$f":"IF(SUM(BW$15:BW$22)>0,$E27*$F27,0)","v":0},null,{"$f":"IF(SUM(BY$15:BY$22)>0,$E27*$F27,0)","v":0},null,{"$f":"IF(SUM(CA$15:CA$22)>0,$E27*$F27,0)","v":0},null,{"$f":"IF(SUM(CC$15:CC$22)>0,$E27*$F27,0)","v":0},null,{"$f":"IF(SUM(CE$15:CE$22)>0,$E27*$F27,0)","v":0},null,{"$f":"IF(SUM(CG$15:CG$22)>0,$E27*$F27,0)","v":0},null,{"$f":"IF(SUM(CI$15:CI$22)>0,$E27*$F27,0)","v":0},null,{"$f":"IF(SUM(CK$15:CK$22)>0,$E27*$F27,0)","v":0},null,{"$f":"IF(SUM(CM$15:CM$22)>0,$E27*$F27,0)","v":0},null,{"$f":"IF(SUM(CO$15:CO$22)>0,$E27*$F27,0)","v":0},null,{"$f":"IF(SUM(CQ$15:CQ$22)>0,$E27*$F27,0)","v":0},null,{"$f":"IF(SUM(CS$15:CS$22)>0,$E27*$F27,0)","v":0},null,{"$f":"IF(SUM(CU$15:CU$22)>0,$E27*$F27,0)","v":0},null,{"$f":"IF(SUM(CW$15:CW$22)>0,$E27*$F27,0)","v":0},null,{"$f":"IF(SUM(CY$15:CY$22)>0,$E27*$F27,0)","v":0},null,{"$f":"IF(SUM(DA$15:DA$22)>0,$E27*$F27,0)","v":0},null,{"$f":"IF(SUM(DC$15:DC$22)>0,$E27*$F27,0)","v":0},null,{"$f":"IF(SUM(DE$15:DE$22)>0,$E27*$F27,0)","v":0},null,{"$f":"IF(SUM(DG$15:DG$22)>0,$E27*$F27,0)","v":0},null,{"$f":"IF(SUM(DI$15:DI$22)>0,$E27*$F27,0)","v":0},null,{"$f":"IF(SUM(DK$15:DK$22)>0,$E27*$F27,0)","v":0},null,{"$f":"IF(SUM(DM$15:DM$22)>0,$E27*$F27,0)","v":0},null,{"$f":"IF(SUM(DO$15:DO$22)>0,$E27*$F27,0)","v":0},null,{"$f":"IF(SUM(DQ$15:DQ$22)>0,$E27*$F27,0)","v":0},null,{"$f":"IF(SUM(DS$15:DS$22)>0,$E27*$F27,0)","v":0},null,{"$f":"IF(SUM(DU$15:DU$22)>0,$E27*$F27,0)","v":0},null,{"$f":"IF(SUM(DW$15:DW$22)>0,$E27*$F27,0)","v":0}]
[null,null,null,null,null,null,null,null,null,{"$f":"IF(SUM(I$15:I$22)>0,$E28*$F28,0)","v":0},null,{"$f":"IF(SUM(K$15:K$22)>0,$E28*$F28,0)","v":0},null,{"$f":"IF(SUM(M$15:M$22)>0,$E28*$F28,0)","v":0},null,{"$f":"IF(SUM(O$15:O$22)>0,$E28*$F28,0)","v":0},null,{"$f":"IF(SUM(Q$15:Q$22)>0,$E28*$F28,0)","v":0},null,{"$f":"IF(SUM(S$15:S$22)>0,$E28*$F28,0)","v":0},null,{"$f":"IF(SUM(U$15:U$22)>0,$E28*$F28,0)","v":0},null,{"$f":"IF(SUM(W$15:W$22)>0,$E28*$F28,0)","v":0},null,{"$f":"IF(SUM(Y$15:Y$22)>0,$E28*$F28,0)","v":0},null,{"$f":"IF(SUM(AA$15:AA$22)>0,$E28*$F28,0)","v":0},null,{"$f":"IF(SUM(AC$15:AC$22)>0,$E28*$F28,0)","v":0},null,{"$f":"IF(SUM(AE$15:AE$22)>0,$E28*$F28,0)","v":0},null,{"$f":"IF(SUM(AG$15:AG$22)>0,$E28*$F28,0)","v":0},null,{"$f":"IF(SUM(AI$15:AI$22)>0,$E28*$F28,0)","v":0},null,{"$f":"IF(SUM(AK$15:AK$22)>0,$E28*$F28,0)","v":0},null,{"$f":"IF(SUM(AM$15:AM$22)>0,$E28*$F28,0)","v":0},null,{"$f":"IF(SUM(AO$15:AO$22)>0,$E28*$F28,0)","v":0},null,{"$f":"IF(SUM(AQ$15:AQ$22)>0,$E28*$F28,0)","v":0},null,{"$f":"IF(SUM(AS$15:AS$22)>0,$E28*$F28,0)","v":0},null,{"$f":"IF(SUM(AU$15:AU$22)>0,$E28*$F28,0)","v":0},null,{"$f":"IF(SUM(AW$15:AW$22)>0,$E28*$F28,0)","v":0},null,{"$f":"IF(SUM(AY$15:AY$22)>0,$E28*$F28,0)","v":0},null,{"$f":"IF(SUM(BA$15:BA$22)>0,$E28*$F28,0)","v":0},null,{"$f":"IF(SUM(BC$15:BC$22)>0,$E28*$F28,0)","v":0},null,{"$f":"IF(SUM(BE$15:BE$22)>0,$E28*$F28,0)","v":0},null,{"$f":"IF(SUM(BG$15:BG$22)>0,$E28*$F28,0)","v":0},null,{"$f":"IF(SUM(BI$15:BI$22)>0,$E28*$F28,0)","v":0},null,{"$f":"IF(SUM(BK$15:BK$22)>0,$E28*$F28,0)","v":0},null,{"$f":"IF(SUM(BM$15:BM$22)>0,$E28*$F28,0)","v":0},null,{"$f":"IF(SUM(BO$15:BO$22)>0,$E28*$F28,0)","v":0},null,{"$f":"IF(SUM(BQ$15:BQ$22)>0,$E28*$F28,0)","v":0},null,{"$f":"IF(SUM(BS$15:BS$22)>0,$E28*$F28,0)","v":0},null,{"$f":"IF(SUM(BU$15:BU$22)>0,$E28*$F28,0)","v":0},null,{"$f":"IF(SUM(BW$15:BW$22)>0,$E28*$F28,0)","v":0},null,{"$f":"IF(SUM(BY$15:BY$22)>0,$E28*$F28,0)","v":0},null,{"$f":"IF(SUM(CA$15:CA$22)>0,$E28*$F28,0)","v":0},null,{"$f":"IF(SUM(CC$15:CC$22)>0,$E28*$F28,0)","v":0},null,{"$f":"IF(SUM(CE$15:CE$22)>0,$E28*$F28,0)","v":0},null,{"$f":"IF(SUM(CG$15:CG$22)>0,$E28*$F28,0)","v":0},null,{"$f":"IF(SUM(CI$15:CI$22)>0,$E28*$F28,0)","v":0},null,{"$f":"IF(SUM(CK$15:CK$22)>0,$E28*$F28,0)","v":0},null,{"$f":"IF(SUM(CM$15:CM$22)>0,$E28*$F28,0)","v":0},null,{"$f":"IF(SUM(CO$15:CO$22)>0,$E28*$F28,0)","v":0},null,{"$f":"IF(SUM(CQ$15:CQ$22)>0,$E28*$F28,0)","v":0},null,{"$f":"IF(SUM(CS$15:CS$22)>0,$E28*$F28,0)","v":0},null,{"$f":"IF(SUM(CU$15:CU$22)>0,$E28*$F28,0)","v":0},null,{"$f":"IF(SUM(CW$15:CW$22)>0,$E28*$F28,0)","v":0},null,{"$f":"IF(SUM(CY$15:CY$22)>0,$E28*$F28,0)","v":0},null,{"$f":"IF(SUM(DA$15:DA$22)>0,$E28*$F28,0)","v":0},null,{"$f":"IF(SUM(DC$15:DC$22)>0,$E28*$F28,0)","v":0},null,{"$f":"IF(SUM(DE$15:DE$22)>0,$E28*$F28,0)","v":0},null,{"$f":"IF(SUM(DG$15:DG$22)>0,$E28*$F28,0)","v":0},null,{"$f":"IF(SUM(DI$15:DI$22)>0,$E28*$F28,0)","v":0},null,{"$f":"IF(SUM(DK$15:DK$22)>0,$E28*$F28,0)","v":0},null,{"$f":"IF(SUM(DM$15:DM$22)>0,$E28*$F28,0)","v":0},null,{"$f":"IF(SUM(DO$15:DO$22)>0,$E28*$F28,0)","v":0},null,{"$f":"IF(SUM(DQ$15:DQ$22)>0,$E28*$F28,0)","v":0},null,{"$f":"IF(SUM(DS$15:DS$22)>0,$E28*$F28,0)","v":0},null,{"$f":"IF(SUM(DU$15:DU$22)>0,$E28*$F28,0)","v":0},null,{"$f":"IF(SUM(DW$15:DW$22)>0,$E28*$F28,0)","v":0}]

{"sheet":"Mat Perm","index":23,"n_rows":113,"n_cols":136,"rows_kept":113,"cut":false,"hidden":true,"merged":[[9,1,9,3],[10,1,10,14]]}
[null,null,"CÂMARA DOS DEPUTADOS"]
[null,null,"DEPARTAMENTO TÉCNICO"]
[null,null,"Coordenação de Planejamento e Gestão"]
[]
[null,null,"Data:",{"$f":"'Dados Gerais'!#REF!","v":{"$error":"#REF!"}}]
[null,null,"Processo:",{"$f":"'Dados Gerais'!#REF!","v":{"$error":"#REF!"}}]
[null,null,"Objeto:",{"$f":"'Dados Gerais'!#REF!","v":{"$error":"#REF!"}}]
[]
[]
[]
[null,"MATERIAIS PERMANENTES RELACIONADOS AO POSTO - PAGAMENTO DA DEPRECIAÇÃO / MANUTENÇÃO",null,null,null,null,null,null,null,null,null,null,null,null,null,null,1,null,{"$f":"Q11+1","v":2},null,{"$f":"S11+1","v":3},null,{"$f":"U11+1","v":4},null,{"$f":"W11+1","v":5},null,{"$f":"Y11+1","v":6},null,{"$f":"AA11+1","v":7},null,{"$f":"AC11+1","v":8},null,{"$f":"AE11+1","v":9},null,{"$f":"AG11+1","v":10},null,{"$f":"AI11+1","v":11},null,{"$f":"AK11+1","v":12},null,{"$f":"AM11+1","v":13},null,{"$f":"AO11+1","v":14},null,{"$f":"AQ11+1","v":15},null,{"$f":"AS11+1","v":16},null,{"$f":"AU11+1","v":17},null,{"$f":"AW11+1","v":18},null,{"$f":"AY11+1","v":19},null,{"$f":"BA11+1","v":20},null,{"$f":"BC11+1","v":21},null,{"$f":"BE11+1","v":22},null,{"$f":"BG11+1","v":23},null,{"$f":"BI11+1","v":24},null,{"$f":"BK11+1","v":25},null,{"$f":"BM11+1","v":26},null,{"$f":"BO11+1","v":27},null,{"$f":"BQ11+1","v":28},null,{"$f":"BS11+1","v":29},null,{"$f":"BU11+1","v":30},null,{"$f":"BW11+1","v":31},null,{"$f":"BY11+1","v":32},null,{"$f":"CA11+1","v":33},null,{"$f":"CC11+1","v":34},null,{"$f":"CE11+1","v":35},null,{"$f":"CG11+1","v":36},null,{"$f":"CI11+1","v":37},null,{"$f":"CK11+1","v":38},null,{"$f":"CM11+1","v":39},null,{"$f":"CO11+1","v":40},null,{"$f":"CQ11+1","v":41},null,{"$f":"CS11+1","v":42},null,{"$f":"CU11+1","v":43},null,{"$f":"CW11+1","v":44},null,{"$f":"CY11+1","v":45},null,{"$f":"DA11+1","v":46},null,{"$f":"DC11+1","v":47},null,{"$f":"DE11+1","v":48},null,{"$f":"DG11+1","v":49},null,{"$f":"DI11+1","v":50},null,{"$f":"DK11+1","v":51},null,{"$f":"DM11+1","v":52},null,{"$f":"DO11+1","v":53},null,{"$f":"DQ11+1","v":54},null,{"$f":"DS11+1","v":55},null,{"$f":"DU11+1","v":56},null,{"$f":"DW11+1","v":57},null,{"$f":"DY11+1","v":58},null,{"$f":"EA11+1","v":59},null,{"$f":"EC11+1","v":60}]
[]
[null,null,null,null,null,null,null,null,null,null,null,null,null,null,null,null,{"$f":"SUM(R12:R94)","v":0},null,{"$f":"SUM(T12:T94)","v":0},null,{"$f":"SUM(V12:V94)","v":0},null,{"$f":"SUM(X12:X94)","v":0},null,{"$f":"SUM(Z12:Z94)","v":0},null,{"$f":"SUM(AB12:AB94)","v":0},null,{"$f":"SUM(AD12:AD94)","v":0},null,{"$f":"SUM(AF12:AF94)","v":0},null,{"$f":"SUM(AH12:AH94)","v":0},null,{"$f":"SUM(AJ12:AJ94)","v":0},null,{"$f":"SUM(AL12:AL94)","v":0},null,{"$f":"SUM(AN12:AN94)","v":0},null,{"$f":"SUM(AP12:AP94)","v":0},null,{"$f":"SUM(AR12:AR94)","v":0},null,{"$f":"SUM(AT12:AT94)","v":0},null,{"$f":"SUM(AV12:AV94)","v":0},null,{"$f":"SUM(AX12:AX94)","v":0},null,{"$f":"SUM(AZ12:AZ94)","v":0},null,{"$f":"SUM(BB12:BB94)","v":0},null,{"$f":"SUM(BD12:BD94)","v":0},null,{"$f":"SUM(BF12:BF94)","v":0},null,{"$f":"SUM(BH12:BH94)","v":0},null,{"$f":"SUM(BJ12:BJ94)","v":0},null,{"$f":"SUM(BL12:BL94)","v":0},null,{"$f":"SUM(BN12:BN94)","v":0},null,{"$f":"SUM(BP12:BP94)","v":0},null,{"$f":"SUM(BR12:BR94)","v":0},null,{"$f":"SUM(BT12:BT94)","v":0},null,{"$f":"SUM(BV12:BV94)","v":0},null,{"$f":"SUM(BX12:BX94)","v":0},null,{"$f":"SUM(BZ12:BZ94)","v":0},null,{"$f":"SUM(CB12:CB94)","v":0},null,{"$f":"SUM(CD12:CD94)","v":0},null,{"$f":"SUM(CF12:CF94)","v":0},null,{"$f":"SUM(CH12:CH94)","v":0},null,{"$f":"SUM(CJ12:CJ94)","v":0},null,{"$f":"SUM(CL12:CL94)","v":0},null,{"$f":"SUM(CN12:CN94)","v":0},null,{"$f":"SUM(CP12:CP94)","v":0},null,{"$f":"SUM(CR12:CR94)","v":0},null,{"$f":"SUM(CT12:CT94)","v":0},null,{"$f":"SUM(CV12:CV94)","v":0},null,{"$f":"SUM(CX12:CX94)","v":0},null,{"$f":"SUM(CZ12:CZ94)","v":0},null,{"$f":"SUM(DB12:DB94)","v":0},null,{"$f":"SUM(DD12:DD94)","v":0},null,{"$f":"SUM(DF12:DF94)","v":0},null,{"$f":"SUM(DH12:DH94)","v":0},null,{"$f":"SUM(DJ12:DJ94)","v":0},null,{"$f":"SUM(DL12:DL94)","v":0},null,{"$f":"SUM(DN12:DN94)","v":0},null,{"$f":"SUM(DP12:DP94)","v":0},null,{"$f":"SUM(DR12:DR94)","v":0},null,{"$f":"SUM(DT12:DT94)","v":0},null,{"$f":"SUM(DV12:DV94)","v":0},null,{"$f":"SUM(DX12:DX94)","v":0},null,{"$f":"SUM(DZ12:DZ94)","v":0},null,{"$f":"SUM(EB12:EB94)","v":0},null,{"$f":"SUM(ED12:ED94)","v":0},null,{"$f":"SUM(EF12:EF94)","v":0}]
[null,null,"CATEGORIAS",null,"QUANTIDADE"]
[null,null,null,null,null,null,null,null,null,null,null,null,null,null,null,null,{"$f":"IF($C15=Q$11,1,0)","v":0},null,{"$f":"IF($C15=S$11,1,0)","v":0},null,{"$f":"IF($C15=U$11,1,0)","v":0},null,{"$f":"IF($C15=W$11,1,0)","v":0},null,{"$f":"IF($C15=Y$11,1,0)","v":0},null,{"$f":"IF($C15=AA$11,1,0)","v":0},null,{"$f":"IF($C15=AC$11,1,0)","v":0},null,{"$f":"IF($C15=AE$11,1,0)","v":0},null,{"$f":"IF($C15=AG$11,1,0)","v":0},null,{"$f":"IF($C15=AI$11,1,0)","v":0},null,{"$f":"IF($C15=AK$11,1,0)","v":0},null,{"$f":"IF($C15=AM$11,1,0)","v":0},null,{"$f":"IF($C15=AO$11,1,0)","v":0},null,{"$f":"IF($C15=AQ$11,1,0)","v":0},null,{"$f":"IF($C15=AS$11,1,0)","v":0},null,{"$f":"IF($C15=AU$11,1,0)","v":0},null,{"$f":"IF($C15=AW$11,1,0)","v":0},null,{"$f":"IF($C15=AY$11,1,0)","v":0},null,{"$f":"IF($C15=BA$11,1,0)","v":0},null,{"$f":"IF($C15=BC$11,1,0)","v":0},null,{"$f":"IF($C15=BE$11,1,0)","v":0},null,{"$f":"IF($C15=BG$11,1,0)","v":0},null,{"$f":"IF($C15=BI$11,1,0)","v":0},null,{"$f":"IF($C15=BK$11,1,0)","v":0},null,{"$f":"IF($C15=BM$11,1,0)","v":0},null,{"$f":"IF($C15=BO$11,1,0)","v":0},null,{"$f":"IF($C15=BQ$11,1,0)","v":0},null,{"$f":"IF($C15=BS$11,1,0)","v":0},null,{"$f":"IF($C15=BU$11,1,0)","v":0},null,{"$f":"IF($C15=BW$11,1,0)","v":0},null,{"$f":"IF($C15=BY$11,1,0)","v":0},null,{"$f":"IF($C15=CA$11,1,0)","v":0},null,{"$f":"IF($C15=CC$11,1,0)","v":0},null,{"$f":"IF($C15=CE$11,1,0)","v":0},null,{"$f":"IF($C15=CG$11,1,0)","v":0},null,{"$f":"IF($C15=CI$11,1,0)","v":0},null,{"$f":"IF($C15=CK$11,1,0)","v":0},null,{"$f":"IF($C15=CM$11,1,0)","v":0},null,{"$f":"IF($C15=CO$11,1,0)","v":0},null,{"$f":"IF($C15=CQ$11,1,0)","v":0},null,{"$f":"IF($C15=CS$11,1,0)","v":0},null,{"$f":"IF($C15=CU$11,1,0)","v":0},null,{"$f":"IF($C15=CW$11,1,0)","v":0},null,{"$f":"IF($C15=CY$11,1,0)","v":0},null,{"$f":"IF($C15=DA$11,1,0)","v":0},null,{"$f":"IF($C15=DC$11,1,0)","v":0},null,{"$f":"IF($C15=DE$11,1,0)","v":0},null,{"$f":"IF($C15=DG$11,1,0)","v":0},null,{"$f":"IF($C15=DI$11,1,0)","v":0},null,{"$f":"IF($C15=DK$11,1,0)","v":0},null,{"$f":"IF($C15=DM$11,1,0)","v":0},null,{"$f":"IF($C15=DO$11,1,0)","v":0},null,{"$f":"IF($C15=DQ$11,1,0)","v":0},null,{"$f":"IF($C15=DS$11,1,0)","v":0},null,{"$f":"IF($C15=DU$11,1,0)","v":0},null,{"$f":"IF($C15=DW$11,1,0)","v":0},null,{"$f":"IF($C15=DY$11,1,0)","v":0},null,{"$f":"IF($C15=EA$11,1,0)","v":0},null,{"$f":"IF($C15=EC$11,1,0)","v":0},null,{"$f":"IF($C15=EE$11,1,0)","v":0}]
[null,null,null,{"$f":"HLOOKUP($C16,'Dados Gerais'!$D$5:$BK$10,6)","v":{"$error":"#N/A"}},{"$f":"HLOOKUP($C16,'Dados Gerais'!$D$5:$BK$14,10)","v":{"$error":"#N/A"}},null,null,null,null,null,null,null,null,null,null,null,0,null,0,null,0,null,0,null,0,null,0,null,0,null,0,null,0,null,0,null,0,null,0,null,0,null,0,null,0,null,0,null,0,null,0,null,0,null,0,null,0,null,0,null,0,null,0,null,0,null,0,null,0,null,0,null,0,null,0,null,0,null,0,null,0,null,0,null,0,null,0,null,0,null,0,null,0,null,0,null,0,null,0,null,0,null,0,null,0,null,0,null,0,null,0,null,0,null,0,null,0,null,0,null,0,null,0,null,0,null,0,null,0,null,0,null,0,null,0]
[null,null,null,{"$f":"HLOOKUP($C17,'Dados Gerais'!$D$5:$BK$10,6)","v":{"$error":"#N/A"}},{"$f":"HLOOKUP($C17,'Dados Gerais'!$D$5:$BK$14,10)","v":{"$error":"#N/A"}},null,null,null,null,null,null,null,null,null,null,null,0,null,0,null,0,null,0,null,0,null,0,null,0,null,0,null,0,null,0,null,0,null,0,null,0,null,0,null,0,null,0,null,0,null,0,null,0,null,0,null,0,null,0,null,0,null,0,null,0,null,0,null,0,null,0,null,0,null,0,null,0,null,0,null,0,null,0,null,0,null,0,null,0,null,0,null,0,null,0,null,0,null,0,null,0,null,0,null,0,null,0,null,0,null,0,null,0,null,0,null,0,null,0,null,0,null,0,null,0,null,0,null,0,null,0,null,0,null,0]
[null,null,null,{"$f":"HLOOKUP($C18,'Dados Gerais'!$D$5:$BK$10,6)","v":{"$error":"#N/A"}},{"$f":"HLOOKUP($C18,'Dados Gerais'!$D$5:$BK$14,10)","v":{"$error":"#N/A"}},null,null,null,null,null,null,null,null,null,null,null,0,null,0,null,0,null,0,null,0,null,0,null,0,null,0,null,0,null,0,null,0,null,0,null,0,null,0,null,0,null,0,null,0,null,0,null,0,null,0,null,0,null,0,null,0,null,0,null,0,null,0,null,0,null,0,null,0,null,0,null,0,null,0,null,0,null,0,null,0,null,0,null,0,null,0,null,0,null,0,null,0,null,0,null,0,null,0,null,0,null,0,null,0,null,0,null,0,null,0,null,0,null,0,null,0,null,0,null,0,null,0,null,0,null,0,null,0,null,0]
[null,null,null,{"$f":"HLOOKUP($C19,'Dados Gerais'!$D$5:$BK$10,6)","v":{"$error":"#N/A"}},{"$f":"HLOOKUP($C19,'Dados Gerais'!$D$5:$BK$14,10)","v":{"$error":"#N/A"}},null,null,null,null,null,null,null,null,null,null,null,0,null,0,null,0,null,0,null,0,null,0,null,0,null,0,null,0,null,0,null,0,null,0,null,0,null,0,null,0,null,0,null,0,null,0,null,0,null,0,null,0,null,0,null,0,null,0,null,0,null,0,null,0,null,0,null,0,null,0,null,0,null,0,null,0,null,0,null,0,null,0,null,0,null,0,null,0,null,0,null,0,null,0,null,0,null,0,null,0,null,0,null,0,null,0,null,0,null,0,null,0,null,0,null,0,null,0,null,0,null,0,null,0,null,0,null,0,null,0]
[null,null,null,{"$f":"HLOOKUP($C20,'Dados Gerais'!$D$5:$BK$10,6)","v":{"$error":"#N/A"}},{"$f":"HLOOKUP($C20,'Dados Gerais'!$D$5:$BK$14,10)","v":{"$error":"#N/A"}},null,null,null,null,null,null,null,null,null,null,null,0,null,0,null,0,null,0,null,0,null,0,null,0,null,0,null,0,null,0,null,0,null,0,null,0,null,0,null,0,null,0,null,0,null,0,null,0,null,0,null,0,null,0,null,0,null,0,null,0,null,0,null,0,null,0,null,0,null,0,null,0,null,0,null,0,null,0,null,0,null,0,null,0,null,0,null,0,null,0,null,0,null,0,null,0,null,0,null,0,null,0,null,0,null,0,null,0,null,0,null,0,null,0,null,0,null,0,null,0,null,0,null,0,null,0,null,0,null,0]
[null,null,null,{"$f":"HLOOKUP($C21,'Dados Gerais'!$D$5:$BK$10,6)","v":{"$error":"#N/A"}},{"$f":"HLOOKUP($C21,'Dados Gerais'!$D$5:$BK$14,10)","v":{"$error":"#N/A"}},null,null,null,null,null,null,null,null,null,null,null,0,null,0,null,0,null,0,null,0,null,0,null,0,null,0,null,0,null,0,null,0,null,0,null,0,null,0,null,0,null,0,null,0,null,0,null,0,null,0,null,0,null,0,null,0,null,0,null,0,null,0,null,0,null,0,null,0,null,0,null,0,null,0,null,0,null,0,null,0,null,0,null,0,null,0,null,0,null,0,null,0,null,0,null,0,null,0,null,0,null,0,null,0,null,0,null,0,null,0,null,0,null,0,null,0,null,0,null,0,null,0,null,0,null,0,null,0,null,0]
[null,null,null,null,null,null,null,null,null,null,null,null,null,null,null,null,0,null,0,null,0,null,0,null,0,null,0,null,0,null,0,null,0,null,0,null,0,null,0,null,0,null,0,null,0,null,0,null,0,null,0,null,0,null,0,null,0,null,0,null,0,null,0,null,0,null,0,null,0,null,0,null,0,null,0,null,0,null,0,null,0,null,0,null,0,null,0,null,0,null,0,null,0,null,0,null,0,null,0,null,0,null,0,null,0,null,0,null,0,null,0,null,0,null,0,null,0,null,0,null,0,null,0,null,0,null,0,null,0,null,0,null,0,null,0]
[]
[null,null,"PAGAMENTO DA DEPRECIAÇÃO"]
[null,null,"ITEM","DESCRIÇÃO","QUANT ANUAL","CONTA SIAFI","VALOR DE AQ.","% RESIDUAL","VIDA ÚTIL","DEP. MENSAL","CUSTO TOTAL","BDI (%)","PREÇO TOTAL","FONTE","REFERÊNCIA"]
[]
[null,null,null,null,null,"12311.01.09",89.34,0.1,10,{"$f":"G27*(1-H27)/(I27*12)","v":0.67005000000000003},{"$f":"J27*E27","v":0},{"$f":"BDI!$E$26","v":0.23139999999999999},{"$f":"ROUND(K27*(1+L27),2)","v":0},"COTAÇÃO"]
[null,null,null,null,null,"12311.01.09",39,0.1,10,{"$f":"G28*(1-H28)/(I28*12)","v":0.29250000000000004},{"$f":"J28*E28","v":0},{"$f":"BDI!$E$26","v":0.23139999999999999},{"$f":"ROUND(K28*(1+L28),2)","v":0},"COTAÇÃO"]
[null,null,null,null,null,"12311.01.09",22.08,0.1,10,0.1656,0,{"$f":"BDI!$E$26","v":0.23139999999999999},0,"COTAÇÃO"]
[null,null,null,null,null,"12311.01.09",8.02,0.1,10,6.0150000000000002E-2,0,{"$f":"BDI!$E$26","v":0.23139999999999999},0,"COTAÇÃO"]
[null,null,null,null,null,"12311.01.09",15.64,0.1,10,0.1173,0,{"$f":"BDI!$E$26","v":0.23139999999999999},0,"COTAÇÃO"]
[null,null,null,null,null,"12311.01.09",7.63,0.1,10,5.7224999999999998E-2,0,{"$f":"BDI!$E$26","v":0.23139999999999999},0,"COTAÇÃO"]
[null,null,null,null,null,"12311.01.09",21.48,0.1,10,0.16109999999999999,0,{"$f":"BDI!$E$26","v":0.23139999999999999},0,"COTAÇÃO"]
[null,null,null,null,null,"12311.01.09",7.87,0.1,10,5.9025000000000001E-2,0,{"$f":"BDI!$E$26","v":0.23139999999999999},0,"COTAÇÃO"]
[null,null,null,null,null,"12311.01.09",6.73,0.1,10,5.0475000000000006E-2,0,{"$f":"BDI!$E$26","v":0.23139999999999999},0,"COTAÇÃO"]
[null,null,null,null,null,"12311.01.09",15.35,0.1,10,0.11512499999999999,0,{"$f":"BDI!$E$26","v":0.23139999999999999},0,"COTAÇÃO"]
[null,null,null,null,null,"12311.01.09",12.86,0.1,10,9.6449999999999994E-2,0,{"$f":"BDI!$E$26","v":0.23139999999999999},0,"COTAÇÃO"]
[null,null,null,null,null,"12311.01.09",10.119999999999999,0.1,10,7.5899999999999995E-2,0,{"$f":"BDI!$E$26","v":0.23139999999999999},0,"COTAÇÃO"]
[null,null,null,null,null,"12311.01.09",61.31,0.1,10,0.45982500000000004,0,{"$f":"BDI!$E$26","v":0.23139999999999999},0,"COTAÇÃO"]
[null,null,null,null,null,"12311.01.09",40.409999999999997,0.1,10,0.30307499999999998,0,{"$f":"BDI!$E$26","v":0.23139999999999999},0,"COTAÇÃO"]
[null,null,null,null,null,"12311.01.09",120.53,0.1,10,0.90397500000000008,0,{"$f":"BDI!$E$26","v":0.23139999999999999},0,"COTAÇÃO"]
[null,null,null,null,null,"12311.01.09",31.48,0.1,10,0.2361,0,{"$f":"BDI!$E$26","v":0.23139999999999999},0,"COTAÇÃO"]
[null,null,null,null,null,"12311.01.09",191.93,0.1,10,1.4394750000000003,0,{"$f":"BDI!$E$26","v":0.23139999999999999},0,"COTAÇÃO"]
[null,null,null,null,null,"12311.01.09",92.78,0.1,10,0.69585000000000008,0,{"$f":"BDI!$E$26","v":0.23139999999999999},0,"COTAÇÃO"]
[null,null,null,null,null,"12311.01.09",36.01,0.1,10,0.27007500000000001,0,{"$f":"BDI!$E$26","v":0.23139999999999999},0,"COTAÇÃO"]
[null,null,null,null,null,"12311.01.09",16.579999999999998,0.1,10,0.12434999999999999,0,{"$f":"BDI!$E$26","v":0.23139999999999999},0,"COTAÇÃO"]
[null,null,null,null,null,"12311.01.09",57.93,0.1,10,0.434475,0,{"$f":"BDI!$E$26","v":0.23139999999999999},0,"COTAÇÃO"]
[null,null,null,null,null,"12311.01.09",47.81,0.1,10,0.35857500000000003,0,{"$f":"BDI!$E$26","v":0.23139999999999999},0,"COTAÇÃO"]
[null,null,null,null,null,"12311.01.09",31.18,0.1,10,0.23385,0,{"$f":"BDI!$E$26","v":0.23139999999999999},0,"COTAÇÃO"]
[null,null,null,null,null,"12311.01.09",23.95,0.1,10,0.17962500000000001,0,{"$f":"BDI!$E$26","v":0.23139999999999999},0,"COTAÇÃO"]
[null,null,null,null,null,"12311.01.09",35.04,0.1,10,0.26280000000000003,0,{"$f":"BDI!$E$26","v":0.23139999999999999},0,"COTAÇÃO"]
[null,null,null,null,null,"12311.01.09",200.31,0.1,10,1.5023249999999999,0,{"$f":"BDI!$E$26","v":0.23139999999999999},0,"COTAÇÃO"]
[null,null,null,null,null,"12311.01.09",79.59,0.1,10,0.59692500000000004,0,{"$f":"BDI!$E$26","v":0.23139999999999999},0,"COTAÇÃO"]
[null,null,null,null,null,"12311.01.09",227.75,0.1,10,1.7081249999999999,0,{"$f":"BDI!$E$26","v":0.23139999999999999},0,"COTAÇÃO"]
[null,null,null,null,null,"12311.01.09",127.59,0.1,10,0.95692500000000003,0,{"$f":"BDI!$E$26","v":0.23139999999999999},0,"COTAÇÃO"]
[]
[]
[null,null,"PAGAMENTO DA MANUTENÇÃO"]
[null,null,"ITEM","DESCRIÇÃO",null,null,null,"K (calculado)","MENSAL DEPR.","% MAN X DEP","MENSAL MAN.","BDI (%)","PREÇO TOTAL"]
[]
[null,null,null,null,null,null,null,{"$f":"H68","v":0.42411600000000005},{"$f":"SUM(M27:M55)","v":0},{"$f":"H61","v":0.42411600000000005},{"$f":"I61*H61","v":0},{"$f":"L27","v":0.23139999999999999},{"$f":"ROUND(K61*(1+L61),2)","v":0}]
[]
[null,null,null,null,"K1","K2","K3","K4"]
[null,null,null,null,0.85,1,0.8,1]
[null,null,null,null,"K5","K6","K7","K8"]
[null,null,null,null,1,0.6,0.5,1.1000000000000001]
[null,null,null,null,"K9","K10","K11","RESULTADO"]
[null,null,null,"* a descrição de cada coeficiente segue abaixo",1.5,0.9,1.4,{"$f":"E64*F64*G64*H64*E66*F66*G66*H66*E68*F68*G68","v":0.42411600000000005}]
[]
[]
[null,null,"MATERIAL DE CONSUMO ASSOCIADO"]
[null,null,"ITEM","DESCRIÇÃO",null,null,null,"QUANTID/ANO","UNIDADE","VALOR DE AQ.","MENSAL MAT","BDI (%)","PREÇO TOTAL"]
[]
[null,null,null,null,null,null,null,null,null,null,{"$f":"J74*H74/12","v":0},{"$f":"L61","v":0.23139999999999999},{"$f":"ROUND(K74*(1+L74),2)","v":0}]
[]
[]
[null,null,"MATERIAL DE CONSUMO ASSOCIADO"]
[null,null,"ITEM","DESCRIÇÃO",null,null,null,null,null,null,null,null,"PREÇO TOTAL"]
[]
[null,null,1,"Componente DEPRECIAÇÃO - POR POSTO",null,null,null,null,null,null,null,null,{"$f":"I61","v":0}]
[null,null,2,"Componente MANUTENÇÃO - POR POSTO",null,null,null,null,null,null,null,null,{"$f":"M61","v":0}]
[null,null,3,"Componente MATERIAL DE CONSUMO ASSOCIADO - POR POSTO",null,null,null,null,null,null,null,null,{"$f":"M74","v":0}]
[]
[null,null,null,null,null,null,null,null,null,null,null,"SOMATÓRIO TOTAL MENSAL - POR POSTO",{"$f":"SUM(M79:M83)","v":0},null,null,null,null,{"$f":"IF(SUM(Q$15:Q$22)>0,$M84,0)","v":0},null,{"$f":"IF(SUM(S$15:S$22)>0,$M84,0)","v":0},null,{"$f":"IF(SUM(U$15:U$22)>0,$M84,0)","v":0},null,{"$f":"IF(SUM(W$15:W$22)>0,$M84,0)","v":0},null,{"$f":"IF(SUM(Y$15:Y$22)>0,$M84,0)","v":0},null,{"$f":"IF(SUM(AA$15:AA$22)>0,$M84,0)","v":0},null,{"$f":"IF(SUM(AC$15:AC$22)>0,$M84,0)","v":0},null,{"$f":"IF(SUM(AE$15:AE$22)>0,$M84,0)","v":0},null,{"$f":"IF(SUM(AG$15:AG$22)>0,$M84,0)","v":0},null,{"$f":"IF(SUM(AI$15:AI$22)>0,$M84,0)","v":0},null,{"$f":"IF(SUM(AK$15:AK$22)>0,$M84,0)","v":0},null,{"$f":"IF(SUM(AM$15:AM$22)>0,$M84,0)","v":0},null,{"$f":"IF(SUM(AO$15:AO$22)>0,$M84,0)","v":0},null,{"$f":"IF(SUM(AQ$15:AQ$22)>0,$M84,0)","v":0},null,{"$f":"IF(SUM(AS$15:AS$22)>0,$M84,0)","v":0},null,{"$f":"IF(SUM(AU$15:AU$22)>0,$M84,0)","v":0},null,{"$f":"IF(SUM(AW$15:AW$22)>0,$M84,0)","v":0},null,{"$f":"IF(SUM(AY$15:AY$22)>0,$M84,0)","v":0},null,{"$f":"IF(SUM(BA$15:BA$22)>0,$M84,0)","v":0},null,{"$f":"IF(SUM(BC$15:BC$22)>0,$M84,0)","v":0},null,{"$f":"IF(SUM(BE$15:BE$22)>0,$M84,0)","v":0},null,{"$f":"IF(SUM(BG$15:BG$22)>0,$M84,0)","v":0},null,{"$f":"IF(SUM(BI$15:BI$22)>0,$M84,0)","v":0},null,{"$f":"IF(SUM(BK$15:BK$22)>0,$M84,0)","v":0},null,{"$f":"IF(SUM(BM$15:BM$22)>0,$M84,0)","v":0},null,{"$f":"IF(SUM(BO$15:BO$22)>0,$M84,0)","v":0},null,{"$f":"IF(SUM(BQ$15:BQ$22)>0,$M84,0)","v":0},null,{"$f":"IF(SUM(BS$15:BS$22)>0,$M84,0)","v":0},null,{"$f":"IF(SUM(BU$15:BU$22)>0,$M84,0)","v":0},null,{"$f":"IF(SUM(BW$15:BW$22)>0,$M84,0)","v":0},null,{"$f":"IF(SUM(BY$15:BY$22)>0,$M84,0)","v":0},null,{"$f":"IF(SUM(CA$15:CA$22)>0,$M84,0)","v":0},null,{"$f":"IF(SUM(CC$15:CC$22)>0,$M84,0)","v":0},null,{"$f":"IF(SUM(CE$15:CE$22)>0,$M84,0)","v":0},null,{"$f":"IF(SUM(CG$15:CG$22)>0,$M84,0)","v":0},null,{"$f":"IF(SUM(CI$15:CI$22)>0,$M84,0)","v":0},null,{"$f":"IF(SUM(CK$15:CK$22)>0,$M84,0)","v":0},null,{"$f":"IF(SUM(CM$15:CM$22)>0,$M84,0)","v":0},null,{"$f":"IF(SUM(CO$15:CO$22)>0,$M84,0)","v":0},null,{"$f":"IF(SUM(CQ$15:CQ$22)>0,$M84,0)","v":0},null,{"$f":"IF(SUM(CS$15:CS$22)>0,$M84,0)","v":0},null,{"$f":"IF(SUM(CU$15:CU$22)>0,$M84,0)","v":0},null,{"$f":"IF(SUM(CW$15:CW$22)>0,$M84,0)","v":0},null,{"$f":"IF(SUM(CY$15:CY$22)>0,$M84,0)","v":0},null,{"$f":"IF(SUM(DA$15:DA$22)>0,$M84,0)","v":0},null,{"$f":"IF(SUM(DC$15:DC$22)>0,$M84,0)","v":0},null,{"$f":"IF(SUM(DE$15:DE$22)>0,$M84,0)","v":0},null,{"$f":"IF(SUM(DG$15:DG$22)>0,$M84,0)","v":0},null,{"$f":"IF(SUM(DI$15:DI$22)>0,$M84,0)","v":0},null,{"$f":"IF(SUM(DK$15:DK$22)>0,$M84,0)","v":0},null,{"$f":"IF(SUM(DM$15:DM$22)>0,$M84,0)","v":0},null,{"$f":"IF(SUM(DO$15:DO$22)>0,$M84,0)","v":0},null,{"$f":"IF(SUM(DQ$15:DQ$22)>0,$M84,0)","v":0},null,{"$f":"IF(SUM(DS$15:DS$22)>0,$M84,0)","v":0},null,{"$f":"IF(SUM(DU$15:DU$22)>0,$M84,0)","v":0},null,{"$f":"IF(SUM(DW$15:DW$22)>0,$M84,0)","v":0},null,{"$f":"IF(SUM(DY$15:DY$22)>0,$M84,0)","v":0},null,{"$f":"IF(SUM(EA$15:EA$22)>0,$M84,0)","v":0},null,{"$f":"IF(SUM(EC$15:EC$22)>0,$M84,0)","v":0},null,{"$f":"IF(SUM(EE$15:EE$22)>0,$M84,0)","v":0}]
[null,null,null,null,null,null,null,null,null,null,null,"SOMATÓRIO TOTAL ANUAL - POR POSTO",{"$f":"M84*12","v":0}]
[]
[]
[null,null,"MATERIAL DE CONSUMO ASSOCIADO"]
[null,null,"MEMÓRIA DE CÁLCULO DO COEFICIENTE DE CORRELAÇÃO MANUTENÇÃO X DEPRECIAÇÃO (K)"]
[]
[null,null,"JUSTIFICATIVAS",null,"TIPO","K1",null,"Condições de Trab","K4",null,"Tempo Vida (anos)","K6",null,"Temperatura","K8"]
[null,null,null,null,"Guindaste",0.5,null,"Em espera",0.4,null,1,0.6,null,"Muito quente (> 40º C)",1.3]
[null,null,"K1","Considerado o valor médio de 0,85","Caminhão-comum",0.8,null,"Leves",0.8,null,2,0.7,null,"Quente (30º a 40º C)",1.1000000000000001]
[null,null,"K2","Considerado o operador médio","Fora-de-estrada",1,null,"Médias",1,null,3,0.8,null,"Médio (10º a 30º C)",1]
[null,null,"K3","Consideradas ferramentas de primeira qualidade","Carregadeira",1,null,"Pesadas",1.4,null,4,0.9,null,"Frio (< 10º C)",1.2]
[null,null,"K4","Há todo o tipo de trabalho, foi considerado o valor médio","Escavadeira",1.4,null,"Severas",2,null,5,1]
[null,null,"K5","Considerando manutenção normal","Motoescrêiper",1.1000000000000001,null,null,null,null,6,1,null,"Ritmo de Trabalho","K9"]
[null,null,"K6","Equipamentos novos","Trator de esteira",1.2,null,"Manutenção","K5",null,7,1,null,"Folgado",0.9]
[null,null,"K7","220h por mês, 252 dias por ano",null,null,null,"Excelente",0.6,null,8,1.2,null,"Médio ",1]
[null,null,"K8","Clima quente, acima de 30º C","Qualid do Operador","K2",null,"Boa",0.8,null,9,1.3,null,"Com pressa",1.5]
[null,null,"K9","Ritmo de trabalho usualmente com pressa","Excelente",0.8,null,"Média",1,null,10,1.4]
[null,null,"K10","Considerado o operador médio","Boa",0.9,null,"Ruim ",1.5,null,11,2,null,"Conh do Serviço","K10"]
[null,null,"K11","Foi considerada a opção de aluguel a terceiros, ainda que a simulação seja dos custos do contratado, contudo a execução dos serviços é em local de terceiros","Média",1,null,"Inexistente",3,null,15,2,null,"Grande ",0.8]
[null,null,null,null,"Ruim",1.2,null,null,null,null,null,null,null,"Médio     ",0.9]
[null,null,null,null,"Péssima",2,null,"Horas de Uso ","K7",6000,1,null,null,"Pouco ",1]
[null,null,null,null,null,null,null,1000,0.5,8000,1.3]
[null,null,null,null,"Qualidade do Equip","K3",null,2000,0.5,10000,1.6,null,null,"Tipo do Serviço","K11"]
[null,null,null,null,"De primeira",0.8,null,3000,0.6,12000,1.9,null,null,"Mina ou Pedreira",0.8]
[null,null,null,null,"Média",1,null,4000,0.7,15000,2.2999999999999998,null,null,"Construção Geral",1]
[null,null,null,null,"Ruim",1.5,null,5000,0.9,20000,3,null,null,"Aluguel a Terceiros",1.4]
[]
[null,null,null,null,"Fonte: "]
[null,null,null,null,"MATTOS, Aldo Dórea. Como preparar orçamentos de obras. São Paulo: Pini, 2006. 281 p., il"]