{"text_format":"1","workbook":"xlsx","n_sheets":28,"sheets":["GUIA PARA PREENCHIMENTO","MODELO PROPOSTA","Remunerações","Resumo","1","2","3","4","5","6","7","8","9","Dados Gerais","Encargos Sociais","BDI","Uniformes","EPI","SREP","Não Rel - EPI","Equip Rel","Não Rel - Depr","Não Rel - Mat Consumo","Não Rel - Mat Cons Durável","Não Rel - Serviços","Not. Demanda","Mat Cons","Mat Perm"],"not_rendered":{"charts":0,"images":9,"macros":1,"external_links":0,"defined_names":38,"comments":0,"pivot_tables":0},"unopened":[],"bounds":{"document_bytes":16777216,"sheet_cells":100000,"rows_first":2000,"rows_last":500,"rows_between":2000,"halvings":0,"cell_chars":16384,"cell_head_chars":4096},"cells_cut":0,"cells_raw":0,"read":"whole","date_system":"1900"}

{"sheet":"GUIA PARA PREENCHIMENTO","index":0,"n_rows":5,"n_cols":1,"rows_kept":5,"cut":false,"hidden":false,"merged":[]}
["GUIA PARA PREENCHIMENTO"]
[]
["1 - Preencher apenas as guias azuis:"]
[]
["2 - Recomendamos preencher somente as células com fundo azul claro. As demais possuem fórmulas e sugerimos não alterá-las."]

{"sheet":"MODELO PROPOSTA","index":1,"n_rows":68,"n_cols":2,"rows_kept":68,"cut":false,"hidden":false,"merged":[[59,1,59,9],[62,1,62,9],[63,1,63,9],[64,1,64,9],[67,1,67,9],[58,1,58,4],[58,5,58,9],[53,1,53,9],[55,1,55,9],[56,1,56,4],[56,5,56,9],[57,1,57,4],[57,5,57,9],[46,1,46,9],[47,1,47,9],[33,1,33,9],[36,6,36,10],[37,1,37,9],[38,1,38,9],[39,1,39,9],[35,1,35,9],[31,1,31,4],[31,5,31,9],[40,1,40,9],[43,1,43,9],[45,1,45,9],[28,1,28,4],[28,5,28,9],[29,1,29,4],[29,5,29,9],[30,1,30,4],[30,5,30,9],[22,1,22,9],[23,1,23,9],[26,1,26,4],[26,5,26,9],[27,1,27,4],[27,5,27,9],[1,1,1,9],[4,1,4,9],[6,1,6,9],[7,1,7,9],[8,1,8,9],[49,1,49,9],[50,1,50,9],[51,1,51,9],[52,1,52,9],[9,1,9,9],[25,1,25,4],[25,5,25,9],[10,1,10,9],[11,1,11,9],[12,1,12,9],[14,1,14,9],[15,1,15,9],[16,1,16,2],[17,1,18,9],[19,1,19,9],[21,1,21,9]]}
[]
[null,"MODELO DA PROPOSTA COMPLETA"]
[]
[null,"."]
[null,"I – FORMALIZAÇÃO"]
[]
[null,"PREGÃO ELETRÔNICO N. 38/2023"]
[null,"OBJETO: Prestação de serviços continuados nas áreas de limpeza e conservação nos Edifícios Anexos II e III da Câmara dos Deputados, pelo período de trinta meses, com fornecimento de materiais e equipamentos e prestação de serviços, sob demanda, de desinsetização e desratização."]
[null,"LICITANTE: _____________________________________________________"]
[null,"CNPJ: ________________________________________________________"]
[null,"ENDEREÇO COMPLETO: _________________________________________"]
[null,"TELEFONE:_____________________________________________________"]
[null,"E-MAIL: ________________________________________________________"]
[]
[null,"Apresentamos nossa proposta para o item único da presente licitação, de acordo com as disposições do Edital."]
[null,"Decorre do conteúdo da presente proposta a explicitação do seguinte PREÇO DE JULGAMENTO (GLOBAL) PARA O ITEM ÚNICO, REFERENTE AO PERÍODO DE TRINTA MESES:"]
[null,{"$f":"Resumo!H98","v":42045307.455959998}]
[null,{"$f":"Extenso_Valor(B17)","v":"quarenta e dois milhões, quarenta e cinco mil, trezentos e sete reais e quarenta e seis centavos"}]
[]
[null,"(por extenso)"]
[]
[null,"No valor proposto estão incluídos todos os custos e todas as despesas, diretas e indiretas, para a execução dos serviços objeto da licitação, em conformidade com as especificações e demais condições e exigências constantes do Edital."]
[null,"Informamos que eventuais rubricas dispostas em Acordo ou Convenção Coletiva de Trabalho que não se relacionem ao custo direto da venda do serviço, tais como “Participação nos Resultados” e “Abono substitutivo de Participação nos Resultados”, serão consideradas nos custos indiretos da proposta."]
[null,"O prazo de validade da presente proposta é de ______ (por extenso) dias. (observado o disposto no Título 11 do Edital)."]
[]
[null,"Convenção coletiva de trabalho ou a norma coletiva a que estamos obrigados:"]
[null,"Data-Base:"]
[null,"Número do Registro SRT:"]
[null,"Regime de tributação da empresa:"]
[null,"Empresa é beneficiada pela desoneração da folha de pagamento instituída pela Lei n. 12.546, de 2001, alterada pela Lei n. 13.161, de 2015?"]
[null,"Empresa adere ao PAT (Programa de Alimentação do Trabalhador)?"]
[null,"(Se adere ao PAT): Os valores do auxílio-alimentação apresentados na presente proposta correspondem somente aos efetivamente pagos pela empresa aos empregados?"]
[]
[null,"DECLARAÇÕES"]
[]
[null,"Declaramos que seremos responsáveis pelo descarte ambientalmente responsável de qualquer resíduo do serviço a ser prestado – incluindo consumíveis, peças usadas, embalagens – e que temos conhecimento da legislação ambiental sobre o descarte de materiais, em especial a Lei n. 9.605, de 1998 e a Lei n. 12.305, de 2010, além da NBR 10.004."]
[]
[null,"A SEREM PRESTADAS SOMENTE NA HIPÓTESE DE LICITANTE MICROEMPRESA OU EMPRESA DE PEQUENO PORTE, EM CONFORMIDADE COM OS ARTIGOS 17, 18, 30 E 31 DA LEI COMPLEMENTAR N. 123, de 2006, E O ACÓRDÃO TCU 2798/2010-PLENÁRIO"]
[null,"Declaramos que:"]
[null,"a)   em se tratando dos serviços vedados descritos no artigo 17 da Lei Complementar n. 123, de 2006, notadamente os descritos no inciso XII (cessão ou locação de mão de obra), ressalvados os serviços listados nos parágrafos 5o-B a 5o-E do artigo 18 da referida Lei, a proposta apresentada não contempla qualquer benefício tributário referente ao SIMPLES NACIONAL, conforme os subitens 5.7 e 5.8 do Edital;"]
[null,"b)   na hipótese de contratação desta Microempresa ou Empresa de Pequeno Porte inscrita no SIMPLES NACIONAL e executora de atividade vedada, ficamos sujeitos à exclusão obrigatória no SIMPLES NACIONAL a contar do mês seguinte ao da contratação, em consequência do que dispõem o artigo 17, inciso XII e o artigo 31, inciso II da Lei Complementar n, 123, de 2006, devendo entregar à Câmara dos Deputados, à título de comprovação, cópia de ofício – com comprovante de entrega e recebimento, que comunique a assinatura do contrato de prestação de serviços mediante cessão de mão de obra e encaminhado pela contratada à Receita Federal do Brasil até o último dia útil do mês subsequente ao da contratação, consoante artigo 30, § 1º, inciso II da Lei Complementar n. 123, de 2006."]
[]
[]
[null,"A SEREM PRESTADAS SOMENTE NA HIPÓTESE DE LICITANTE BENEFICIADA PELA DESONERAÇÃO DA FOLHA DE PAGAMENTO INSTITUÍDA PELA LEI N. 12.546, DE 2011, ALTERADA PELA LEI N. 13.161, DE 2015. "]
[]
[null,"Declaramos, sob as penas da Lei, que:"]
[null,"a)   recolhemos a contribuição previdenciária incidente sobre o valor da receita bruta, em substituição às contribuições previdenciárias incidentes sobre a folha de pagamento, previstas nos incisos I e III do caput do artigo 22 da Lei n. 8.212, de 24 de julho de 1991, na forma do caput do artigo 7º (ou 8º) da Lei n. 12.546, de 14 de dezembro de 2011, alterada pela Lei n. 13.161, de 31 de agosto de 2015;"]
[null,"b)   temos ciência que nossa manifestação, conforme alínea “a” anterior, será remetida à Receita Federal do Brasil e que, em caso de constatação de falsidade, estará sujeita às sanções administrativas cabíveis, sem prejuízo do encaminhamento dos documentos ao Ministério Público para apuração de eventual responsabilidade criminal desta declarante."]
[]
[null,"A SEREM PRESTADAS SOMENTE PARA A LICITANTE QUE SEJA A ATUAL TITULAR DO CONTRATO QUE SERÁ SUCEDIDO PELA CONTRATAÇÃO DECORRENTE DO PREGÃO EM EPÍGRAFE, NA HIPÓTESE DE HAVER SALÁRIO(S) PRATICADO(S) NO CONTRATO VIGENTE SUPERIOR(ES) AOS MÍNIMOS FIXADOS NO EDITAL E QUE TENHA OPTADO POR TOMAR COMO BASE EM SEUS LANCES E NA PRESENTE PROPOSTA DE PREÇOS SALÁRIO(S) FIXADO(S) NESTE EDITAL:"]
[null,"Declaramos que:"]
[null,"a) estamos cientes de que deveremos apresentar à Câmara dos Deputados, no prazo improrrogável de 60 (sessenta) dias, contado da data de assinatura do contrato, a convenção ou acordo coletivo de trabalho, entabulado com a participação do sindicato dos trabalhadores, em que se autoriza a redução salarial, na forma do art. 7°, VI, da Constituição Federal, observado o disposto no Título 10 do Anexo n. 6 do Edital;"]
[null,"b) estamos cientes de que, na hipótese de não cumprirmos o disposto no teor da declaração da alínea anterior (“a”) e não logrado êxito na contratação de remanescente, sendo necessária a realização de nova licitação, caso participemos do certame, deveremos tomar como base em nossos lances e em nossa proposta de preços o(s) salário(s) maior(es), absorvendo ou acrescentando eventual diferença no BDI, sob pena de desclassificação."]
[null,"É OBRIGATÓRIA A COMPROVAÇÃO A QUE SE REFERE O SUBITEM 5.9.4 DO TÍTULO 5 DO EDITAL."]
[]
[null,"DADOS PARA ASSINATURA DO CONTRATO"]
[null,"Nome do signatário"]
[null,"Cargo"]
[null,"Qualificação\n(CPF, naturalidade e domicílio)"]
[null,"OBS.: O signatário deve possuir poderes de administração estabelecidos em contrato social e/ou possuir procuração com poderes para assinar contratos em nome da empresa. \nA documentação comprobatória deverá ser encaminhada quando da assinatura do contrato."]
[]
[]
[null,"Brasília,     de                     de 2023."]
[]
[null,"Assinatura do representante legal da empresa"]
[]
[]
[null,"Nome do representante legal da empresa"]

{"sheet":"Remunerações","index":2,"n_rows":15,"n_cols":11,"rows_kept":15,"cut":false,"hidden":false,"merged":[[0,1,0,10]]}
[null,"QUADRO DE REMUNERAÇÕES"]
[]
[null,null,"ITEM","POSTO DE TRABALHO","QUANTIDADE","SALÁRIO","ADICIONAL DE PERICULOSIDADE","ADICIONAL DE INSALUBRIDADE","ADICIONAL NOTURNO","OUTROS","SALÁRIO COM ADICIONAIS"]
[null,null,null,"POSTO DE TRABALHO - EQUIPE DE TRABALHO"]
[null,null,1,{"$f":"HLOOKUP($C5,'Dados Gerais'!$D$5:$L$68,6)","v":"ENCARREGADO GERAL"},{"$f":"HLOOKUP($C5,'Dados Gerais'!$D$5:$L$68,10)","v":1},{"$f":"HLOOKUP($C5,'Dados Gerais'!$D$5:$L$68,8)","v":7376.1},{"$f":"HLOOKUP($C5,'Dados Gerais'!$D$5:$L$68,26)","v":0},{"$f":"HLOOKUP($C5,'Dados Gerais'!$D$5:$L$68,31)","v":0},{"$f":"HLOOKUP($C5,'Dados Gerais'!$D$5:$L$68,46)","v":0},{"$f":"HLOOKUP($C5,'Dados Gerais'!$D$5:$L$68,33)","v":0},{"$f":"SUM(F5:J5)","v":7376.1}]
[null,null,2,{"$f":"HLOOKUP($C6,'Dados Gerais'!$D$5:$L$68,6)","v":"ENCARREGADO SETORIAL"},{"$f":"HLOOKUP($C6,'Dados Gerais'!$D$5:$L$68,10)","v":1},{"$f":"HLOOKUP($C6,'Dados Gerais'!$D$5:$L$68,8)","v":3951.73},{"$f":"HLOOKUP($C6,'Dados Gerais'!$D$5:$L$68,26)","v":0},{"$f":"HLOOKUP($C6,'Dados Gerais'!$D$5:$L$68,31)","v":0},{"$f":"HLOOKUP($C6,'Dados Gerais'!$D$5:$L$68,46)","v":0},{"$f":"HLOOKUP($C6,'Dados Gerais'!$D$5:$L$68,33)","v":0},{"$f":"SUM(F6:J6)","v":3951.73}]
[null,null,3,{"$f":"HLOOKUP($C7,'Dados Gerais'!$D$5:$L$68,6)","v":"ENCARREGADO DE SERVIÇO"},{"$f":"HLOOKUP($C7,'Dados Gerais'!$D$5:$L$68,10)","v":13},{"$f":"HLOOKUP($C7,'Dados Gerais'!$D$5:$L$68,8)","v":3317.57},{"$f":"HLOOKUP($C7,'Dados Gerais'!$D$5:$L$68,26)","v":0},{"$f":"HLOOKUP($C7,'Dados Gerais'!$D$5:$L$68,31)","v":0},{"$f":"HLOOKUP($C7,'Dados Gerais'!$D$5:$L$68,46)","v":0},{"$f":"HLOOKUP($C7,'Dados Gerais'!$D$5:$L$68,33)","v":0},3317.57]
[null,null,4,{"$f":"HLOOKUP($C8,'Dados Gerais'!$D$5:$L$68,6)","v":"ENCARREGADO DE SERVIÇO COM ADICIONAL DE INSALUBRIDADE"},{"$f":"HLOOKUP($C8,'Dados Gerais'!$D$5:$L$68,10)","v":2},{"$f":"HLOOKUP($C8,'Dados Gerais'!$D$5:$L$68,8)","v":3317.57},{"$f":"HLOOKUP($C8,'Dados Gerais'!$D$5:$L$68,26)","v":0},{"$f":"HLOOKUP($C8,'Dados Gerais'!$D$5:$L$68,31)","v":260.40000000000003},{"$f":"HLOOKUP($C8,'Dados Gerais'!$D$5:$L$68,46)","v":0},{"$f":"HLOOKUP($C8,'Dados Gerais'!$D$5:$L$68,33)","v":0},{"$f":"SUM(F8:J8)","v":3577.9700000000003}]
[null,null,5,{"$f":"HLOOKUP($C9,'Dados Gerais'!$D$5:$L$68,6)","v":"AUXILIAR DE ENCARREGADO"},{"$f":"HLOOKUP($C9,'Dados Gerais'!$D$5:$L$68,10)","v":1},{"$f":"HLOOKUP($C9,'Dados Gerais'!$D$5:$L$68,8)","v":2244.21},{"$f":"HLOOKUP($C9,'Dados Gerais'!$D$5:$L$68,26)","v":0},{"$f":"HLOOKUP($C9,'Dados Gerais'!$D$5:$L$68,31)","v":0},{"$f":"HLOOKUP($C9,'Dados Gerais'!$D$5:$L$68,46)","v":0},{"$f":"HLOOKUP($C9,'Dados Gerais'!$D$5:$L$68,33)","v":0},2244.21]
[null,null,6,{"$f":"HLOOKUP($C10,'Dados Gerais'!$D$5:$L$68,6)","v":"ALMOXARIFE"},{"$f":"HLOOKUP($C10,'Dados Gerais'!$D$5:$L$68,10)","v":2},{"$f":"HLOOKUP($C10,'Dados Gerais'!$D$5:$L$68,8)","v":2686.07},{"$f":"HLOOKUP($C10,'Dados Gerais'!$D$5:$L$68,26)","v":0},{"$f":"HLOOKUP($C10,'Dados Gerais'!$D$5:$L$68,31)","v":0},{"$f":"HLOOKUP($C10,'Dados Gerais'!$D$5:$L$68,46)","v":0},{"$f":"HLOOKUP($C10,'Dados Gerais'!$D$5:$L$68,33)","v":0},{"$f":"SUM(F10:J10)","v":2686.07}]
[null,null,7,{"$f":"HLOOKUP($C11,'Dados Gerais'!$D$5:$L$68,6)","v":"SERVENTE"},{"$f":"HLOOKUP($C11,'Dados Gerais'!$D$5:$L$68,10)","v":151},{"$f":"HLOOKUP($C11,'Dados Gerais'!$D$5:$L$68,8)","v":1898.58},{"$f":"HLOOKUP($C11,'Dados Gerais'!$D$5:$L$68,26)","v":0},{"$f":"HLOOKUP($C11,'Dados Gerais'!$D$5:$L$68,31)","v":0},{"$f":"HLOOKUP($C11,'Dados Gerais'!$D$5:$L$68,46)","v":0},{"$f":"HLOOKUP($C11,'Dados Gerais'!$D$5:$L$68,33)","v":0},1898.58]
[null,null,8,{"$f":"HLOOKUP($C12,'Dados Gerais'!$D$5:$L$68,6)","v":"SERVENTE COM ADICIONAL DE INSALUBRIDADE"},{"$f":"HLOOKUP($C12,'Dados Gerais'!$D$5:$L$68,10)","v":25},{"$f":"HLOOKUP($C12,'Dados Gerais'!$D$5:$L$68,8)","v":1898.58},{"$f":"HLOOKUP($C12,'Dados Gerais'!$D$5:$L$68,26)","v":0},{"$f":"HLOOKUP($C12,'Dados Gerais'!$D$5:$L$68,31)","v":260.40000000000003},{"$f":"HLOOKUP($C12,'Dados Gerais'!$D$5:$L$68,46)","v":0},{"$f":"HLOOKUP($C12,'Dados Gerais'!$D$5:$L$68,33)","v":0},2158.98]
[null,null,9,{"$f":"HLOOKUP($C13,'Dados Gerais'!$D$5:$L$68,6)","v":"SERVENTE COM ADICIONAL DE INSALUBRIDADE E ADICIONAL NOTURNO"},{"$f":"HLOOKUP($C13,'Dados Gerais'!$D$5:$L$68,10)","v":2},{"$f":"HLOOKUP($C13,'Dados Gerais'!$D$5:$L$68,8)","v":1898.58},{"$f":"HLOOKUP($C13,'Dados Gerais'!$D$5:$L$68,26)","v":0},{"$f":"HLOOKUP($C13,'Dados Gerais'!$D$5:$L$68,31)","v":260.40000000000003},{"$f":"HLOOKUP($C13,'Dados Gerais'!$D$5:$L$68,46)","v":54.43},{"$f":"HLOOKUP($C13,'Dados Gerais'!$D$5:$L$68,33)","v":0},2213.41]
[]
[null,null,null,"TOTAL DE POSTOS",{"$f":"SUM(E5:E14)","v":198}]

{"sheet":"Resumo","index":3,"n_rows":103,"n_cols":12,"rows_kept":103,"cut":false,"hidden":false,"merged":[[2,1,2,8],[36,1,36,8],[19,1,19,8],[77,3,77,7],[102,10,103,18],[75,10,76,18],[95,3,95,7],[65,3,65,7],[81,3,81,7],[87,3,87,7],[91,3,91,7],[93,10,94,18]]}
[]
[]
[null,"RESUMO - TOTAIS MENSAIS - FATURA ORDINÁRIA (SEM O 13º E SEM OS ITENS SOB DEMANDA)"]
[]
[]
[null,null,"ITEM","POSTO DE TRABALHO","QUANTIDADE","PREÇO UNIT       (SEM O 13º)","DESTAQUE DO 13º","PREÇO POR EMPREGADO","PREÇO TOTAL (MENSAL)"]
[null,null,1,{"$f":"HLOOKUP(C7,'Dados Gerais'!$D$5:$BK$10,6)","v":"ENCARREGADO GERAL"},{"$f":"HLOOKUP(C7,'Dados Gerais'!$D$5:$BK$14,10)","v":1},{"$f":"'1'!$E$116","v":16024.871976000002},0,{"$f":"G7+F7","v":16024.871976000002},{"$f":"H7*E7","v":16024.871976000002}]
[null,null,2,{"$f":"HLOOKUP(C8,'Dados Gerais'!$D$5:$BK$10,6)","v":"ENCARREGADO SETORIAL"},{"$f":"HLOOKUP(C8,'Dados Gerais'!$D$5:$BK$14,10)","v":1},{"$f":"'2'!$E$116","v":9401.3327920000011},0,9401.3327920000011,9401.3327920000011]
[null,null,3,{"$f":"HLOOKUP(C9,'Dados Gerais'!$D$5:$BK$10,6)","v":"ENCARREGADO DE SERVIÇO"},{"$f":"HLOOKUP(C9,'Dados Gerais'!$D$5:$BK$14,10)","v":13},{"$f":"'3'!$E$115","v":8109.5485599999993},0,8109.5485599999993,105424.13127999999]
[null,null,4,{"$f":"HLOOKUP(C10,'Dados Gerais'!$D$5:$BK$10,6)","v":"ENCARREGADO DE SERVIÇO COM ADICIONAL DE INSALUBRIDADE"},{"$f":"HLOOKUP(C10,'Dados Gerais'!$D$5:$BK$14,10)","v":2},{"$f":"'4'!$E$115","v":8625.1267040000002},0,{"$f":"G10+F10","v":8625.1267040000002},{"$f":"H10*E10","v":17250.253408}]
[null,null,5,{"$f":"HLOOKUP(C11,'Dados Gerais'!$D$5:$BK$10,6)","v":"AUXILIAR DE ENCARREGADO"},{"$f":"HLOOKUP(C11,'Dados Gerais'!$D$5:$BK$14,10)","v":1},{"$f":"'5'!$E$115","v":6063.0264479999987},0,6063.0264479999987,6063.0264479999987]
[null,null,6,{"$f":"HLOOKUP(C12,'Dados Gerais'!$D$5:$BK$10,6)","v":"ALMOXARIFE"},{"$f":"HLOOKUP(C12,'Dados Gerais'!$D$5:$BK$14,10)","v":2},{"$f":"'6'!$E$115","v":6828.5106160000014},0,6828.5106160000014,13657.021232000003]
[null,null,7,{"$f":"HLOOKUP(C13,'Dados Gerais'!$D$5:$BK$10,6)","v":"SERVENTE"},{"$f":"HLOOKUP(C13,'Dados Gerais'!$D$5:$BK$14,10)","v":151},{"$f":"'7'!$E$115","v":5337.6276400000006},0,{"$f":"G13+F13","v":5337.6276400000006},{"$f":"H13*E13","v":805981.77364000014}]
[null,null,8,{"$f":"HLOOKUP(C14,'Dados Gerais'!$D$5:$BK$10,6)","v":"SERVENTE COM ADICIONAL DE INSALUBRIDADE"},{"$f":"HLOOKUP(C14,'Dados Gerais'!$D$5:$BK$14,10)","v":25},{"$f":"'8'!$E$115","v":5853.1570480000009},0,5853.1570480000009,146328.92620000002]
[null,null,9,{"$f":"HLOOKUP(C15,'Dados Gerais'!$D$5:$BK$10,6)","v":"SERVENTE COM ADICIONAL DE INSALUBRIDADE E ADICIONAL NOTURNO"},{"$f":"HLOOKUP(C15,'Dados Gerais'!$D$5:$BK$14,10)","v":2},{"$f":"'9'!$E$115","v":5960.9245280000014},0,5960.9245280000014,11921.849056000003]
[]
[null,null,null,"TOTAL MENSAL - SALÁRIOS",null,null,null,null,{"$f":"SUM(I7:I16)","v":1132053.186032}]
[]
[]
[null,"RESUMO - TOTAIS MENSAIS - DESTAQUE DO 13º SALÁRIO"]
[]
[]
[null,null,"ITEM","POSTO DE TRABALHO","QUANTIDADE","PREÇO UNIT       (SEM O 13º)","DESTAQUE DO 13º","PREÇO POR EMPREGADO","PREÇO TOTAL (MENSAL)"]
[null,null,1,{"$f":"HLOOKUP(C24,'Dados Gerais'!$D$5:$BK$10,6)","v":"ENCARREGADO GERAL"},{"$f":"HLOOKUP(C24,'Dados Gerais'!$D$5:$BK$14,10)","v":1},0,{"$f":"G41","v":1080.4099999999999},{"$f":"G24+F24","v":1080.4099999999999},{"$f":"H24*E24","v":1080.4099999999999}]
[null,null,2,{"$f":"HLOOKUP(C25,'Dados Gerais'!$D$5:$BK$10,6)","v":"ENCARREGADO SETORIAL"},{"$f":"HLOOKUP(C25,'Dados Gerais'!$D$5:$BK$14,10)","v":1},0,{"$f":"G42","v":578.83000000000004},{"$f":"G25+F25","v":578.83000000000004},578.83000000000004]
[null,null,3,{"$f":"HLOOKUP(C26,'Dados Gerais'!$D$5:$BK$10,6)","v":"ENCARREGADO DE SERVIÇO"},{"$f":"HLOOKUP(C26,'Dados Gerais'!$D$5:$BK$14,10)","v":13},0,{"$f":"G43","v":460.79999999999995},460.79999999999995,5990.4]
[null,null,4,{"$f":"HLOOKUP(C27,'Dados Gerais'!$D$5:$BK$10,6)","v":"ENCARREGADO DE SERVIÇO COM ADICIONAL DE INSALUBRIDADE"},{"$f":"HLOOKUP(C27,'Dados Gerais'!$D$5:$BK$14,10)","v":2},0,496.96,{"$f":"G27+F27","v":496.96},{"$f":"H27*E27","v":993.92}]
[null,null,5,{"$f":"HLOOKUP(C28,'Dados Gerais'!$D$5:$BK$10,6)","v":"AUXILIAR DE ENCARREGADO"},{"$f":"HLOOKUP(C28,'Dados Gerais'!$D$5:$BK$14,10)","v":1},0,311.72000000000003,311.72000000000003,311.72000000000003]
[null,null,6,{"$f":"HLOOKUP(C29,'Dados Gerais'!$D$5:$BK$10,6)","v":"ALMOXARIFE"},{"$f":"HLOOKUP(C29,'Dados Gerais'!$D$5:$BK$14,10)","v":2},0,373.09000000000003,373.09000000000003,746.18000000000006]
[null,null,7,{"$f":"HLOOKUP(C30,'Dados Gerais'!$D$5:$BK$10,6)","v":"SERVENTE"},{"$f":"HLOOKUP(C30,'Dados Gerais'!$D$5:$BK$14,10)","v":151},0,263.70999999999998,{"$f":"G30+F30","v":263.70999999999998},{"$f":"H30*E30","v":39820.21}]
[null,null,8,{"$f":"HLOOKUP(C31,'Dados Gerais'!$D$5:$BK$10,6)","v":"SERVENTE COM ADICIONAL DE INSALUBRIDADE"},{"$f":"HLOOKUP(C31,'Dados Gerais'!$D$5:$BK$14,10)","v":25},0,299.88,299.88,7497]
[null,null,9,{"$f":"HLOOKUP(C32,'Dados Gerais'!$D$5:$BK$10,6)","v":"SERVENTE COM ADICIONAL DE INSALUBRIDADE E ADICIONAL NOTURNO"},{"$f":"HLOOKUP(C32,'Dados Gerais'!$D$5:$BK$14,10)","v":2},0,307.44,307.44,614.88]
[]
[null,null,null,"TOTAL MENSAL - DESTAQUE DO 13º",null,null,null,null,{"$f":"SUM(I24:I33)","v":57633.549999999996}]
[]
[]
[null,"RESUMO - TOTAIS MENSAIS - FATURA ORDINÁRIA TOTAL"]
[]
[]
[null,null,"ITEM","POSTO DE TRABALHO","QUANTIDADE","PREÇO UNIT       (SEM O 13º)","DESTAQUE DO 13º","PREÇO POR EMPREGADO","PREÇO TOTAL (MENSAL)"]
[null,null,1,{"$f":"HLOOKUP(C41,'Dados Gerais'!$D$5:$BK$10,6)","v":"ENCARREGADO GERAL"},{"$f":"HLOOKUP(C41,'Dados Gerais'!$D$5:$BK$14,10)","v":1},{"$f":"F7","v":16024.871976000002},{"$f":"'1'!$E$117","v":1080.4099999999999},{"$f":"G41+F41","v":17105.281976000002},{"$f":"H41*E41","v":17105.281976000002},null,{"$f":"I41/$I$51","v":1.437797149277447E-2},{"$f":"$I$64*K41","v":3045.5924242243568}]
[null,null,2,{"$f":"HLOOKUP(C42,'Dados Gerais'!$D$5:$BK$10,6)","v":"ENCARREGADO SETORIAL"},{"$f":"HLOOKUP(C42,'Dados Gerais'!$D$5:$BK$14,10)","v":1},{"$f":"F8","v":9401.3327920000011},{"$f":"'2'!$E$117","v":578.83000000000004},9980.162792000001,9980.162792000001,null,8.3888997748156422E-3,1776.9662163119085]
[null,null,3,{"$f":"HLOOKUP(C43,'Dados Gerais'!$D$5:$BK$10,6)","v":"ENCARREGADO DE SERVIÇO"},{"$f":"HLOOKUP(C43,'Dados Gerais'!$D$5:$BK$14,10)","v":13},8109.5485599999993,{"$f":"'3'!$E$116","v":460.79999999999995},8570.3485599999985,111414.53127999998,null,9.3650309703884244E-2,19837.337548189596]
[null,null,4,{"$f":"HLOOKUP(C44,'Dados Gerais'!$D$5:$BK$10,6)","v":"ENCARREGADO DE SERVIÇO COM ADICIONAL DE INSALUBRIDADE"},{"$f":"HLOOKUP(C44,'Dados Gerais'!$D$5:$BK$14,10)","v":2},8625.1267040000002,{"$f":"'4'!$E$116","v":496.96},{"$f":"G44+F44","v":9122.0867039999994},{"$f":"H44*E44","v":18244.173407999999},null,{"$f":"I44/$I$51","v":1.5335275123643364E-2},{"$f":"$I$64*K44","v":3248.3718418440094}]
[null,null,5,{"$f":"HLOOKUP(C45,'Dados Gerais'!$D$5:$BK$10,6)","v":"AUXILIAR DE ENCARREGADO"},{"$f":"HLOOKUP(C45,'Dados Gerais'!$D$5:$BK$14,10)","v":1},6063.0264479999987,{"$f":"'5'!$E$116","v":311.72000000000003},6374.746447999999,6374.746447999999,null,5.3583403554299455E-3,1135.0224752576696]
[null,null,6,{"$f":"HLOOKUP(C46,'Dados Gerais'!$D$5:$BK$10,6)","v":"ALMOXARIFE"},{"$f":"HLOOKUP(C46,'Dados Gerais'!$D$5:$BK$14,10)","v":2},6828.5106160000014,{"$f":"'6'!$E$116","v":373.09000000000003},7201.6006160000015,14403.201232000003,null,1.2106717504508336E-2,2564.4874266501902]
[null,null,7,{"$f":"HLOOKUP(C47,'Dados Gerais'!$D$5:$BK$10,6)","v":"SERVENTE"},{"$f":"HLOOKUP(C47,'Dados Gerais'!$D$5:$BK$14,10)","v":151},5337.6276400000006,{"$f":"'7'!$E$116","v":263.70999999999998},{"$f":"G47+F47","v":5601.3376400000006},{"$f":"H47*E47","v":845801.98364000011},null,0.71094512363904327,150594.89328396894]
[null,null,8,{"$f":"HLOOKUP(C48,'Dados Gerais'!$D$5:$BK$10,6)","v":"SERVENTE COM ADICIONAL DE INSALUBRIDADE"},{"$f":"HLOOKUP(C48,'Dados Gerais'!$D$5:$BK$14,10)","v":25},5853.1570480000009,{"$f":"'8'!$E$116","v":299.88},6153.0370480000011,153825.92620000002,null,0.12929952191705568,27388.678897041471]
[null,null,9,{"$f":"HLOOKUP(C49,'Dados Gerais'!$D$5:$BK$10,6)","v":"SERVENTE COM ADICIONAL DE INSALUBRIDADE E ADICIONAL NOTURNO"},{"$f":"HLOOKUP(C49,'Dados Gerais'!$D$5:$BK$14,10)","v":2},5960.9245280000014,{"$f":"'9'!$E$116","v":307.44},6268.364528000001,12536.729056000002,null,1.0537840488845117E-2,2232.16238651189]
[]
[null,null,null,"TOTAL MENSAL - SALÁRIOS",null,null,null,null,{"$f":"SUM(I41:I50)","v":1189686.736032}]
[]
[null,null,"ITEM","DESCRIÇÃO",null,null,null,null,"PREÇO TOTAL (MENSAL)"]
[null,null,"EQUIP","EQUIPAMENTOS NÃO RELACIONADOS DIRETAMENTE A UM POSTO DE TRABALHO",null,null,null,null,{"$f":"'Não Rel - Depr'!M62","v":0}]
[null,null,"HEXTRA","HORAS EXTRAS",null,null,null,null,{"$f":"'Não Rel - Depr'!M62","v":0}]
[null,null,"HNOT","ADICIONAL DE HORAS NOTURNAS (SOB DEMANDA)",null,null,null,null,0]
[null,null,"SREP","SISTEMA DE REGISTRO ELETRÔNICO DE PRESENÇA - SREP",null,null,null,null,{"$f":"SREP!$M$46","v":460.94000000000005}]
[null,null,"EPI - N.REL","EQUIPAMENTOS DE PROTEÇÃO INDIVIDUAL NÃO RELACIONADOS DIRETAMENTE A UM POSTO DE TRABALHO",null,null,null,null,{"$f":"'Não Rel - EPI'!K34","v":2438.3308333333339}]
[null,null,"EQUIP - N.REL","EQUIPAMENTOS NÃO RELACIONADAS DIRETAMENTE A UM POSTO DE TRABALHO",null,null,null,null,{"$f":"'Não Rel - Depr'!M63","v":4697.03}]
[null,null,"MAT ","MATERIAIS NÃO RELACIONADOS DIRETAMENTE A UM POSTO DE TRABALHO",null,null,null,null,{"$f":"'Não Rel - Mat Consumo'!L56","v":194147.255}]
[null,null,"MAT CONS DURAVEL","MATERIAIS DE CONSUMO DURÁVEL NÃO RELACIONADOS DIRETAMENTE A UM POSTO DE TRABALHO",null,null,null,null,{"$f":"'Não Rel - Mat Cons Durável'!M37","v":6659.2983333333323}]
[null,null,"EQ SOB DEMANDA","SERVIÇOS NÃO RELACIONADOS DIRETAMENTE A UM POSTO DE TRABALHO ",null,null,null,null,3420.6583333333333]
[]
[null,null,null,"TOTAL MENSAL",null,null,null,null,{"$f":"SUM(I54:I63)","v":211823.51250000001},null,{"$f":"(I64+I51)*12","v":16818122.982384}]
[]
[null,null,null,"TOTAL MENSAL - ITENS ORDINÁRIOS"]
[null,null,null,"DESCRIÇÃO",null,null,null,"VALOR"]
[null,null,null,"Postos de Trabalho - Inclusive 13º Salário",null,null,null,{"$f":"I51","v":1189686.736032}]
[null,null,null,"Adicional de Horas Noturnas",null,null,null,{"$f":"I56","v":0}]
[null,null,null,"Sistema de Registro Eletrônico de Presença - SREP",null,null,null,{"$f":"I57","v":460.94000000000005}]
[null,null,null,"Equipamentos de Proteção Individual não relacionados diretamente a um posto de trabalho",null,null,null,{"$f":"I58","v":2438.3308333333339}]
[null,null,null,"Equipamentos não relacionadas diretamente a um posto de trabalho",null,null,null,{"$f":"I59","v":4697.03}]
[null,null,null,"Materiais de consumo não relacionados diretamente a um posto de trabalho",null,null,null,{"$f":"$I$60","v":194147.255}]
[null,null,null,"Materiais de consumo duráveis não relacionados diretamente a um posto de trabalho",null,null,null,{"$f":"$I$61","v":6659.2983333333323}]
[]
[null,null,null,null,null,null,"TOTAL MENSAL DA CONTRATAÇÃO",{"$f":"SUM(H68:H75)","v":1398089.5901986668},null,null,{"$f":"Extenso_Valor(H76)","v":"um milhão, trezentos e noventa e oito mil e oitenta e nove reais e cinquenta e nove centavos"}]
[]
[null,null,null,"TOTAL ANUAL - ITENS ORDINÁRIOS"]
[]
[null,null,null,null,null,null,"12 x TOTAL MENSAL",{"$f":"H76*12","v":16777075.082384001}]
[]
[null,null,null,"TOTAL MENSAL - ITENS SOB DEMANDA"]
[null,null,null,"DESCRIÇÃO",null,null,null,"VALOR"]
[null,null,null,"Serviços não relacionados diretamente a um posto de trabalho - AQUISIÇÃO SOB DEMANDA",null,null,null,3420.6583333333333]
[]
[null,null,null,null,null,null,"TOTAL MENSAL DA CONTRATAÇÃO",3420.6583333333333]
[]
[null,null,null,"TOTAL ANUAL - ITENS SOB DEMANDA"]
[]
[null,null,null,null,null,null,"12 x TOTAL MENSAL",{"$f":"H86*12","v":41047.9}]
[]
[null,null,null,"TOTAL ANUAL DA CONTRATAÇÃO"]
[]
[null,null,null,null,null,null,null,{"$f":"H90+H80","v":16818122.982384},null,null,{"$f":"Extenso_Valor(H94)","v":"dezesseis milhões, oitocentos e dezoito mil, cento e vinte e dois reais e noventa e oito centavos"}]
[]
[null,null,null,"TOTAL GLOBAL DA CONTRATAÇÃO (30 MESES)"]
[]
[null,null,null,null,null,null,null,{"$f":"H94/12*30","v":42045307.455959998}]
[]
[]
[]
[]
[null,null,null,null,null,null,null,{"$f":"H76+H86","v":1401510.2485320002},null,null,{"$f":"Extenso_Valor(H103)","v":"um milhão, quatrocentos e um mil, quinhentos e dez reais e vinte e cinco centavos"}]

{"sheet":"1","index":4,"n_rows":119,"n_cols":8,"rows_kept":119,"cut":false,"hidden":false,"merged":[[106,1,106,3],[1,1,1,5],[2,1,2,5],[7,1,7,3],[17,1,17,3],[4,1,4,2],[46,1,46,3],[56,1,56,3],[74,1,74,3],[83,1,83,3],[5,1,5,2],[39,3,39,5],[68,3,68,5]]}
[]
[null,"PLANILHA DE ESTIMATIVA DE CUSTOS"]
[null,"Padrão IN 05/2017 e IN 07/2018 - MPDG"]
[]
[null,1,null,{"$f":"HLOOKUP($B$5,'Dados Gerais'!$D$5:$BK$20,6)","v":"ENCARREGADO GERAL"},"QUANTIDADE",{"$f":"HLOOKUP($B$5,'Dados Gerais'!$D$5:$BK$20,10)","v":1}]
[null,"CCT",null,{"$f":"HLOOKUP($B$5,'Dados Gerais'!$D$5:$BK$20,15)","v":"SEAC/DF X SINDISERVIÇOS/DF 2023/2023 Nº DF000037/2023"},"DATA-BASE",{"$f":"HLOOKUP($B$5,'Dados Gerais'!$D$5:$BK$20,16)","v":"2023-01-01"}]
[]
[null,"MÓDULO 1 - COMPOSIÇÃO DA REMUNERAÇÃO",null,null,null,"Valor"]
[null,null,"A","Salário-Base",null,{"$f":"HLOOKUP($B$5,'Dados Gerais'!$D$5:$BK$20,8)","v":7376.1}]
[null,null,"B","Adicional de Periculosidade",null,{"$f":"HLOOKUP($B$5,'Dados Gerais'!$D$5:$BK$37,25)","v":0}]
[null,null,"C","Adicional de Insalubridade",null,{"$f":"HLOOKUP($B$5,'Dados Gerais'!$D$5:$BK$37,31)","v":0}]
[null,null,"D","Adicional Noturno",null,{"$f":"HLOOKUP($B$5,'Dados Gerais'!$D$5:$BK$50,46)","v":0},null,"* Nota 1 - O Módulo 1 refere-se ao valor mensal devido ao empregado pela prestação do serviço no período de 12 meses."]
[null,null,"E","Adicional de Hora Extra",null,{"$f":"HLOOKUP($B$5,'Dados Gerais'!$D$5:$BK$67,63)","v":0},null,"* Nota 2 - O adicional de hora extra no feriado trabalhado foi suprimido pela Lei 13.467/17"]
[null,null,"F","Outros (especificar)",null,{"$f":"HLOOKUP($B$5,'Dados Gerais'!$D$5:$BK$59,33)","v":0},null,"* Nota 3 - ART. 7º, § 2º, DA LEI Nº 605/49.Sendo mensalista o obreiro, o adicional noturno pago de forma fixa já é considerado integrado para os efeitos do pagamento do repouso semanal remunerado, nos termos do art. 7º, § 2º, da Lei nº 605/49."]
[]
[null,null,null,"TOTAL DA REMUNERAÇÃO",null,{"$f":"SUM(F9:F14)","v":7376.1}]
[]
[null,"MÓDULO 2 - ENCARGOS E BENEFÍCIOS ANUAIS, MENSAIS E DIÁRIOS",null,null,"Percentuais","Valor"]
[null,"Submódulo 2.1 - 13º Salário, Férias e Adicional de Férias"]
[null,null,"A","13º Salário - Calculado no Módulo 7 - Destacado",0,{"$f":"ROUND(E20*F$16,2)","v":0}]
[null,null,"B","Férias e Adicional de Férias",{"$f":"'Encargos Sociais'!E31","v":3.03030303030303E-2},{"$f":"ROUND(E21*F$16,2)","v":223.52},null,"* Nota 1 - Provisiona-se, mensalmente, o proporcional a 1/12 dos valores referentes a gratificação natalina, férias e adicional de férias."]
[null,null,null,null,null,null,null,"* Nota 2 - O adicional de férias contido no Submódulo 2.1 corresponde a 1/3 da remuneração que, por sua vez, é dividida por 12 contome Nota 1."]
[null,"Submódulo 2.2 - Encargos Previdenciários (GPS), Fundo de Garantia por Tempo de Serviço (FGTS) e Outras Contribuições"]
[null,null,"A","INSS (art. 22, inciso I, Lei nº 8.212/91)",{"$f":"'Encargos Sociais'!E14","v":0.2},{"$f":"ROUND(E24*($F$16+$F$41+$F$73),2)","v":1683.59}]
[null,null,"B","Salário Educação (art. 3º, inciso I, Decreto nº 87.043/82)",{"$f":"'Encargos Sociais'!E15","v":2.5000000000000001E-2},{"$f":"ROUND(E25*($F$16+$F$41+$F$73),2)","v":210.45}]
[null,null,"C","SAT/RAT (art. 22, II, Lei 8.212/91 e Anexo V, Decreto 6.042/07) - Enquadramento 8211-3/00",{"$f":"'Encargos Sociais'!E16","v":0.03},252.54]
[null,null,"D","SESC ou SESI (art. 30, Lei nº 8.036/90 e art. 1º, Lei 8.154/90)",{"$f":"'Encargos Sociais'!E17","v":1.4999999999999999E-2},126.27]
[null,null,"E","SENAI ou SENAC (Decreto nº 2.318/86)",{"$f":"'Encargos Sociais'!E18","v":0.01},84.18]
[null,null,"F","SEBRAE (§ 3º, art. 8º, Lei 8.029/90, alterada pela Lei nº 8.154/90)",{"$f":"'Encargos Sociais'!E19","v":6.0000000000000001E-3},50.51]
[null,null,"G","INCRA (art. 1º, I, Decreto Lei 1.146/70 e Lei 7.787, de 30/06/89)",{"$f":"'Encargos Sociais'!E20","v":2E-3},16.84,null,"* Nota 1 - Os percentuais dos encargos previdenciários, do FGTS e demais contribuições são estabelecidos por legislação vigente."]
[null,null,"H","FGTS (Lei Complementar nº 110/01 e art. 30, Lei nº 8.036/90)",{"$f":"'Encargos Sociais'!E21","v":0.08},673.44,null,"* Nota 2 - O SAT, a depender do grau de risco do serviço, irá variar entre 1%, para risco leve, de 2%, para risco médio, e de 3% para risco grave."]
[null,null,"I","SECONCI (Convenções Coletivas de Trabalho da construção)",{"$f":"'Encargos Sociais'!E22","v":0},0,null,"* Nota 3 - Os percentuais do Submódulo 2.2 incidem sobre o Módulo 1 e o Submódulo 2.1."]
[]
[null,"Submódulo 2.3 - Benefícios Mensais e Diários"]
[null,null,"A","Auxílio Transporte",null,{"$f":"HLOOKUP($B$5,'Dados Gerais'!$D$5:$BK$93,82)","v":0}]
[null,null,"B","Auxílio Alimentação",null,{"$f":"HLOOKUP($B$5,'Dados Gerais'!$D$5:$BK$93,89)","v":972}]
[null,null,"C","Assistência Médica e Familiar",null,{"$f":"HLOOKUP($B$5,'Dados Gerais'!$D$5:$BK$101,97)","v":0}]
[null,null,"D","Outros (Seguro de vida e auxílio funeral e auxílio odontológico)",null,{"$f":"HLOOKUP($B$5,'Dados Gerais'!$D$5:$BK$118,114)","v":0},null,"* Nota 1 - O valor informado deverá ser o custo real do benefício (descontado o valor eventualmente pago pelo empregado)."]
[null,null,null,null,null,null,null,"* Nota 2 - Observar a previsão dos benefícios contidos em Acordos, Convenções e Dissídios Coletivos de Trabalho e o disposto no art. 6º da IN 5/2017"]
[null,null,null,"QUADRO-RESUMO DO MÓDULO 2"]
[null,null,null,"2.1 - 13º Salário, Férias e Adicional de Férias - 13º Destacado - Calculado no Módulo 7 ",{"$f":"SUM(E20:E21)","v":3.03030303030303E-2},{"$f":"F20+F21","v":223.52}]
[null,null,null,"2.2 - Encargos Previdenciários (GPS), Fundo de Garantia por Tempo de Serviço (FGTS) e Contribuições",{"$f":"SUM(E24:E32)","v":0.36800000000000005},{"$f":"SUM(F24:F32)","v":3097.82}]
[null,null,null,"2.3 - Benefícios Mensais e Diários",null,{"$f":"SUM(F35:F38)","v":972}]
[]
[null,null,null,"TOTAL DOS ENCARGOS E BENEFÍCIOS",null,{"$f":"SUM(F41:F43)","v":4293.34}]
[]
[null,"MÓDULO 3 - PREVISÃO PARA RESCISÃO",null,null,"Percentuais","Valor"]
[null,null,"A","Aviso Prévio Indenizado (Art. 7º, inciso XXI, da CF/1988 e arts. 477, 487, §1º, e 491 da CLT)",{"$f":"'Encargos Sociais'!E36","v":8.3333333333333332E-3},{"$f":"ROUND(E48*$F$16,2)","v":61.47}]
[null,null,"B","Incidência do FGTS sobre o Aviso Prévio Indenizado (Súmula 305 TST)",{"$f":"'Encargos Sociais'!E37","v":6.6666666666666664E-4},4.92,null,"* Nota 1 - Adotou-se os parâmetros do estudo do STF (http://www.stf.jus.br/arquivo/cms/sobrestfestudosci/anexo/encargos_sociais_03102007.pdf), onde 5% do pessoal é demitido pelo empregador no decurso do contrato (para estes, considerou-se o aviso prévio indenizado). Desprezou-se as demissões por justa causa e os pedidos de demissão."]
[null,null,"C","Multa do FGTS e Contribuição Social sobre o Aviso Prévio Indenizado (Art. 18, §1º, da Lei 8.036/1990 e art. 1º da LC nº 110/2001)",{"$f":"'Encargos Sociais'!E38","v":7.7170666666666644E-3},56.92,null,"* Nota 2 - No cálculo do percentual, considerou-se 36 dias, correspondendo à metade da duração média dos contratos (2 anos)"]
[null,null,"D","Aviso Prévio Trabalhado (Art. 488, parágrafo único, CLT)",{"$f":"'Encargos Sociais'!E39","v":1.2037037037037035E-2},88.79,null,"* Nota 3 - Incide sobre a Remuneração + 13º salário (1/12) + Férias (1/12) + Adicional de Férias (1/36) x 50% multa (40% para o empregado e 10% de contribuição social) x 8% FGTS"]
[null,null,"E","Incidência de GPS, FGTS e outras contribuições sobre o Aviso Prévio Trabalhado",{"$f":"'Encargos Sociais'!E40","v":4.4296296296296288E-3},32.67,null,"* Nota 4 - Os 95% restantes do cálculo, a um prazo médio de contrato de 4 anos. Assim, calcula-se 7 dias para o 1º ano de contrato e mais 3 dias para os 3 anos seguintes."]
[null,null,"F","Multa do FGTS e Contribuição Social sobre o Aviso Prévio Trabalhado",{"$f":"'Encargos Sociais'!E41","v":3.0505155555555549E-2},225.01]
[]
[null,null,null,"TOTAL DE PREVISÃO PARA RESCISÃO",null,{"$f":"SUM(F48:F53)","v":469.78000000000003}]
[]
[null,"MÓDULO 4 - CUSTO DO PROFISSIONAL AUSENTE",null,null,"Percentuais","Valor"]
[null,"Submódulo 4.1 - Ausências Legais"]
[null,null,"A","Férias (Arts. 129 e 130, inc. I, da CLT)",{"$f":"'Encargos Sociais'!E25","v":9.0909090909090912E-2},{"$f":"ROUND(E59*$F$16,2)","v":670.55},null,"* Nota 1 - As alíneas “A” a “F” referem-se somente ao custo que será pago ao repositor pelos dias \ntrabalhados quando da necessidade de substituir a mão de obra alocada na prestação do serviço."]
[null,null,"B","Ausências Legais (Arts. 131 e 473 da CLT)",{"$f":"'Encargos Sociais'!E26","v":7.9365079365079361E-3},58.54,null,"* Nota 2 - Adotou-se a estimativa do SINAPI de 2 dias por ano."]
[null,null,"C","Licença-Paternidade (Art. 7º, XIX, e art. 10, §1º, do ADCT, CF/1988 e Art. 1º, II, da Lei 11.770/2008)",{"$f":"'Encargos Sociais'!E27","v":8.2777777777777776E-4},6.11,null,"* Nota 3 - Utilizada a proporção de 50% para homens, 5 dias de afastamento, e a probabilidade de um trabalhador requerer a Licença Paternidade em 5,22%, conforme SINAPI (citando dados da PNAD 2015)"]
[null,null,"D","Ausência por Acidente de Trabalho (Art. 131, III, da CLT)",{"$f":"'Encargos Sociais'!E28","v":8.541666666666667E-4},6.3,null,"* Nota 4 - Utilzada a estatística de 1,96% dos contribuintes beneficiados com a emissão do auxílio, conforme Anuário Estatístico da Previdência Social. Afastamento de 15 dias a cargo da empresa."]
[null,null,"E","Afastamento Maternidade (Art. 71 da Lei nº 8.213/1991)",{"$f":"'Encargos Sociais'!E29","v":3.2925925925925922E-3},24.29,null,"* Nota 5 - Utilizada a proporção de 50% para mulheres, 180 dias de afastamento, e a probabilidade de uma trabalhadora requerer a Licença Maternidade em 4,91%, conforme SINAPI (citando dados do IBGE 2016)"]
[null,null,"F","Auxílio Enfermidade - Doença (Art. 59 da Lei nº 8.213/1991)",{"$f":"'Encargos Sociais'!E30","v":7.1222222222222225E-3},52.53,null,"* Nota 6 - Utilizada a estatística de 3,37% dos contribuintes beneficiados com o auxílio, conforme Anuário Estatístico da Previdência Social de 2015 (acrescidos de 2 dias ao ano, para os quais o trabalhador nem requer o benefício da Previdência - conforme SINAPI)"]
[]
[null,"Submódulo 4.2 - Intrajornada"]
[null,null,"A","Intervalo para repouso ou alimentação",{"$f":"'Encargos Sociais'!E33","v":0},{"$f":"ROUND(E67*$F$16,2)","v":0}]
[]
[null,null,null,"QUADRO-RESUMO DO MÓDULO 4",null,"Valor"]
[null,null,null,"4.1 - Ausências Legais",{"$f":"SUM(E59:E64)","v":0.11094235810485811},{"$f":"ROUND(E70*$F$16,2)","v":818.32}]
[null,null,null,"4.2 - Intrajornada",{"$f":"E67","v":0},{"$f":"ROUND(E71*$F$16,2)","v":0}]
[]
[null,null,null,"TOTAL DE PREVISÃO PARA RESCISÃO E INTERVALO INTRAJORNADA",null,{"$f":"SUM(F70:F71)","v":818.32}]
[]
[null,"MÓDULO 5 - INSUMOS DIVERSOS",null,null,null,"Valor"]
[null,null,"A","Uniformes - aquisição",null,{"$f":"ROUND(HLOOKUP($B$5,Uniformes!L4:EA95,3)/12,2)","v":185.08}]
[null,null,"B","Materiais de consumo relacionados ao posto - aquisição",null,{"$f":"ROUND(HLOOKUP(B5,'Mat Cons'!I11:DX13,3)/12,2)","v":0}]
[null,null,"C","Materiais permanentes relacionados ao posto - remuneração da sua depreciação / manutenção",null,{"$f":"HLOOKUP(B5,'Mat Perm'!Q11:EF13,3)","v":0}]
[null,null,"D","Equipamentos relacionados ao posto - remuneração da sua depreciação / manutenção",null,{"$f":"HLOOKUP(B5,'Equip Rel'!Q11:EF13,3)","v":0}]
[null,null,"E","Equipamentos de Proteção Individual - EPI - aquisição",null,{"$f":"ROUND(HLOOKUP(B5,EPI!J4:DY6,3)/12,2)","v":9.77}]
[]
[null,null,null,"TOTAL DE INSUMOS DIVERSOS",null,{"$f":"SUM(F76:F81)","v":194.85000000000002},null,"* Nota - Valores mensais por empregado"]
[]
[null,"MÓDULO 6 - CUSTOS INDIRETOS, TRIBUTOS E LUCRO - BDI",null,null,"Percentuais","Valor"]
[null,null,"A","Custos Indiretos",{"$f":"BDI!E6","v":2.7000000000000003E-2}]
[null,null,"A.1","Administração Central",{"$f":"BDI!E7","v":2.1600000000000001E-2}]
[null,null,"A.2","Seguros, Garantias e Riscos",{"$f":"BDI!E8","v":5.4000000000000003E-3}]
[null,null,"B","Lucro",{"$f":"BDI!E10","v":3.3399999999999999E-2}]
[null,null,"C","Tributos",{"$f":"SUM(E90:E91)","v":0.124}]
[null,null,"C.1","Tributos Federais (COFINS, PIS e CPRB)",{"$f":"BDI!E18","v":7.3999999999999996E-2}]
[null,null,"C.2","Tributos Distritais (ISS)",{"$f":"BDI!E23","v":0.05},null,null,"* Nota - Utilizou-se o indicado pelo Sindicato da Arquitetura e da Engenharia (Sinaenco, 2008, p. 22), que adota um percentual redutor de 20% no cálculo dos custos tributários relativos às contribuições PIS e COFINS"]
[null,null,"D","Despesas Financeiras",{"$f":"BDI!E13","v":5.6394995474364773E-3}]
[]
[null,null,null,"TOTAL DE BDI",{"$f":"BDI!E26","v":0.21840000000000001},{"$f":"E94*E102","v":2872.4819760000005}]
[]
[null,null,null,"QUADRO-RESUMO DO CUSTO MENSAL POR EMPREGADO - SEM O 13º","Valor"]
[null,null,null,"Módulo 1 - Composição da Remuneração",{"$f":"F16","v":7376.1}]
[null,null,null,"Módulo 2 - Encargos e Benefícios Anuais, Mensais e Diários",{"$f":"F45","v":4293.34}]
[null,null,null,"Módulo 3 - Provisão para Rescisão",{"$f":"F55","v":469.78000000000003}]
[null,null,null,"Módulo 4 - Custo de Reposição do Profissional Ausente",{"$f":"F73","v":818.32}]
[null,null,null,"Módulo 5 - Insumos Diversos",{"$f":"F82","v":194.85000000000002}]
[null,null,null,"SUBTOTAL (A+B+C+D+E)",{"$f":"SUM(E97:E101)","v":13152.390000000001}]
[null,null,null,"Módulo 6 - Custos Indiretos, Tributos e Lucro",{"$f":"F94","v":2872.4819760000005}]
[]
[null,null,null,"TOTAL DO POSTO",{"$f":"SUM(E102:E103)","v":16024.871976000002}]
[]
[null,"MÓDULO 7 - DESTAQUE DO MÓDULO 2 - 13º SALÁRIO",null,null,"Percentuais","Valor"]
[null,null,"A","13º Salário",{"$f":"'Encargos Sociais'!E32","v":8.3333333333333329E-2},{"$f":"ROUND(E108*F$16,2)","v":614.67999999999995}]
[null,null,"B","Encargos Sociais sobre o 13º Salário - Taxa calculada no SUBMÓDULO 2.2",{"$f":"SUM($E$24:$E$32)","v":0.36800000000000005},{"$f":"ROUND(E109*$F$108,2)","v":226.2},null,"* Nota 1 - Provisiona-se, mensalmente, o proporcional a 1/12 dos valores referentes a gratificação natalina e adicional de férias."]
[null,null,"C","Reincidência de férias sobre o 13º Salário",{"$f":"E59","v":9.0909090909090912E-2},{"$f":"ROUND(E110*$F$108,2)","v":55.88}]
[null,null,"D","BDI sobre o 13º Salário - Taxa calculada no MÓDULO 6",{"$f":"E94","v":0.21840000000000001},{"$f":"ROUND(E111*($F$108+$F$109),2)","v":183.65}]
[]
[null,null,null,"TOTAL DO DESTAQUE DO 13º SALÁRIO",null,{"$f":"SUM(F108:F111)","v":1080.4099999999999}]
[]
[null,null,null,"QUADRO-RESUMO DO CUSTO MENSAL POR EMPREGADO","Valor"]
[null,null,null,"Custo total - sem o 13º Salário",{"$f":"E105","v":16024.871976000002}]
[null,null,null,"Destaque do 13º Salário (valor mensal)",{"$f":"F113","v":1080.4099999999999}]
[]
[null,null,null,"TOTAL DO POSTO",{"$f":"E116+E117","v":17105.281976000002}]

{"sheet":"2","index":5,"n_rows":119,"n_cols":8,"rows_kept":119,"cut":false,"hidden":false,"merged":[[17,1,17,3],[106,1,106,3],[39,3,39,5],[46,1,46,3],[56,1,56,3],[68,3,68,5],[74,1,74,3],[83,1,83,3],[1,1,1,5],[2,1,2,5],[4,1,4,2],[5,1,5,2],[7,1,7,3]]}
[]
[null,"PLANILHA DE ESTIMATIVA DE CUSTOS"]
[null,"Padrão IN 05/2017 e IN 07/2018 - MPDG"]
[]
[null,2,null,{"$f":"HLOOKUP($B$5,'Dados Gerais'!$D$5:$BK$20,6)","v":"ENCARREGADO SETORIAL"},"QUANTIDADE",{"$f":"HLOOKUP($B$5,'Dados Gerais'!$D$5:$BK$20,10)","v":1}]
[null,"CCT",null,{"$f":"HLOOKUP($B$5,'Dados Gerais'!$D$5:$BK$20,15)","v":"SEAC/DF X SINDISERVIÇOS/DF 2023/2023 Nº DF000037/2023"},"DATA-BASE",{"$f":"HLOOKUP($B$5,'Dados Gerais'!$D$5:$BK$20,16)","v":"2023-01-01"}]
[]
[null,"MÓDULO 1 - COMPOSIÇÃO DA REMUNERAÇÃO",null,null,null,"Valor"]
[null,null,"A","Salário-Base",null,{"$f":"HLOOKUP($B$5,'Dados Gerais'!$D$5:$BK$20,8)","v":3951.73}]
[null,null,"B","Adicional de Periculosidade",null,{"$f":"HLOOKUP($B$5,'Dados Gerais'!$D$5:$BK$37,25)","v":0}]
[null,null,"C","Adicional de Insalubridade",null,{"$f":"HLOOKUP($B$5,'Dados Gerais'!$D$5:$BK$37,31)","v":0}]
[null,null,"D","Adicional Noturno",null,{"$f":"HLOOKUP($B$5,'Dados Gerais'!$D$5:$BK$50,46)","v":0},null,"* Nota 1 - O Módulo 1 refere-se ao valor mensal devido ao empregado pela prestação do serviço no período de 12 meses."]
[null,null,"E","Adicional de Hora Extra",null,{"$f":"HLOOKUP($B$5,'Dados Gerais'!$D$5:$BK$67,63)","v":0},null,"* Nota 2 - O adicional de hora extra no feriado trabalhado foi suprimido pela Lei 13.467/17"]
[null,null,"F","Outros (especificar)",null,{"$f":"HLOOKUP($B$5,'Dados Gerais'!$D$5:$BK$59,33)","v":0},null,"* Nota 3 - ART. 7º, § 2º, DA LEI Nº 605/49.Sendo mensalista o obreiro, o adicional noturno pago de forma fixa já é considerado integrado para os efeitos do pagamento do repouso semanal remunerado, nos termos do art. 7º, § 2º, da Lei nº 605/49."]
[]
[null,null,null,"TOTAL DA REMUNERAÇÃO",null,{"$f":"SUM(F9:F14)","v":3951.73}]
[]
[null,"MÓDULO 2 - ENCARGOS E BENEFÍCIOS ANUAIS, MENSAIS E DIÁRIOS",null,null,"Percentuais","Valor"]
[null,"Submódulo 2.1 - 13º Salário, Férias e Adicional de Férias"]
[null,null,"A","13º Salário - Calculado no Módulo 7 - Destacado",0,{"$f":"ROUND(E20*F$16,2)","v":0}]
[null,null,"B","Férias e Adicional de Férias",{"$f":"'Encargos Sociais'!E31","v":3.03030303030303E-2},{"$f":"ROUND(E21*F$16,2)","v":119.75},null,"* Nota 1 - Provisiona-se, mensalmente, o proporcional a 1/12 dos valores referentes a gratificação natalina, férias e adicional de férias."]
[null,null,null,null,null,null,null,"* Nota 2 - O adicional de férias contido no Submódulo 2.1 corresponde a 1/3 da remuneração que, por sua vez, é dividida por 12 contome Nota 1."]
[null,"Submódulo 2.2 - Encargos Previdenciários (GPS), Fundo de Garantia por Tempo de Serviço (FGTS) e Outras Contribuições"]
[null,null,"A","INSS (art. 22, inciso I, Lei nº 8.212/91)",{"$f":"'Encargos Sociais'!E14","v":0.2},{"$f":"ROUND(E24*($F$16+$F$41+$F$73),2)","v":901.98}]
[null,null,"B","Salário Educação (art. 3º, inciso I, Decreto nº 87.043/82)",{"$f":"'Encargos Sociais'!E15","v":2.5000000000000001E-2},{"$f":"ROUND(E25*($F$16+$F$41+$F$73),2)","v":112.75}]
[null,null,"C","SAT/RAT (art. 22, II, Lei 8.212/91 e Anexo V, Decreto 6.042/07) - Enquadramento 8211-3/00",{"$f":"'Encargos Sociais'!E16","v":0.03},135.30000000000001]
[null,null,"D","SESC ou SESI (art. 30, Lei nº 8.036/90 e art. 1º, Lei 8.154/90)",{"$f":"'Encargos Sociais'!E17","v":1.4999999999999999E-2},67.650000000000006]
[null,null,"E","SENAI ou SENAC (Decreto nº 2.318/86)",{"$f":"'Encargos Sociais'!E18","v":0.01},45.1]
[null,null,"F","SEBRAE (§ 3º, art. 8º, Lei 8.029/90, alterada pela Lei nº 8.154/90)",{"$f":"'Encargos Sociais'!E19","v":6.0000000000000001E-3},27.06]
[null,null,"G","INCRA (art. 1º, I, Decreto Lei 1.146/70 e Lei 7.787, de 30/06/89)",{"$f":"'Encargos Sociais'!E20","v":2E-3},9.02,null,"* Nota 1 - Os percentuais dos encargos previdenciários, do FGTS e demais contribuições são estabelecidos por legislação vigente."]
[null,null,"H","FGTS (Lei Complementar nº 110/01 e art. 30, Lei nº 8.036/90)",{"$f":"'Encargos Sociais'!E21","v":0.08},360.79,null,"* Nota 2 - O SAT, a depender do grau de risco do serviço, irá variar entre 1%, para risco leve, de 2%, para risco médio, e de 3% para risco grave."]
[null,null,"I","SECONCI (Convenções Coletivas de Trabalho da construção)",{"$f":"'Encargos Sociais'!E22","v":0},0,null,"* Nota 3 - Os percentuais do Submódulo 2.2 incidem sobre o Módulo 1 e o Submódulo 2.1."]
[]
[null,"Submódulo 2.3 - Benefícios Mensais e Diários"]
[null,null,"A","Auxílio Transporte",null,{"$f":"HLOOKUP($B$5,'Dados Gerais'!$D$5:$BK$93,82)","v":118.28999999999999}]
[null,null,"B","Auxílio Alimentação",null,{"$f":"HLOOKUP($B$5,'Dados Gerais'!$D$5:$BK$93,89)","v":972}]
[null,null,"C","Assistência Médica e Familiar",null,{"$f":"HLOOKUP($B$5,'Dados Gerais'!$D$5:$BK$101,97)","v":0}]
[null,null,"D","Outros (Seguro de vida e auxílio funeral e auxílio odontológico)",null,{"$f":"HLOOKUP($B$5,'Dados Gerais'!$D$5:$BK$118,114)","v":0},null,"* Nota 1 - O valor informado deverá ser o custo real do benefício (descontado o valor eventualmente pago pelo empregado)."]
[null,null,null,null,null,null,null,"* Nota 2 - Observar a previsão dos benefícios contidos em Acordos, Convenções e Dissídios Coletivos de Trabalho e o disposto no art. 6º da IN 5/2017"]
[null,null,null,"QUADRO-RESUMO DO MÓDULO 2"]
[null,null,null,"2.1 - 13º Salário, Férias e Adicional de Férias - 13º Destacado - Calculado no Módulo 7 ",{"$f":"SUM(E20:E21)","v":3.03030303030303E-2},{"$f":"F20+F21","v":119.75}]
[null,null,null,"2.2 - Encargos Previdenciários (GPS), Fundo de Garantia por Tempo de Serviço (FGTS) e Contribuições",{"$f":"SUM(E24:E32)","v":0.36800000000000005},{"$f":"SUM(F24:F32)","v":1659.6499999999999}]
[null,null,null,"2.3 - Benefícios Mensais e Diários",null,{"$f":"SUM(F35:F38)","v":1090.29}]
[]
[null,null,null,"TOTAL DOS ENCARGOS E BENEFÍCIOS",null,{"$f":"SUM(F41:F43)","v":2869.6899999999996}]
[]
[null,"MÓDULO 3 - PREVISÃO PARA RESCISÃO",null,null,"Percentuais","Valor"]
[null,null,"A","Aviso Prévio Indenizado (Art. 7º, inciso XXI, da CF/1988 e arts. 477, 487, §1º, e 491 da CLT)",{"$f":"'Encargos Sociais'!E36","v":8.3333333333333332E-3},{"$f":"ROUND(E48*$F$16,2)","v":32.93}]
[null,null,"B","Incidência do FGTS sobre o Aviso Prévio Indenizado (Súmula 305 TST)",{"$f":"'Encargos Sociais'!E37","v":6.6666666666666664E-4},2.63,null,"* Nota 1 - Adotou-se os parâmetros do estudo do STF (http://www.stf.jus.br/arquivo/cms/sobrestfestudosci/anexo/encargos_sociais_03102007.pdf), onde 5% do pessoal é demitido pelo empregador no decurso do contrato (para estes, considerou-se o aviso prévio indenizado). Desprezou-se as demissões por justa causa e os pedidos de demissão."]
[null,null,"C","Multa do FGTS e Contribuição Social sobre o Aviso Prévio Indenizado (Art. 18, §1º, da Lei 8.036/1990 e art. 1º da LC nº 110/2001)",{"$f":"'Encargos Sociais'!E38","v":7.7170666666666644E-3},30.5,null,"* Nota 2 - No cálculo do percentual, considerou-se 36 dias, correspondendo à metade da duração média dos contratos (2 anos)"]
[null,null,"D","Aviso Prévio Trabalhado (Art. 488, parágrafo único, CLT)",{"$f":"'Encargos Sociais'!E39","v":1.2037037037037035E-2},47.57,null,"* Nota 3 - Incide sobre a Remuneração + 13º salário (1/12) + Férias (1/12) + Adicional de Férias (1/36) x 50% multa (40% para o empregado e 10% de contribuição social) x 8% FGTS"]
[null,null,"E","Incidência de GPS, FGTS e outras contribuições sobre o Aviso Prévio Trabalhado",{"$f":"'Encargos Sociais'!E40","v":4.4296296296296288E-3},17.5,null,"* Nota 4 - Os 95% restantes do cálculo, a um prazo médio de contrato de 4 anos. Assim, calcula-se 7 dias para o 1º ano de contrato e mais 3 dias para os 3 anos seguintes."]
[null,null,"F","Multa do FGTS e Contribuição Social sobre o Aviso Prévio Trabalhado",{"$f":"'Encargos Sociais'!E41","v":3.0505155555555549E-2},120.55]
[]
[null,null,null,"TOTAL DE PREVISÃO PARA RESCISÃO",null,{"$f":"SUM(F48:F53)","v":251.68}]
[]
[null,"MÓDULO 4 - CUSTO DO PROFISSIONAL AUSENTE",null,null,"Percentuais","Valor"]
[null,"Submódulo 4.1 - Ausências Legais"]
[null,null,"A","Férias (Arts. 129 e 130, inc. I, da CLT)",{"$f":"'Encargos Sociais'!E25","v":9.0909090909090912E-2},{"$f":"ROUND(E59*$F$16,2)","v":359.25},null,"* Nota 1 - As alíneas “A” a “F” referem-se somente ao custo que será pago ao repositor pelos dias \ntrabalhados quando da necessidade de substituir a mão de obra alocada na prestação do serviço."]
[null,null,"B","Ausências Legais (Arts. 131 e 473 da CLT)",{"$f":"'Encargos Sociais'!E26","v":7.9365079365079361E-3},31.36,null,"* Nota 2 - Adotou-se a estimativa do SINAPI de 2 dias por ano."]
[null,null,"C","Licença-Paternidade (Art. 7º, XIX, e art. 10, §1º, do ADCT, CF/1988 e Art. 1º, II, da Lei 11.770/2008)",{"$f":"'Encargos Sociais'!E27","v":8.2777777777777776E-4},3.27,null,"* Nota 3 - Utilizada a proporção de 50% para homens, 5 dias de afastamento, e a probabilidade de um trabalhador requerer a Licença Paternidade em 5,22%, conforme SINAPI (citando dados da PNAD 2015)"]
[null,null,"D","Ausência por Acidente de Trabalho (Art. 131, III, da CLT)",{"$f":"'Encargos Sociais'!E28","v":8.541666666666667E-4},3.38,null,"* Nota 4 - Utilzada a estatística de 1,96% dos contribuintes beneficiados com a emissão do auxílio, conforme Anuário Estatístico da Previdência Social. Afastamento de 15 dias a cargo da empresa."]
[null,null,"E","Afastamento Maternidade (Art. 71 da Lei nº 8.213/1991)",{"$f":"'Encargos Sociais'!E29","v":3.2925925925925922E-3},13.01,null,"* Nota 5 - Utilizada a proporção de 50% para mulheres, 180 dias de afastamento, e a probabilidade de uma trabalhadora requerer a Licença Maternidade em 4,91%, conforme SINAPI (citando dados do IBGE 2016)"]
[null,null,"F","Auxílio Enfermidade - Doença (Art. 59 da Lei nº 8.213/1991)",{"$f":"'Encargos Sociais'!E30","v":7.1222222222222225E-3},28.15,null,"* Nota 6 - Utilizada a estatística de 3,37% dos contribuintes beneficiados com o auxílio, conforme Anuário Estatístico da Previdência Social de 2015 (acrescidos de 2 dias ao ano, para os quais o trabalhador nem requer o benefício da Previdência - conforme SINAPI)"]
[]
[null,"Submódulo 4.2 - Intrajornada"]
[null,null,"A","Intervalo para repouso ou alimentação",{"$f":"'Encargos Sociais'!E33","v":0},{"$f":"ROUND(E67*$F$16,2)","v":0}]
[]
[null,null,null,"QUADRO-RESUMO DO MÓDULO 4",null,"Valor"]
[null,null,null,"4.1 - Ausências Legais",{"$f":"SUM(E59:E64)","v":0.11094235810485811},{"$f":"ROUND(E70*$F$16,2)","v":438.41}]
[null,null,null,"4.2 - Intrajornada",{"$f":"E67","v":0},{"$f":"ROUND(E71*$F$16,2)","v":0}]
[]
[null,null,null,"TOTAL DE PREVISÃO PARA RESCISÃO E INTERVALO INTRAJORNADA",null,{"$f":"SUM(F70:F71)","v":438.41}]
[]
[null,"MÓDULO 5 - INSUMOS DIVERSOS",null,null,null,"Valor"]
[null,null,"A","Uniformes - aquisição",null,{"$f":"ROUND(HLOOKUP($B$5,Uniformes!L4:EA95,3)/12,2)","v":185.08}]
[null,null,"B","Materiais de consumo relacionados ao posto - aquisição",null,{"$f":"ROUND(HLOOKUP(B5,'Mat Cons'!I11:DX13,3)/12,2)","v":0}]
[null,null,"C","Materiais permanentes relacionados ao posto - remuneração da sua depreciação / manutenção",null,{"$f":"HLOOKUP(B5,'Mat Perm'!Q11:EF13,3)","v":0}]
[null,null,"D","Equipamentos relacionados ao posto - remuneração da sua depreciação / manutenção",null,{"$f":"HLOOKUP(B5,'Equip Rel'!Q11:EF13,3)","v":0}]
[null,null,"E","Equipamentos de Proteção Individual - EPI - aquisição",null,{"$f":"ROUND(HLOOKUP(B5,EPI!J4:DY6,3)/12,2)","v":19.54}]
[]
[null,null,null,"TOTAL DE INSUMOS DIVERSOS",null,{"$f":"SUM(F76:F81)","v":204.62},null,"* Nota - Valores mensais por empregado"]
[]
[null,"MÓDULO 6 - CUSTOS INDIRETOS, TRIBUTOS E LUCRO - BDI",null,null,"Percentuais","Valor"]
[null,null,"A","Custos Indiretos",{"$f":"BDI!E6","v":2.7000000000000003E-2}]
[null,null,"A.1","Administração Central",{"$f":"BDI!E7","v":2.1600000000000001E-2}]
[null,null,"A.2","Seguros, Garantias e Riscos",{"$f":"BDI!E8","v":5.4000000000000003E-3}]
[null,null,"B","Lucro",{"$f":"BDI!E10","v":3.3399999999999999E-2}]
[null,null,"C","Tributos",{"$f":"SUM(E90:E91)","v":0.124}]
[null,null,"C.1","Tributos Federais (COFINS, PIS e CPRB)",{"$f":"BDI!E18","v":7.3999999999999996E-2}]
[null,null,"C.2","Tributos Distritais (ISS)",{"$f":"BDI!E23","v":0.05},null,null,"* Nota - Utilizou-se o indicado pelo Sindicato da Arquitetura e da Engenharia (Sinaenco, 2008, p. 22), que adota um percentual redutor de 20% no cálculo dos custos tributários relativos às contribuições PIS e COFINS"]
[null,null,"D","Despesas Financeiras",{"$f":"BDI!E13","v":5.6394995474364773E-3}]
[]
[null,null,null,"TOTAL DE BDI",{"$f":"BDI!E26","v":0.21840000000000001},{"$f":"E94*E102","v":1685.202792}]
[]
[null,null,null,"QUADRO-RESUMO DO CUSTO MENSAL POR EMPREGADO - SEM O 13º","Valor"]
[null,null,null,"Módulo 1 - Composição da Remuneração",{"$f":"F16","v":3951.73}]
[null,null,null,"Módulo 2 - Encargos e Benefícios Anuais, Mensais e Diários",{"$f":"F45","v":2869.6899999999996}]
[null,null,null,"Módulo 3 - Provisão para Rescisão",{"$f":"F55","v":251.68}]
[null,null,null,"Módulo 4 - Custo de Reposição do Profissional Ausente",{"$f":"F73","v":438.41}]
[null,null,null,"Módulo 5 - Insumos Diversos",{"$f":"F82","v":204.62}]
[null,null,null,"SUBTOTAL (A+B+C+D+E)",{"$f":"SUM(E97:E101)","v":7716.13}]
[null,null,null,"Módulo 6 - Custos Indiretos, Tributos e Lucro",{"$f":"F94","v":1685.202792}]
[]
[null,null,null,"TOTAL DO POSTO",{"$f":"SUM(E102:E103)","v":9401.3327920000011}]
[]
[null,"MÓDULO 7 - DESTAQUE DO MÓDULO 2 - 13º SALÁRIO",null,null,"Percentuais","Valor"]
[null,null,"A","13º Salário",{"$f":"'Encargos Sociais'!E32","v":8.3333333333333329E-2},{"$f":"ROUND(E108*F$16,2)","v":329.31}]
[null,null,"B","Encargos Sociais sobre o 13º Salário - Taxa calculada no SUBMÓDULO 2.2",{"$f":"SUM($E$24:$E$32)","v":0.36800000000000005},{"$f":"ROUND(E109*$F$108,2)","v":121.19},null,"* Nota 1 - Provisiona-se, mensalmente, o proporcional a 1/12 dos valores referentes a gratificação natalina e adicional de férias."]
[null,null,"C","Reincidência de férias sobre o 13º Salário",{"$f":"E59","v":9.0909090909090912E-2},{"$f":"ROUND(E110*$F$108,2)","v":29.94}]
[null,null,"D","BDI sobre o 13º Salário - Taxa calculada no MÓDULO 6",{"$f":"E94","v":0.21840000000000001},{"$f":"ROUND(E111*($F$108+$F$109),2)","v":98.39}]
[]
[null,null,null,"TOTAL DO DESTAQUE DO 13º SALÁRIO",null,{"$f":"SUM(F108:F111)","v":578.83000000000004}]
[]
[null,null,null,"QUADRO-RESUMO DO CUSTO MENSAL POR EMPREGADO","Valor"]
[null,null,null,"Custo total - sem o 13º Salário",{"$f":"E105","v":9401.3327920000011}]
[null,null,null,"Destaque do 13º Salário (valor mensal)",{"$f":"F113","v":578.83000000000004}]
[]
[null,null,null,"TOTAL DO POSTO",{"$f":"E116+E117","v":9980.162792000001}]

{"sheet":"3","index":6,"n_rows":118,"n_cols":8,"rows_kept":118,"cut":false,"hidden":false,"merged":[[17,1,17,3],[106,1,106,3],[39,3,39,5],[46,1,46,3],[56,1,56,3],[68,3,68,5],[74,1,74,3],[83,1,83,3],[1,1,1,5],[2,1,2,5],[4,1,4,2],[5,1,5,2],[7,1,7,3]]}
[]
[null,"PLANILHA DE ESTIMATIVA DE CUSTOS"]
[null,"Padrão IN 05/2017 e IN 07/2018 - MPDG"]
[]
[null,3,null,{"$f":"HLOOKUP($B$5,'Dados Gerais'!$D$5:$BK$20,6)","v":"ENCARREGADO DE SERVIÇO"},"QUANTIDADE",{"$f":"HLOOKUP($B$5,'Dados Gerais'!$D$5:$BK$20,10)","v":13}]
[null,"CCT",null,{"$f":"HLOOKUP($B$5,'Dados Gerais'!$D$5:$BK$20,15)","v":"SEAC/DF X SINDISERVIÇOS/DF 2023/2023 Nº DF000037/2023"},"DATA-BASE",{"$f":"HLOOKUP($B$5,'Dados Gerais'!$D$5:$BK$20,16)","v":"2023-01-01"}]
[]
[null,"MÓDULO 1 - COMPOSIÇÃO DA REMUNERAÇÃO",null,null,null,"Valor"]
[null,null,"A","Salário-Base",null,{"$f":"HLOOKUP($B$5,'Dados Gerais'!$D$5:$BK$20,8)","v":3317.57}]
[null,null,"B","Adicional de Periculosidade",null,{"$f":"HLOOKUP($B$5,'Dados Gerais'!$D$5:$BK$37,25)","v":0}]
[null,null,"C","Adicional de Insalubridade",null,{"$f":"HLOOKUP($B$5,'Dados Gerais'!$D$5:$BK$37,31)","v":0}]
[null,null,"D","Adicional Noturno",null,{"$f":"HLOOKUP($B$5,'Dados Gerais'!$D$5:$BK$50,46)","v":0},null,"* Nota 1 - O Módulo 1 refere-se ao valor mensal devido ao empregado pela prestação do serviço no período de 12 meses."]
[null,null,"E","Adicional de Hora Extra",null,{"$f":"HLOOKUP($B$5,'Dados Gerais'!$D$5:$BK$67,63)","v":0},null,"* Nota 2 - O adicional de hora extra no feriado trabalhado foi suprimido pela Lei 13.467/17"]
[null,null,"F","Outros (especificar)",null,{"$f":"HLOOKUP($B$5,'Dados Gerais'!$D$5:$BK$59,33)","v":0},null,"* Nota 3 - ART. 7º, § 2º, DA LEI Nº 605/49.Sendo mensalista o obreiro, o adicional noturno pago de forma fixa já é considerado integrado para os efeitos do pagamento do repouso semanal remunerado, nos termos do art. 7º, § 2º, da Lei nº 605/49."]
[]
[null,null,null,"TOTAL DA REMUNERAÇÃO",null,{"$f":"SUM(F9:F14)","v":3317.57}]
[]
[null,"MÓDULO 2 - ENCARGOS E BENEFÍCIOS ANUAIS, MENSAIS E DIÁRIOS",null,null,"Percentuais","Valor"]
[null,"Submódulo 2.1 - 13º Salário, Férias e Adicional de Férias"]
[null,null,"A","13º Salário - Calculado no Módulo 7 - Destacado",0,{"$f":"ROUND(E20*F$16,2)","v":0}]
[null,null,"B","Férias e Adicional de Férias",{"$f":"'Encargos Sociais'!E31","v":3.03030303030303E-2},{"$f":"ROUND(E21*F$16,2)","v":100.53},null,"* Nota 1 - Provisiona-se, mensalmente, o proporcional a 1/12 dos valores referentes a gratificação natalina, férias e adicional de férias."]
[null,null,null,null,null,null,null,"* Nota 2 - O adicional de férias contido no Submódulo 2.1 corresponde a 1/3 da remuneração que, por sua vez, é dividida por 12 contome Nota 1."]
[null,"Submódulo 2.2 - Encargos Previdenciários (GPS), Fundo de Garantia por Tempo de Serviço (FGTS) e Outras Contribuições"]
[null,null,"A","INSS (art. 22, inciso I, Lei nº 8.212/91)",{"$f":"'Encargos Sociais'!E14","v":0.2},{"$f":"ROUND(E24*($F$16+$F$41+$F$73),2)","v":757.23}]
[null,null,"B","Salário Educação (art. 3º, inciso I, Decreto nº 87.043/82)",{"$f":"'Encargos Sociais'!E15","v":2.5000000000000001E-2},{"$f":"ROUND(E25*($F$16+$F$41+$F$73),2)","v":94.65}]
[null,null,"C","SAT/RAT (art. 22, II, Lei 8.212/91 e Anexo V, Decreto 6.042/07) - Enquadramento 8211-3/00",{"$f":"'Encargos Sociais'!E16","v":0.03},113.58]
[null,null,"D","SESC ou SESI (art. 30, Lei nº 8.036/90 e art. 1º, Lei 8.154/90)",{"$f":"'Encargos Sociais'!E17","v":1.4999999999999999E-2},56.79]
[null,null,"E","SENAI ou SENAC (Decreto nº 2.318/86)",{"$f":"'Encargos Sociais'!E18","v":0.01},37.86]
[null,null,"F","SEBRAE (§ 3º, art. 8º, Lei 8.029/90, alterada pela Lei nº 8.154/90)",{"$f":"'Encargos Sociais'!E19","v":6.0000000000000001E-3},22.72]
[null,null,"G","INCRA (art. 1º, I, Decreto Lei 1.146/70 e Lei 7.787, de 30/06/89)",{"$f":"'Encargos Sociais'!E20","v":2E-3},7.57,null,"* Nota 1 - Os percentuais dos encargos previdenciários, do FGTS e demais contribuições são estabelecidos por legislação vigente."]
[null,null,"H","FGTS (Lei Complementar nº 110/01 e art. 30, Lei nº 8.036/90)",{"$f":"'Encargos Sociais'!E21","v":0.08},302.89,null,"* Nota 2 - O SAT, a depender do grau de risco do serviço, irá variar entre 1%, para risco leve, de 2%, para risco médio, e de 3% para risco grave."]
[null,null,"I","SECONCI (Convenções Coletivas de Trabalho da construção)",{"$f":"'Encargos Sociais'!E22","v":0},0,null,"* Nota 3 - Os percentuais do Submódulo 2.2 incidem sobre o Módulo 1 e o Submódulo 2.1."]
[]
[null,"Submódulo 2.3 - Benefícios Mensais e Diários"]
[null,null,"A","Auxílio Transporte",null,{"$f":"HLOOKUP($B$5,'Dados Gerais'!$D$5:$BK$93,82)","v":156.33999999999997}]
[null,null,"B","Auxílio Alimentação",null,{"$f":"HLOOKUP($B$5,'Dados Gerais'!$D$5:$BK$93,89)","v":972}]
[null,null,"C","Assistência Médica e Familiar",null,{"$f":"HLOOKUP($B$5,'Dados Gerais'!$D$5:$BK$101,97)","v":0}]
[null,null,"D","Outros (Seguro de vida e auxílio funeral e auxílio odontológico)",null,{"$f":"HLOOKUP($B$5,'Dados Gerais'!$D$5:$BK$118,114)","v":0},null,"* Nota 1 - O valor informado deverá ser o custo real do benefício (descontado o valor eventualmente pago pelo empregado)."]
[null,null,null,null,null,null,null,"* Nota 2 - Observar a previsão dos benefícios contidos em Acordos, Convenções e Dissídios Coletivos de Trabalho e o disposto no art. 6º da IN 5/2017"]
[null,null,null,"QUADRO-RESUMO DO MÓDULO 2"]
[null,null,null,"2.1 - 13º Salário, Férias e Adicional de Férias - 13º Destacado - Calculado no Módulo 7 ",{"$f":"SUM(E20:E21)","v":3.03030303030303E-2},{"$f":"F20+F21","v":100.53}]
[null,null,null,"2.2 - Encargos Previdenciários (GPS), Fundo de Garantia por Tempo de Serviço (FGTS) e Contribuições",{"$f":"SUM(E24:E32)","v":0.36800000000000005},{"$f":"SUM(F24:F32)","v":1393.29}]
[null,null,null,"2.3 - Benefícios Mensais e Diários",null,{"$f":"SUM(F35:F38)","v":1128.3399999999999}]
[]
[null,null,null,"TOTAL DOS ENCARGOS E BENEFÍCIOS",null,{"$f":"SUM(F41:F43)","v":2622.16}]
[]
[null,"MÓDULO 3 - PREVISÃO PARA RESCISÃO",null,null,"Percentuais","Valor"]
[null,null,"A","Aviso Prévio Indenizado (Art. 7º, inciso XXI, da CF/1988 e arts. 477, 487, §1º, e 491 da CLT)",{"$f":"'Encargos Sociais'!E36","v":8.3333333333333332E-3},{"$f":"ROUND(E48*$F$16,2)","v":27.65}]
[null,null,"B","Incidência do FGTS sobre o Aviso Prévio Indenizado (Súmula 305 TST)",{"$f":"'Encargos Sociais'!E37","v":6.6666666666666664E-4},2.21,null,"* Nota 1 - Adotou-se os parâmetros do estudo do STF (http://www.stf.jus.br/arquivo/cms/sobrestfestudosci/anexo/encargos_sociais_03102007.pdf), onde 5% do pessoal é demitido pelo empregador no decurso do contrato (para estes, considerou-se o aviso prévio indenizado). Desprezou-se as demissões por justa causa e os pedidos de demissão."]
[null,null,"C","Multa do FGTS e Contribuição Social sobre o Aviso Prévio Indenizado (Art. 18, §1º, da Lei 8.036/1990 e art. 1º da LC nº 110/2001)",{"$f":"'Encargos Sociais'!E38","v":7.7170666666666644E-3},25.6,null,"* Nota 2 - No cálculo do percentual, considerou-se 36 dias, correspondendo à metade da duração média dos contratos (2 anos)"]
[null,null,"D","Aviso Prévio Trabalhado (Art. 488, parágrafo único, CLT)",{"$f":"'Encargos Sociais'!E39","v":1.2037037037037035E-2},39.93,null,"* Nota 3 - Incide sobre a Remuneração + 13º salário (1/12) + Férias (1/12) + Adicional de Férias (1/36) x 50% multa (40% para o empregado e 10% de contribuição social) x 8% FGTS"]
[null,null,"E","Incidência de GPS, FGTS e outras contribuições sobre o Aviso Prévio Trabalhado",{"$f":"'Encargos Sociais'!E40","v":4.4296296296296288E-3},14.7,null,"* Nota 4 - Os 95% restantes do cálculo, a um prazo médio de contrato de 4 anos. Assim, calcula-se 7 dias para o 1º ano de contrato e mais 3 dias para os 3 anos seguintes."]
[null,null,"F","Multa do FGTS e Contribuição Social sobre o Aviso Prévio Trabalhado",{"$f":"'Encargos Sociais'!E41","v":3.0505155555555549E-2},101.2]
[]
[null,null,null,"TOTAL DE PREVISÃO PARA RESCISÃO",null,{"$f":"SUM(F48:F53)","v":211.29000000000002}]
[]
[null,"MÓDULO 4 - CUSTO DO PROFISSIONAL AUSENTE",null,null,"Percentuais","Valor"]
[null,"Submódulo 4.1 - Ausências Legais"]
[null,null,"A","Férias (Arts. 129 e 130, inc. I, da CLT)",{"$f":"'Encargos Sociais'!E25","v":9.0909090909090912E-2},{"$f":"ROUND(E59*$F$16,2)","v":301.60000000000002},null,"* Nota 1 - As alíneas “A” a “F” referem-se somente ao custo que será pago ao repositor pelos dias \ntrabalhados quando da necessidade de substituir a mão de obra alocada na prestação do serviço."]
[null,null,"B","Ausências Legais (Arts. 131 e 473 da CLT)",{"$f":"'Encargos Sociais'!E26","v":7.9365079365079361E-3},26.33,null,"* Nota 2 - Adotou-se a estimativa do SINAPI de 2 dias por ano."]
[null,null,"C","Licença-Paternidade (Art. 7º, XIX, e art. 10, §1º, do ADCT, CF/1988 e Art. 1º, II, da Lei 11.770/2008)",{"$f":"'Encargos Sociais'!E27","v":8.2777777777777776E-4},2.75,null,"* Nota 3 - Utilizada a proporção de 50% para homens, 5 dias de afastamento, e a probabilidade de um trabalhador requerer a Licença Paternidade em 5,22%, conforme SINAPI (citando dados da PNAD 2015)"]
[null,null,"D","Ausência por Acidente de Trabalho (Art. 131, III, da CLT)",{"$f":"'Encargos Sociais'!E28","v":8.541666666666667E-4},2.83,null,"* Nota 4 - Utilzada a estatística de 1,96% dos contribuintes beneficiados com a emissão do auxílio, conforme Anuário Estatístico da Previdência Social. Afastamento de 15 dias a cargo da empresa."]
[null,null,"E","Afastamento Maternidade (Art. 71 da Lei nº 8.213/1991)",{"$f":"'Encargos Sociais'!E29","v":3.2925925925925922E-3},10.92,null,"* Nota 5 - Utilizada a proporção de 50% para mulheres, 180 dias de afastamento, e a probabilidade de uma trabalhadora requerer a Licença Maternidade em 4,91%, conforme SINAPI (citando dados do IBGE 2016)"]
[null,null,"F","Auxílio Enfermidade - Doença (Art. 59 da Lei nº 8.213/1991)",{"$f":"'Encargos Sociais'!E30","v":7.1222222222222225E-3},23.63,null,"* Nota 6 - Utilizada a estatística de 3,37% dos contribuintes beneficiados com o auxílio, conforme Anuário Estatístico da Previdência Social de 2015 (acrescidos de 2 dias ao ano, para os quais o trabalhador nem requer o benefício da Previdência - conforme SINAPI)"]
[]
[null,"Submódulo 4.2 - Intrajornada"]
[null,null,"A","Intervalo para repouso ou alimentação",{"$f":"'Encargos Sociais'!E33","v":0},{"$f":"ROUND(E67*$F$16,2)","v":0}]
[]
[null,null,null,"QUADRO-RESUMO DO MÓDULO 4",null,"Valor"]
[null,null,null,"4.1 - Ausências Legais",{"$f":"SUM(E59:E64)","v":0.11094235810485811},{"$f":"ROUND(E70*$F$16,2)","v":368.06}]
[null,null,null,"4.2 - Intrajornada",{"$f":"E67","v":0},{"$f":"ROUND(E71*$F$16,2)","v":0}]
[]
[null,null,null,"TOTAL DE PREVISÃO PARA RESCISÃO E INTERVALO INTRAJORNADA",null,{"$f":"SUM(F70:F71)","v":368.06}]
[]
[null,"MÓDULO 5 - INSUMOS DIVERSOS",null,null,null,"Valor"]
[null,null,"A","Uniformes - aquisição",null,{"$f":"ROUND(HLOOKUP($B$5,Uniformes!L4:EA6,3)/12,2)","v":116.82}]
[null,null,"B","Materiais de consumo relacionados ao posto - aquisição",null,{"$f":"ROUND(HLOOKUP(B5,'Mat Cons'!I11:DX13,3)/12,2)","v":0}]
[null,null,"C","Materiais permanentes relacionados ao posto - remuneração da sua depreciação / manutenção",null,{"$f":"HLOOKUP(B5,'Mat Perm'!Q11:EF13,3)","v":0}]
[null,null,"D","Equipamentos relacionados ao posto - remuneração da sua depreciação / manutenção",null,{"$f":"HLOOKUP(B5,'Equip Rel'!Q11:EF13,3)","v":0}]
[null,null,"E","Equipamentos de Proteção Individual - EPI - aquisição",null,{"$f":"ROUND(HLOOKUP(B5,EPI!J4:DY6,3)/12,2)","v":20}]
[]
[null,null,null,"TOTAL DE INSUMOS DIVERSOS",null,{"$f":"SUM(F76:F81)","v":136.82},null,"* Nota - Valores mensais por empregado"]
[]
[null,"MÓDULO 6 - CUSTOS INDIRETOS, TRIBUTOS E LUCRO - BDI",null,null,"Percentuais","Valor"]
[null,null,"A","Custos Indiretos",{"$f":"BDI!E6","v":2.7000000000000003E-2}]
[null,null,"A.1","Administração Central",{"$f":"BDI!E7","v":2.1600000000000001E-2}]
[null,null,"A.2","Seguros, Garantias e Riscos",{"$f":"BDI!E8","v":5.4000000000000003E-3}]
[null,null,"B","Lucro",{"$f":"BDI!E10","v":3.3399999999999999E-2}]
[null,null,"C","Tributos",{"$f":"SUM(E90:E91)","v":0.124}]
[null,null,"C.1","Tributos Federais (COFINS, PIS e CPRB)",{"$f":"BDI!E18","v":7.3999999999999996E-2}]
[null,null,"C.2","Tributos Distritais (ISS)",{"$f":"BDI!E23","v":0.05},null,null,"* Nota - Utilizou-se o indicado pelo Sindicato da Arquitetura e da Engenharia (Sinaenco, 2008, p. 22), que adota um percentual redutor de 20% no cálculo dos custos tributários relativos às contribuições PIS e COFINS"]
[null,null,"D","Despesas Financeiras",{"$f":"BDI!E13","v":5.6394995474364773E-3}]
[]
[null,null,null,"TOTAL DE BDI",{"$f":"BDI!E26","v":0.21840000000000001},{"$f":"E94*E102","v":1453.6485600000001}]
[]
[null,null,null,"QUADRO-RESUMO DO CUSTO MENSAL POR EMPREGADO - SEM O 13º","Valor"]
[null,null,null,"Módulo 1 - Composição da Remuneração",{"$f":"F16","v":3317.57}]
[null,null,null,"Módulo 2 - Encargos e Benefícios Anuais, Mensais e Diários",{"$f":"F45","v":2622.16}]
[null,null,null,"Módulo 3 - Provisão para Rescisão",{"$f":"F55","v":211.29000000000002}]
[null,null,null,"Módulo 4 - Custo de Reposição do Profissional Ausente",{"$f":"F73","v":368.06}]
[null,null,null,"Módulo 5 - Insumos Diversos",{"$f":"F82","v":136.82}]
[null,null,null,"SUBTOTAL (A+B+C+D+E)",{"$f":"SUM(E97:E101)","v":6655.9}]
[null,null,null,"Módulo 6 - Custos Indiretos, Tributos e Lucro",{"$f":"F94","v":1453.6485600000001}]
[]
[null,null,null,"TOTAL DO POSTO",{"$f":"SUM(E102:E103)","v":8109.5485599999993}]
[]
[null,"MÓDULO 7 - DESTAQUE DO MÓDULO 2 - 13º SALÁRIO",null,null,"Percentuais","Valor"]
[null,null,"A","13º Salário",{"$f":"'Encargos Sociais'!E32","v":8.3333333333333329E-2},{"$f":"ROUND(E108*F$16,2)","v":276.45999999999998}]
[null,null,"B","Encargos Sociais sobre o 13º Salário - Taxa calculada no SUBMÓDULO 2.2",{"$f":"SUM($E$24:$E$32)","v":0.36800000000000005},{"$f":"ROUND(E109*$F$108,2)","v":101.74},null,"* Nota 1 - Provisiona-se, mensalmente, o proporcional a 1/12 dos valores referentes a gratificação natalina e adicional de férias."]
[null,null,"C","BDI sobre o 13º Salário - Taxa calculada no MÓDULO 6",{"$f":"E94","v":0.21840000000000001},{"$f":"ROUND(E110*($F$108+$F$109),2)","v":82.6}]
[]
[null,null,null,"TOTAL DO DESTAQUE DO 13º SALÁRIO",null,{"$f":"SUM(F108:F110)","v":460.79999999999995}]
[]
[null,null,null,"QUADRO-RESUMO DO CUSTO MENSAL POR EMPREGADO","Valor"]
[null,null,null,"Custo total - sem o 13º Salário",{"$f":"E105","v":8109.5485599999993}]
[null,null,null,"Destaque do 13º Salário (valor mensal)",{"$f":"F112","v":460.79999999999995}]
[]
[null,null,null,"TOTAL DO POSTO",{"$f":"E115+E116","v":8570.3485599999985}]

{"sheet":"4","index":7,"n_rows":118,"n_cols":8,"rows_kept":118,"cut":false,"hidden":false,"merged":[[17,1,17,3],[106,1,106,3],[39,3,39,5],[46,1,46,3],[56,1,56,3],[68,3,68,5],[74,1,74,3],[83,1,83,3],[1,1,1,5],[2,1,2,5],[4,1,4,2],[5,1,5,2],[7,1,7,3]]}
[]
[null,"PLANILHA DE ESTIMATIVA DE CUSTOS"]
[null,"Padrão IN 05/2017 e IN 07/2018 - MPDG"]
[]
[null,4,null,{"$f":"HLOOKUP($B$5,'Dados Gerais'!$D$5:$BK$20,6)","v":"ENCARREGADO DE SERVIÇO COM ADICIONAL DE INSALUBRIDADE"},"QUANTIDADE",{"$f":"HLOOKUP($B$5,'Dados Gerais'!$D$5:$BK$20,10)","v":2}]
[null,"CCT",null,{"$f":"HLOOKUP($B$5,'Dados Gerais'!$D$5:$BK$20,15)","v":"SEAC/DF X SINDISERVIÇOS/DF 2023/2023 Nº DF000037/2023"},"DATA-BASE",{"$f":"HLOOKUP($B$5,'Dados Gerais'!$D$5:$BK$20,16)","v":"2023-01-01"}]
[]
[null,"MÓDULO 1 - COMPOSIÇÃO DA REMUNERAÇÃO",null,null,null,"Valor"]
[null,null,"A","Salário-Base",null,{"$f":"HLOOKUP($B$5,'Dados Gerais'!$D$5:$BK$20,8)","v":3317.57}]
[null,null,"B","Adicional de Periculosidade",null,{"$f":"HLOOKUP($B$5,'Dados Gerais'!$D$5:$BK$37,25)","v":0}]
[null,null,"C","Adicional de Insalubridade",null,{"$f":"HLOOKUP($B$5,'Dados Gerais'!$D$5:$BK$37,31)","v":260.40000000000003}]
[null,null,"D","Adicional Noturno",null,{"$f":"HLOOKUP($B$5,'Dados Gerais'!$D$5:$BK$50,46)","v":0},null,"* Nota 1 - O Módulo 1 refere-se ao valor mensal devido ao empregado pela prestação do serviço no período de 12 meses."]
[null,null,"E","Adicional de Hora Extra",null,{"$f":"HLOOKUP($B$5,'Dados Gerais'!$D$5:$BK$67,63)","v":0},null,"* Nota 2 - O adicional de hora extra no feriado trabalhado foi suprimido pela Lei 13.467/17"]
[null,null,"F","Outros (especificar)",null,{"$f":"HLOOKUP($B$5,'Dados Gerais'!$D$5:$BK$59,33)","v":0},null,"* Nota 3 - ART. 7º, § 2º, DA LEI Nº 605/49.Sendo mensalista o obreiro, o adicional noturno pago de forma fixa já é considerado integrado para os efeitos do pagamento do repouso semanal remunerado, nos termos do art. 7º, § 2º, da Lei nº 605/49."]
[]
[null,null,null,"TOTAL DA REMUNERAÇÃO",null,{"$f":"SUM(F9:F14)","v":3577.9700000000003}]
[]
[null,"MÓDULO 2 - ENCARGOS E BENEFÍCIOS ANUAIS, MENSAIS E DIÁRIOS",null,null,"Percentuais","Valor"]
[null,"Submódulo 2.1 - 13º Salário, Férias e Adicional de Férias"]
[null,null,"A","13º Salário - Calculado no Módulo 7 - Destacado",0,{"$f":"ROUND(E20*F$16,2)","v":0}]
[null,null,"B","Férias e Adicional de Férias",{"$f":"'Encargos Sociais'!E31","v":3.03030303030303E-2},{"$f":"ROUND(E21*F$16,2)","v":108.42},null,"* Nota 1 - Provisiona-se, mensalmente, o proporcional a 1/12 dos valores referentes a gratificação natalina, férias e adicional de férias."]
[null,null,null,null,null,null,null,"* Nota 2 - O adicional de férias contido no Submódulo 2.1 corresponde a 1/3 da remuneração que, por sua vez, é dividida por 12 contome Nota 1."]
[null,"Submódulo 2.2 - Encargos Previdenciários (GPS), Fundo de Garantia por Tempo de Serviço (FGTS) e Outras Contribuições"]
[null,null,"A","INSS (art. 22, inciso I, Lei nº 8.212/91)",{"$f":"'Encargos Sociais'!E14","v":0.2},{"$f":"ROUND(E24*($F$16+$F$41+$F$73),2)","v":816.67}]
[null,null,"B","Salário Educação (art. 3º, inciso I, Decreto nº 87.043/82)",{"$f":"'Encargos Sociais'!E15","v":2.5000000000000001E-2},{"$f":"ROUND(E25*($F$16+$F$41+$F$73),2)","v":102.08}]
[null,null,"C","SAT/RAT (art. 22, II, Lei 8.212/91 e Anexo V, Decreto 6.042/07) - Enquadramento 8211-3/00",{"$f":"'Encargos Sociais'!E16","v":0.03},122.5]
[null,null,"D","SESC ou SESI (art. 30, Lei nº 8.036/90 e art. 1º, Lei 8.154/90)",{"$f":"'Encargos Sociais'!E17","v":1.4999999999999999E-2},61.25]
[null,null,"E","SENAI ou SENAC (Decreto nº 2.318/86)",{"$f":"'Encargos Sociais'!E18","v":0.01},40.83]
[null,null,"F","SEBRAE (§ 3º, art. 8º, Lei 8.029/90, alterada pela Lei nº 8.154/90)",{"$f":"'Encargos Sociais'!E19","v":6.0000000000000001E-3},24.5]
[null,null,"G","INCRA (art. 1º, I, Decreto Lei 1.146/70 e Lei 7.787, de 30/06/89)",{"$f":"'Encargos Sociais'!E20","v":2E-3},8.17,null,"* Nota 1 - Os percentuais dos encargos previdenciários, do FGTS e demais contribuições são estabelecidos por legislação vigente."]
[null,null,"H","FGTS (Lei Complementar nº 110/01 e art. 30, Lei nº 8.036/90)",{"$f":"'Encargos Sociais'!E21","v":0.08},326.67,null,"* Nota 2 - O SAT, a depender do grau de risco do serviço, irá variar entre 1%, para risco leve, de 2%, para risco médio, e de 3% para risco grave."]
[null,null,"I","SECONCI (Convenções Coletivas de Trabalho da construção)",{"$f":"'Encargos Sociais'!E22","v":0},0,null,"* Nota 3 - Os percentuais do Submódulo 2.2 incidem sobre o Módulo 1 e o Submódulo 2.1."]
[]
[null,"Submódulo 2.3 - Benefícios Mensais e Diários"]
[null,null,"A","Auxílio Transporte",null,{"$f":"HLOOKUP($B$5,'Dados Gerais'!$D$5:$BK$93,82)","v":156.33999999999997}]
[null,null,"B","Auxílio Alimentação",null,{"$f":"HLOOKUP($B$5,'Dados Gerais'!$D$5:$BK$93,89)","v":972}]
[null,null,"C","Assistência Médica e Familiar",null,{"$f":"HLOOKUP($B$5,'Dados Gerais'!$D$5:$BK$101,97)","v":0}]
[null,null,"D","Outros (Seguro de vida e auxílio funeral e auxílio odontológico)",null,{"$f":"HLOOKUP($B$5,'Dados Gerais'!$D$5:$BK$118,114)","v":0},null,"* Nota 1 - O valor informado deverá ser o custo real do benefício (descontado o valor eventualmente pago pelo empregado)."]
[null,null,null,null,null,null,null,"* Nota 2 - Observar a previsão dos benefícios contidos em Acordos, Convenções e Dissídios Coletivos de Trabalho e o disposto no art. 6º da IN 5/2017"]
[null,null,null,"QUADRO-RESUMO DO MÓDULO 2"]
[null,null,null,"2.1 - 13º Salário, Férias e Adicional de Férias - 13º Destacado - Calculado no Módulo 7 ",{"$f":"SUM(E20:E21)","v":3.03030303030303E-2},{"$f":"F20+F21","v":108.42}]
[null,null,null,"2.2 - Encargos Previdenciários (GPS), Fundo de Garantia por Tempo de Serviço (FGTS) e Contribuições",{"$f":"SUM(E24:E32)","v":0.36800000000000005},{"$f":"SUM(F24:F32)","v":1502.67}]
[null,null,null,"2.3 - Benefícios Mensais e Diários",null,{"$f":"SUM(F35:F38)","v":1128.3399999999999}]
[]
[null,null,null,"TOTAL DOS ENCARGOS E BENEFÍCIOS",null,{"$f":"SUM(F41:F43)","v":2739.4300000000003}]
[]
[null,"MÓDULO 3 - PREVISÃO PARA RESCISÃO",null,null,"Percentuais","Valor"]
[null,null,"A","Aviso Prévio Indenizado (Art. 7º, inciso XXI, da CF/1988 e arts. 477, 487, §1º, e 491 da CLT)",{"$f":"'Encargos Sociais'!E36","v":8.3333333333333332E-3},{"$f":"ROUND(E48*$F$16,2)","v":29.82}]
[null,null,"B","Incidência do FGTS sobre o Aviso Prévio Indenizado (Súmula 305 TST)",{"$f":"'Encargos Sociais'!E37","v":6.6666666666666664E-4},2.39,null,"* Nota 1 - Adotou-se os parâmetros do estudo do STF (http://www.stf.jus.br/arquivo/cms/sobrestfestudosci/anexo/encargos_sociais_03102007.pdf), onde 5% do pessoal é demitido pelo empregador no decurso do contrato (para estes, considerou-se o aviso prévio indenizado). Desprezou-se as demissões por justa causa e os pedidos de demissão."]
[null,null,"C","Multa do FGTS e Contribuição Social sobre o Aviso Prévio Indenizado (Art. 18, §1º, da Lei 8.036/1990 e art. 1º da LC nº 110/2001)",{"$f":"'Encargos Sociais'!E38","v":7.7170666666666644E-3},27.61,null,"* Nota 2 - No cálculo do percentual, considerou-se 36 dias, correspondendo à metade da duração média dos contratos (2 anos)"]
[null,null,"D","Aviso Prévio Trabalhado (Art. 488, parágrafo único, CLT)",{"$f":"'Encargos Sociais'!E39","v":1.2037037037037035E-2},43.07,null,"* Nota 3 - Incide sobre a Remuneração + 13º salário (1/12) + Férias (1/12) + Adicional de Férias (1/36) x 50% multa (40% para o empregado e 10% de contribuição social) x 8% FGTS"]
[null,null,"E","Incidência de GPS, FGTS e outras contribuições sobre o Aviso Prévio Trabalhado",{"$f":"'Encargos Sociais'!E40","v":4.4296296296296288E-3},15.85,null,"* Nota 4 - Os 95% restantes do cálculo, a um prazo médio de contrato de 4 anos. Assim, calcula-se 7 dias para o 1º ano de contrato e mais 3 dias para os 3 anos seguintes."]
[null,null,"F","Multa do FGTS e Contribuição Social sobre o Aviso Prévio Trabalhado",{"$f":"'Encargos Sociais'!E41","v":3.0505155555555549E-2},109.15]
[]
[null,null,null,"TOTAL DE PREVISÃO PARA RESCISÃO",null,{"$f":"SUM(F48:F53)","v":227.89}]
[]
[null,"MÓDULO 4 - CUSTO DO PROFISSIONAL AUSENTE",null,null,"Percentuais","Valor"]
[null,"Submódulo 4.1 - Ausências Legais"]
[null,null,"A","Férias (Arts. 129 e 130, inc. I, da CLT)",{"$f":"'Encargos Sociais'!E25","v":9.0909090909090912E-2},{"$f":"ROUND(E59*$F$16,2)","v":325.27},null,"* Nota 1 - As alíneas “A” a “F” referem-se somente ao custo que será pago ao repositor pelos dias \ntrabalhados quando da necessidade de substituir a mão de obra alocada na prestação do serviço."]
[null,null,"B","Ausências Legais (Arts. 131 e 473 da CLT)",{"$f":"'Encargos Sociais'!E26","v":7.9365079365079361E-3},28.4,null,"* Nota 2 - Adotou-se a estimativa do SINAPI de 2 dias por ano."]
[null,null,"C","Licença-Paternidade (Art. 7º, XIX, e art. 10, §1º, do ADCT, CF/1988 e Art. 1º, II, da Lei 11.770/2008)",{"$f":"'Encargos Sociais'!E27","v":8.2777777777777776E-4},2.96,null,"* Nota 3 - Utilizada a proporção de 50% para homens, 5 dias de afastamento, e a probabilidade de um trabalhador requerer a Licença Paternidade em 5,22%, conforme SINAPI (citando dados da PNAD 2015)"]
[null,null,"D","Ausência por Acidente de Trabalho (Art. 131, III, da CLT)",{"$f":"'Encargos Sociais'!E28","v":8.541666666666667E-4},3.06,null,"* Nota 4 - Utilzada a estatística de 1,96% dos contribuintes beneficiados com a emissão do auxílio, conforme Anuário Estatístico da Previdência Social. Afastamento de 15 dias a cargo da empresa."]
[null,null,"E","Afastamento Maternidade (Art. 71 da Lei nº 8.213/1991)",{"$f":"'Encargos Sociais'!E29","v":3.2925925925925922E-3},11.78,null,"* Nota 5 - Utilizada a proporção de 50% para mulheres, 180 dias de afastamento, e a probabilidade de uma trabalhadora requerer a Licença Maternidade em 4,91%, conforme SINAPI (citando dados do IBGE 2016)"]
[null,null,"F","Auxílio Enfermidade - Doença (Art. 59 da Lei nº 8.213/1991)",{"$f":"'Encargos Sociais'!E30","v":7.1222222222222225E-3},25.48,null,"* Nota 6 - Utilizada a estatística de 3,37% dos contribuintes beneficiados com o auxílio, conforme Anuário Estatístico da Previdência Social de 2015 (acrescidos de 2 dias ao ano, para os quais o trabalhador nem requer o benefício da Previdência - conforme SINAPI)"]
[]
[null,"Submódulo 4.2 - Intrajornada"]
[null,null,"A","Intervalo para repouso ou alimentação",{"$f":"'Encargos Sociais'!E33","v":0},{"$f":"ROUND(E67*$F$16,2)","v":0}]
[]
[null,null,null,"QUADRO-RESUMO DO MÓDULO 4",null,"Valor"]
[null,null,null,"4.1 - Ausências Legais",{"$f":"SUM(E59:E64)","v":0.11094235810485811},{"$f":"ROUND(E70*$F$16,2)","v":396.95}]
[null,null,null,"4.2 - Intrajornada",{"$f":"E67","v":0},{"$f":"ROUND(E71*$F$16,2)","v":0}]
[]
[null,null,null,"TOTAL DE PREVISÃO PARA RESCISÃO E INTERVALO INTRAJORNADA",null,{"$f":"SUM(F70:F71)","v":396.95}]
[]
[null,"MÓDULO 5 - INSUMOS DIVERSOS",null,null,null,"Valor"]
[null,null,"A","Uniformes - aquisição",null,{"$f":"ROUND(HLOOKUP($B$5,Uniformes!L4:EA6,3)/12,2)","v":116.82}]
[null,null,"B","Materiais de consumo relacionados ao posto - aquisição",null,{"$f":"ROUND(HLOOKUP(B5,'Mat Cons'!I11:DX13,3)/12,2)","v":0}]
[null,null,"C","Materiais permanentes relacionados ao posto - remuneração da sua depreciação / manutenção",null,{"$f":"HLOOKUP(B5,'Mat Perm'!Q11:EF13,3)","v":0}]
[null,null,"D","Equipamentos relacionados ao posto - remuneração da sua depreciação / manutenção",null,{"$f":"HLOOKUP(B5,'Equip Rel'!Q11:EF13,3)","v":0}]
[null,null,"E","Equipamentos de Proteção Individual - EPI - aquisição",null,{"$f":"ROUND(HLOOKUP(B5,EPI!J4:DY6,3)/12,2)","v":20}]
[]
[null,null,null,"TOTAL DE INSUMOS DIVERSOS",null,{"$f":"SUM(F76:F81)","v":136.82},null,"* Nota - Valores mensais por empregado"]
[]
[null,"MÓDULO 6 - CUSTOS INDIRETOS, TRIBUTOS E LUCRO - BDI",null,null,"Percentuais","Valor"]
[null,null,"A","Custos Indiretos",{"$f":"BDI!E6","v":2.7000000000000003E-2}]
[null,null,"A.1","Administração Central",{"$f":"BDI!E7","v":2.1600000000000001E-2}]
[null,null,"A.2","Seguros, Garantias e Riscos",{"$f":"BDI!E8","v":5.4000000000000003E-3}]
[null,null,"B","Lucro",{"$f":"BDI!E10","v":3.3399999999999999E-2}]
[null,null,"C","Tributos",{"$f":"SUM(E90:E91)","v":0.124}]
[null,null,"C.1","Tributos Federais (COFINS, PIS e CPRB)",{"$f":"BDI!E18","v":7.3999999999999996E-2}]
[null,null,"C.2","Tributos Distritais (ISS)",{"$f":"BDI!E23","v":0.05},null,null,"* Nota - Utilizou-se o indicado pelo Sindicato da Arquitetura e da Engenharia (Sinaenco, 2008, p. 22), que adota um percentual redutor de 20% no cálculo dos custos tributários relativos às contribuições PIS e COFINS"]
[null,null,"D","Despesas Financeiras",{"$f":"BDI!E13","v":5.6394995474364773E-3}]
[]
[null,null,null,"TOTAL DE BDI",{"$f":"BDI!E26","v":0.21840000000000001},{"$f":"E94*E102","v":1546.0667040000001}]
[]
[null,null,null,"QUADRO-RESUMO DO CUSTO MENSAL POR EMPREGADO - SEM O 13º","Valor"]
[null,null,null,"Módulo 1 - Composição da Remuneração",{"$f":"F16","v":3577.9700000000003}]
[null,null,null,"Módulo 2 - Encargos e Benefícios Anuais, Mensais e Diários",{"$f":"F45","v":2739.4300000000003}]
[null,null,null,"Módulo 3 - Provisão para Rescisão",{"$f":"F55","v":227.89}]
[null,null,null,"Módulo 4 - Custo de Reposição do Profissional Ausente",{"$f":"F73","v":396.95}]
[null,null,null,"Módulo 5 - Insumos Diversos",{"$f":"F82","v":136.82}]
[null,null,null,"SUBTOTAL (A+B+C+D+E)",{"$f":"SUM(E97:E101)","v":7079.06}]
[null,null,null,"Módulo 6 - Custos Indiretos, Tributos e Lucro",{"$f":"F94","v":1546.0667040000001}]
[]
[null,null,null,"TOTAL DO POSTO",{"$f":"SUM(E102:E103)","v":8625.1267040000002}]
[]
[null,"MÓDULO 7 - DESTAQUE DO MÓDULO 2 - 13º SALÁRIO",null,null,"Percentuais","Valor"]
[null,null,"A","13º Salário",{"$f":"'Encargos Sociais'!E32","v":8.3333333333333329E-2},{"$f":"ROUND(E108*F$16,2)","v":298.16000000000003}]
[null,null,"B","Encargos Sociais sobre o 13º Salário - Taxa calculada no SUBMÓDULO 2.2",{"$f":"SUM($E$24:$E$32)","v":0.36800000000000005},{"$f":"ROUND(E109*$F$108,2)","v":109.72},null,"* Nota 1 - Provisiona-se, mensalmente, o proporcional a 1/12 dos valores referentes a gratificação natalina e adicional de férias."]
[null,null,"C","BDI sobre o 13º Salário - Taxa calculada no MÓDULO 6",{"$f":"E94","v":0.21840000000000001},{"$f":"ROUND(E110*($F$108+$F$109),2)","v":89.08}]
[]
[null,null,null,"TOTAL DO DESTAQUE DO 13º SALÁRIO",null,{"$f":"SUM(F108:F110)","v":496.96}]
[]
[null,null,null,"QUADRO-RESUMO DO CUSTO MENSAL POR EMPREGADO","Valor"]
[null,null,null,"Custo total - sem o 13º Salário",{"$f":"E105","v":8625.1267040000002}]
[null,null,null,"Destaque do 13º Salário (valor mensal)",{"$f":"F112","v":496.96}]
[]
[null,null,null,"TOTAL DO POSTO",{"$f":"E115+E116","v":9122.0867039999994}]

{"sheet":"5","index":8,"n_rows":118,"n_cols":8,"rows_kept":118,"cut":false,"hidden":false,"merged":[[17,1,17,3],[106,1,106,3],[39,3,39,5],[46,1,46,3],[56,1,56,3],[68,3,68,5],[74,1,74,3],[83,1,83,3],[1,1,1,5],[2,1,2,5],[4,1,4,2],[5,1,5,2],[7,1,7,3]]}
[]
[null,"PLANILHA DE ESTIMATIVA DE CUSTOS"]
[null,"Padrão IN 05/2017 e IN 07/2018 - MPDG"]
[]
[null,5,null,{"$f":"HLOOKUP($B$5,'Dados Gerais'!$D$5:$BK$20,6)","v":"AUXILIAR DE ENCARREGADO"},"QUANTIDADE",{"$f":"HLOOKUP($B$5,'Dados Gerais'!$D$5:$BK$20,10)","v":1}]
[null,"CCT",null,{"$f":"HLOOKUP($B$5,'Dados Gerais'!$D$5:$BK$20,15)","v":"SEAC/DF X SINDISERVIÇOS/DF 2023/2023 Nº DF000037/2023"},"DATA-BASE",{"$f":"HLOOKUP($B$5,'Dados Gerais'!$D$5:$BK$20,16)","v":"2023-01-01"}]
[]
[null,"MÓDULO 1 - COMPOSIÇÃO DA REMUNERAÇÃO",null,null,null,"Valor"]
[null,null,"A","Salário-Base",null,{"$f":"HLOOKUP($B$5,'Dados Gerais'!$D$5:$BK$20,8)","v":2244.21}]
[null,null,"B","Adicional de Periculosidade",null,{"$f":"HLOOKUP($B$5,'Dados Gerais'!$D$5:$BK$37,25)","v":0}]
[null,null,"C","Adicional de Insalubridade",null,{"$f":"HLOOKUP($B$5,'Dados Gerais'!$D$5:$BK$37,31)","v":0}]
[null,null,"D","Adicional Noturno",null,{"$f":"HLOOKUP($B$5,'Dados Gerais'!$D$5:$BK$50,46)","v":0},null,"* Nota 1 - O Módulo 1 refere-se ao valor mensal devido ao empregado pela prestação do serviço no período de 12 meses."]
[null,null,"E","Adicional de Hora Extra",null,{"$f":"HLOOKUP($B$5,'Dados Gerais'!$D$5:$BK$67,63)","v":0},null,"* Nota 2 - O adicional de hora extra no feriado trabalhado foi suprimido pela Lei 13.467/17"]
[null,null,"F","Outros (especificar)",null,{"$f":"HLOOKUP($B$5,'Dados Gerais'!$D$5:$BK$59,33)","v":0},null,"* Nota 3 - ART. 7º, § 2º, DA LEI Nº 605/49.Sendo mensalista o obreiro, o adicional noturno pago de forma fixa já é considerado integrado para os efeitos do pagamento do repouso semanal remunerado, nos termos do art. 7º, § 2º, da Lei nº 605/49."]
[]
[null,null,null,"TOTAL DA REMUNERAÇÃO",null,{"$f":"SUM(F9:F14)","v":2244.21}]
[]
[null,"MÓDULO 2 - ENCARGOS E BENEFÍCIOS ANUAIS, MENSAIS E DIÁRIOS",null,null,"Percentuais","Valor"]
[null,"Submódulo 2.1 - 13º Salário, Férias e Adicional de Férias"]
[null,null,"A","13º Salário - Calculado no Módulo 7 - Destacado",0,{"$f":"ROUND(E20*F$16,2)","v":0}]
[null,null,"B","Férias e Adicional de Férias",{"$f":"'Encargos Sociais'!E31","v":3.03030303030303E-2},{"$f":"ROUND(E21*F$16,2)","v":68.010000000000005},null,"* Nota 1 - Provisiona-se, mensalmente, o proporcional a 1/12 dos valores referentes a gratificação natalina, férias e adicional de férias."]
[null,null,null,null,null,null,null,"* Nota 2 - O adicional de férias contido no Submódulo 2.1 corresponde a 1/3 da remuneração que, por sua vez, é dividida por 12 contome Nota 1."]
[null,"Submódulo 2.2 - Encargos Previdenciários (GPS), Fundo de Garantia por Tempo de Serviço (FGTS) e Outras Contribuições"]
[null,null,"A","INSS (art. 22, inciso I, Lei nº 8.212/91)",{"$f":"'Encargos Sociais'!E14","v":0.2},{"$f":"ROUND(E24*($F$16+$F$41+$F$73),2)","v":512.24}]
[null,null,"B","Salário Educação (art. 3º, inciso I, Decreto nº 87.043/82)",{"$f":"'Encargos Sociais'!E15","v":2.5000000000000001E-2},{"$f":"ROUND(E25*($F$16+$F$41+$F$73),2)","v":64.03}]
[null,null,"C","SAT/RAT (art. 22, II, Lei 8.212/91 e Anexo V, Decreto 6.042/07) - Enquadramento 8211-3/00",{"$f":"'Encargos Sociais'!E16","v":0.03},76.84]
[null,null,"D","SESC ou SESI (art. 30, Lei nº 8.036/90 e art. 1º, Lei 8.154/90)",{"$f":"'Encargos Sociais'!E17","v":1.4999999999999999E-2},38.42]
[null,null,"E","SENAI ou SENAC (Decreto nº 2.318/86)",{"$f":"'Encargos Sociais'!E18","v":0.01},25.61]
[null,null,"F","SEBRAE (§ 3º, art. 8º, Lei 8.029/90, alterada pela Lei nº 8.154/90)",{"$f":"'Encargos Sociais'!E19","v":6.0000000000000001E-3},15.37]
[null,null,"G","INCRA (art. 1º, I, Decreto Lei 1.146/70 e Lei 7.787, de 30/06/89)",{"$f":"'Encargos Sociais'!E20","v":2E-3},5.12,null,"* Nota 1 - Os percentuais dos encargos previdenciários, do FGTS e demais contribuições são estabelecidos por legislação vigente."]
[null,null,"H","FGTS (Lei Complementar nº 110/01 e art. 30, Lei nº 8.036/90)",{"$f":"'Encargos Sociais'!E21","v":0.08},204.9,null,"* Nota 2 - O SAT, a depender do grau de risco do serviço, irá variar entre 1%, para risco leve, de 2%, para risco médio, e de 3% para risco grave."]
[null,null,"I","SECONCI (Convenções Coletivas de Trabalho da construção)",{"$f":"'Encargos Sociais'!E22","v":0},0,null,"* Nota 3 - Os percentuais do Submódulo 2.2 incidem sobre o Módulo 1 e o Submódulo 2.1."]
[]
[null,"Submódulo 2.3 - Benefícios Mensais e Diários"]
[null,null,"A","Auxílio Transporte",null,{"$f":"HLOOKUP($B$5,'Dados Gerais'!$D$5:$BK$93,82)","v":220.73999999999998}]
[null,null,"B","Auxílio Alimentação",null,{"$f":"HLOOKUP($B$5,'Dados Gerais'!$D$5:$BK$93,89)","v":972}]
[null,null,"C","Assistência Médica e Familiar",null,{"$f":"HLOOKUP($B$5,'Dados Gerais'!$D$5:$BK$101,97)","v":0}]
[null,null,"D","Outros (Seguro de vida e auxílio funeral e auxílio odontológico)",null,{"$f":"HLOOKUP($B$5,'Dados Gerais'!$D$5:$BK$118,114)","v":0},null,"* Nota 1 - O valor informado deverá ser o custo real do benefício (descontado o valor eventualmente pago pelo empregado)."]
[null,null,null,null,null,null,null,"* Nota 2 - Observar a previsão dos benefícios contidos em Acordos, Convenções e Dissídios Coletivos de Trabalho e o disposto no art. 6º da IN 5/2017"]
[null,null,null,"QUADRO-RESUMO DO MÓDULO 2"]
[null,null,null,"2.1 - 13º Salário, Férias e Adicional de Férias - 13º Destacado - Calculado no Módulo 7 ",{"$f":"SUM(E20:E21)","v":3.03030303030303E-2},{"$f":"F20+F21","v":68.010000000000005}]
[null,null,null,"2.2 - Encargos Previdenciários (GPS), Fundo de Garantia por Tempo de Serviço (FGTS) e Contribuições",{"$f":"SUM(E24:E32)","v":0.36800000000000005},{"$f":"SUM(F24:F32)","v":942.53}]
[null,null,null,"2.3 - Benefícios Mensais e Diários",null,{"$f":"SUM(F35:F38)","v":1192.74}]
[]
[null,null,null,"TOTAL DOS ENCARGOS E BENEFÍCIOS",null,{"$f":"SUM(F41:F43)","v":2203.2799999999997}]
[]
[null,"MÓDULO 3 - PREVISÃO PARA RESCISÃO",null,null,"Percentuais","Valor"]
[null,null,"A","Aviso Prévio Indenizado (Art. 7º, inciso XXI, da CF/1988 e arts. 477, 487, §1º, e 491 da CLT)",{"$f":"'Encargos Sociais'!E36","v":8.3333333333333332E-3},{"$f":"ROUND(E48*$F$16,2)","v":18.7}]
[null,null,"B","Incidência do FGTS sobre o Aviso Prévio Indenizado (Súmula 305 TST)",{"$f":"'Encargos Sociais'!E37","v":6.6666666666666664E-4},1.5,null,"* Nota 1 - Adotou-se os parâmetros do estudo do STF (http://www.stf.jus.br/arquivo/cms/sobrestfestudosci/anexo/encargos_sociais_03102007.pdf), onde 5% do pessoal é demitido pelo empregador no decurso do contrato (para estes, considerou-se o aviso prévio indenizado). Desprezou-se as demissões por justa causa e os pedidos de demissão."]
[null,null,"C","Multa do FGTS e Contribuição Social sobre o Aviso Prévio Indenizado (Art. 18, §1º, da Lei 8.036/1990 e art. 1º da LC nº 110/2001)",{"$f":"'Encargos Sociais'!E38","v":7.7170666666666644E-3},17.32,null,"* Nota 2 - No cálculo do percentual, considerou-se 36 dias, correspondendo à metade da duração média dos contratos (2 anos)"]
[null,null,"D","Aviso Prévio Trabalhado (Art. 488, parágrafo único, CLT)",{"$f":"'Encargos Sociais'!E39","v":1.2037037037037035E-2},27.01,null,"* Nota 3 - Incide sobre a Remuneração + 13º salário (1/12) + Férias (1/12) + Adicional de Férias (1/36) x 50% multa (40% para o empregado e 10% de contribuição social) x 8% FGTS"]
[null,null,"E","Incidência de GPS, FGTS e outras contribuições sobre o Aviso Prévio Trabalhado",{"$f":"'Encargos Sociais'!E40","v":4.4296296296296288E-3},9.94,null,"* Nota 4 - Os 95% restantes do cálculo, a um prazo médio de contrato de 4 anos. Assim, calcula-se 7 dias para o 1º ano de contrato e mais 3 dias para os 3 anos seguintes."]
[null,null,"F","Multa do FGTS e Contribuição Social sobre o Aviso Prévio Trabalhado",{"$f":"'Encargos Sociais'!E41","v":3.0505155555555549E-2},68.459999999999994]
[]
[null,null,null,"TOTAL DE PREVISÃO PARA RESCISÃO",null,{"$f":"SUM(F48:F53)","v":142.93}]
[]
[null,"MÓDULO 4 - CUSTO DO PROFISSIONAL AUSENTE",null,null,"Percentuais","Valor"]
[null,"Submódulo 4.1 - Ausências Legais"]
[null,null,"A","Férias (Arts. 129 e 130, inc. I, da CLT)",{"$f":"'Encargos Sociais'!E25","v":9.0909090909090912E-2},{"$f":"ROUND(E59*$F$16,2)","v":204.02},null,"* Nota 1 - As alíneas “A” a “F” referem-se somente ao custo que será pago ao repositor pelos dias \ntrabalhados quando da necessidade de substituir a mão de obra alocada na prestação do serviço."]
[null,null,"B","Ausências Legais (Arts. 131 e 473 da CLT)",{"$f":"'Encargos Sociais'!E26","v":7.9365079365079361E-3},17.809999999999999,null,"* Nota 2 - Adotou-se a estimativa do SINAPI de 2 dias por ano."]
[null,null,"C","Licença-Paternidade (Art. 7º, XIX, e art. 10, §1º, do ADCT, CF/1988 e Art. 1º, II, da Lei 11.770/2008)",{"$f":"'Encargos Sociais'!E27","v":8.2777777777777776E-4},1.86,null,"* Nota 3 - Utilizada a proporção de 50% para homens, 5 dias de afastamento, e a probabilidade de um trabalhador requerer a Licença Paternidade em 5,22%, conforme SINAPI (citando dados da PNAD 2015)"]
[null,null,"D","Ausência por Acidente de Trabalho (Art. 131, III, da CLT)",{"$f":"'Encargos Sociais'!E28","v":8.541666666666667E-4},1.92,null,"* Nota 4 - Utilzada a estatística de 1,96% dos contribuintes beneficiados com a emissão do auxílio, conforme Anuário Estatístico da Previdência Social. Afastamento de 15 dias a cargo da empresa."]
[null,null,"E","Afastamento Maternidade (Art. 71 da Lei nº 8.213/1991)",{"$f":"'Encargos Sociais'!E29","v":3.2925925925925922E-3},7.39,null,"* Nota 5 - Utilizada a proporção de 50% para mulheres, 180 dias de afastamento, e a probabilidade de uma trabalhadora requerer a Licença Maternidade em 4,91%, conforme SINAPI (citando dados do IBGE 2016)"]
[null,null,"F","Auxílio Enfermidade - Doença (Art. 59 da Lei nº 8.213/1991)",{"$f":"'Encargos Sociais'!E30","v":7.1222222222222225E-3},15.98,null,"* Nota 6 - Utilizada a estatística de 3,37% dos contribuintes beneficiados com o auxílio, conforme Anuário Estatístico da Previdência Social de 2015 (acrescidos de 2 dias ao ano, para os quais o trabalhador nem requer o benefício da Previdência - conforme SINAPI)"]
[]
[null,"Submódulo 4.2 - Intrajornada"]
[null,null,"A","Intervalo para repouso ou alimentação",{"$f":"'Encargos Sociais'!E33","v":0},{"$f":"ROUND(E67*$F$16,2)","v":0}]
[]
[null,null,null,"QUADRO-RESUMO DO MÓDULO 4",null,"Valor"]
[null,null,null,"4.1 - Ausências Legais",{"$f":"SUM(E59:E64)","v":0.11094235810485811},{"$f":"ROUND(E70*$F$16,2)","v":248.98}]
[null,null,null,"4.2 - Intrajornada",{"$f":"E67","v":0},{"$f":"ROUND(E71*$F$16,2)","v":0}]
[]
[null,null,null,"TOTAL DE PREVISÃO PARA RESCISÃO E INTERVALO INTRAJORNADA",null,{"$f":"SUM(F70:F71)","v":248.98}]
[]
[null,"MÓDULO 5 - INSUMOS DIVERSOS",null,null,null,"Valor"]
[null,null,"A","Uniformes - aquisição",null,{"$f":"ROUND(HLOOKUP($B$5,Uniformes!L4:EA6,3)/12,2)","v":116.82}]
[null,null,"B","Materiais de consumo relacionados ao posto - aquisição",null,{"$f":"ROUND(HLOOKUP(B5,'Mat Cons'!I11:DX13,3)/12,2)","v":0}]
[null,null,"C","Materiais permanentes relacionados ao posto - remuneração da sua depreciação / manutenção",null,{"$f":"HLOOKUP(B5,'Mat Perm'!Q11:EF13,3)","v":0}]
[null,null,"D","Equipamentos relacionados ao posto - remuneração da sua depreciação / manutenção",null,{"$f":"HLOOKUP(B5,'Equip Rel'!Q11:EF13,3)","v":0}]
[null,null,"E","Equipamentos de Proteção Individual - EPI - aquisição",null,{"$f":"ROUND(HLOOKUP(B5,EPI!J4:DY6,3)/12,2)","v":20}]
[]
[null,null,null,"TOTAL DE INSUMOS DIVERSOS",null,{"$f":"SUM(F76:F81)","v":136.82},null,"* Nota - Valores mensais por empregado"]
[]
[null,"MÓDULO 6 - CUSTOS INDIRETOS, TRIBUTOS E LUCRO - BDI",null,null,"Percentuais","Valor"]
[null,null,"A","Custos Indiretos",{"$f":"BDI!E6","v":2.7000000000000003E-2}]
[null,null,"A.1","Administração Central",{"$f":"BDI!E7","v":2.1600000000000001E-2}]
[null,null,"A.2","Seguros, Garantias e Riscos",{"$f":"BDI!E8","v":5.4000000000000003E-3}]
[null,null,"B","Lucro",{"$f":"BDI!E10","v":3.3399999999999999E-2}]
[null,null,"C","Tributos",{"$f":"SUM(E90:E91)","v":0.124}]
[null,null,"C.1","Tributos Federais (COFINS, PIS e CPRB)",{"$f":"BDI!E18","v":7.3999999999999996E-2}]
[null,null,"C.2","Tributos Distritais (ISS)",{"$f":"BDI!E23","v":0.05},null,null,"* Nota - Utilizou-se o indicado pelo Sindicato da Arquitetura e da Engenharia (Sinaenco, 2008, p. 22), que adota um percentual redutor de 20% no cálculo dos custos tributários relativos às contribuições PIS e COFINS"]
[null,null,"D","Despesas Financeiras",{"$f":"BDI!E13","v":5.6394995474364773E-3}]
[]
[null,null,null,"TOTAL DE BDI",{"$f":"BDI!E26","v":0.21840000000000001},{"$f":"E94*E102","v":1086.8064479999998}]
[]
[null,null,null,"QUADRO-RESUMO DO CUSTO MENSAL POR EMPREGADO - SEM O 13º","Valor"]
[null,null,null,"Módulo 1 - Composição da Remuneração",{"$f":"F16","v":2244.21}]
[null,null,null,"Módulo 2 - Encargos e Benefícios Anuais, Mensais e Diários",{"$f":"F45","v":2203.2799999999997}]
[null,null,null,"Módulo 3 - Provisão para Rescisão",{"$f":"F55","v":142.93}]
[null,null,null,"Módulo 4 - Custo de Reposição do Profissional Ausente",{"$f":"F73","v":248.98}]
[null,null,null,"Módulo 5 - Insumos Diversos",{"$f":"F82","v":136.82}]
[null,null,null,"SUBTOTAL (A+B+C+D+E)",{"$f":"SUM(E97:E101)","v":4976.2199999999993}]
[null,null,null,"Módulo 6 - Custos Indiretos, Tributos e Lucro",{"$f":"F94","v":1086.8064479999998}]
[]
[null,null,null,"TOTAL DO POSTO",{"$f":"SUM(E102:E103)","v":6063.0264479999987}]
[]
[null,"MÓDULO 7 - DESTAQUE DO MÓDULO 2 - 13º SALÁRIO",null,null,"Percentuais","Valor"]
[null,null,"A","13º Salário",{"$f":"'Encargos Sociais'!E32","v":8.3333333333333329E-2},{"$f":"ROUND(E108*F$16,2)","v":187.02}]
[null,null,"B","Encargos Sociais sobre o 13º Salário - Taxa calculada no SUBMÓDULO 2.2",{"$f":"SUM($E$24:$E$32)","v":0.36800000000000005},{"$f":"ROUND(E109*$F$108,2)","v":68.819999999999993},null,"* Nota 1 - Provisiona-se, mensalmente, o proporcional a 1/12 dos valores referentes a gratificação natalina e adicional de férias."]
[null,null,"C","BDI sobre o 13º Salário - Taxa calculada no MÓDULO 6",{"$f":"E94","v":0.21840000000000001},{"$f":"ROUND(E110*($F$108+$F$109),2)","v":55.88}]
[]
[null,null,null,"TOTAL DO DESTAQUE DO 13º SALÁRIO",null,{"$f":"SUM(F108:F110)","v":311.72000000000003}]
[]
[null,null,null,"QUADRO-RESUMO DO CUSTO MENSAL POR EMPREGADO","Valor"]
[null,null,null,"Custo total - sem o 13º Salário",{"$f":"E105","v":6063.0264479999987}]
[null,null,null,"Destaque do 13º Salário (valor mensal)",{"$f":"F112","v":311.72000000000003}]
[]
[null,null,null,"TOTAL DO POSTO",{"$f":"E115+E116","v":6374.746447999999}]

{"sheet":"6","index":9,"n_rows":118,"n_cols":8,"rows_kept":118,"cut":false,"hidden":false,"merged":[[106,1,106,3],[39,3,39,5],[46,1,46,3],[56,1,56,3],[68,3,68,5],[74,1,74,3],[83,1,83,3],[17,1,17,3],[1,1,1,5],[2,1,2,5],[4,1,4,2],[5,1,5,2],[7,1,7,3]]}
[]
[null,"PLANILHA DE ESTIMATIVA DE CUSTOS"]
[null,"Padrão IN 05/2017 e IN 07/2018 - MPDG"]
[]
[null,6,null,{"$f":"HLOOKUP($B$5,'Dados Gerais'!$D$5:$BK$20,6)","v":"ALMOXARIFE"},"QUANTIDADE",{"$f":"HLOOKUP($B$5,'Dados Gerais'!$D$5:$BK$20,10)","v":2}]
[null,"CCT",null,{"$f":"HLOOKUP($B$5,'Dados Gerais'!$D$5:$BK$20,15)","v":"SEAC/DF X SINDISERVIÇOS/DF 2023/2023 Nº DF000037/2023"},"DATA-BASE",{"$f":"HLOOKUP($B$5,'Dados Gerais'!$D$5:$BK$20,16)","v":"2023-01-01"}]
[]
[null,"MÓDULO 1 - COMPOSIÇÃO DA REMUNERAÇÃO",null,null,null,"Valor"]
[null,null,"A","Salário-Base",null,{"$f":"HLOOKUP($B$5,'Dados Gerais'!$D$5:$BK$20,8)","v":2686.07}]
[null,null,"B","Adicional de Periculosidade",null,{"$f":"HLOOKUP($B$5,'Dados Gerais'!$D$5:$BK$37,25)","v":0}]
[null,null,"C","Adicional de Insalubridade",null,{"$f":"HLOOKUP($B$5,'Dados Gerais'!$D$5:$BK$37,31)","v":0}]
[null,null,"D","Adicional Noturno",null,{"$f":"HLOOKUP($B$5,'Dados Gerais'!$D$5:$BK$50,46)","v":0},null,"* Nota 1 - O Módulo 1 refere-se ao valor mensal devido ao empregado pela prestação do serviço no período de 12 meses."]
[null,null,"E","Adicional de Hora Extra",null,{"$f":"HLOOKUP($B$5,'Dados Gerais'!$D$5:$BK$67,63)","v":0},null,"* Nota 2 - O adicional de hora extra no feriado trabalhado foi suprimido pela Lei 13.467/17"]
[null,null,"F","Outros (especificar)",null,{"$f":"HLOOKUP($B$5,'Dados Gerais'!$D$5:$BK$59,33)","v":0},null,"* Nota 3 - ART. 7º, § 2º, DA LEI Nº 605/49.Sendo mensalista o obreiro, o adicional noturno pago de forma fixa já é considerado integrado para os efeitos do pagamento do repouso semanal remunerado, nos termos do art. 7º, § 2º, da Lei nº 605/49."]
[]
[null,null,null,"TOTAL DA REMUNERAÇÃO",null,{"$f":"SUM(F9:F14)","v":2686.07}]
[]
[null,"MÓDULO 2 - ENCARGOS E BENEFÍCIOS ANUAIS, MENSAIS E DIÁRIOS",null,null,"Percentuais","Valor"]
[null,"Submódulo 2.1 - 13º Salário, Férias e Adicional de Férias"]
[null,null,"A","13º Salário - Calculado no Módulo 7 - Destacado",0,{"$f":"ROUND(E20*F$16,2)","v":0}]
[null,null,"B","Férias e Adicional de Férias",{"$f":"'Encargos Sociais'!E31","v":3.03030303030303E-2},{"$f":"ROUND(E21*F$16,2)","v":81.400000000000006},null,"* Nota 1 - Provisiona-se, mensalmente, o proporcional a 1/12 dos valores referentes a gratificação natalina, férias e adicional de férias."]
[null,null,null,null,null,null,null,"* Nota 2 - O adicional de férias contido no Submódulo 2.1 corresponde a 1/3 da remuneração que, por sua vez, é dividida por 12 contome Nota 1."]
[null,"Submódulo 2.2 - Encargos Previdenciários (GPS), Fundo de Garantia por Tempo de Serviço (FGTS) e Outras Contribuições"]
[null,null,"A","INSS (art. 22, inciso I, Lei nº 8.212/91)",{"$f":"'Encargos Sociais'!E14","v":0.2},{"$f":"ROUND(E24*($F$16+$F$41+$F$73),2)","v":613.09}]
[null,null,"B","Salário Educação (art. 3º, inciso I, Decreto nº 87.043/82)",{"$f":"'Encargos Sociais'!E15","v":2.5000000000000001E-2},{"$f":"ROUND(E25*($F$16+$F$41+$F$73),2)","v":76.64}]
[null,null,"C","SAT/RAT (art. 22, II, Lei 8.212/91 e Anexo V, Decreto 6.042/07) - Enquadramento 8211-3/00",{"$f":"'Encargos Sociais'!E16","v":0.03},91.96]
[null,null,"D","SESC ou SESI (art. 30, Lei nº 8.036/90 e art. 1º, Lei 8.154/90)",{"$f":"'Encargos Sociais'!E17","v":1.4999999999999999E-2},45.98]
[null,null,"E","SENAI ou SENAC (Decreto nº 2.318/86)",{"$f":"'Encargos Sociais'!E18","v":0.01},30.65]
[null,null,"F","SEBRAE (§ 3º, art. 8º, Lei 8.029/90, alterada pela Lei nº 8.154/90)",{"$f":"'Encargos Sociais'!E19","v":6.0000000000000001E-3},18.39]
[null,null,"G","INCRA (art. 1º, I, Decreto Lei 1.146/70 e Lei 7.787, de 30/06/89)",{"$f":"'Encargos Sociais'!E20","v":2E-3},6.13,null,"* Nota 1 - Os percentuais dos encargos previdenciários, do FGTS e demais contribuições são estabelecidos por legislação vigente."]
[null,null,"H","FGTS (Lei Complementar nº 110/01 e art. 30, Lei nº 8.036/90)",{"$f":"'Encargos Sociais'!E21","v":0.08},245.24,null,"* Nota 2 - O SAT, a depender do grau de risco do serviço, irá variar entre 1%, para risco leve, de 2%, para risco médio, e de 3% para risco grave."]
[null,null,"I","SECONCI (Convenções Coletivas de Trabalho da construção)",{"$f":"'Encargos Sociais'!E22","v":0},0,null,"* Nota 3 - Os percentuais do Submódulo 2.2 incidem sobre o Módulo 1 e o Submódulo 2.1."]
[]
[null,"Submódulo 2.3 - Benefícios Mensais e Diários"]
[null,null,"A","Auxílio Transporte",null,{"$f":"HLOOKUP($B$5,'Dados Gerais'!$D$5:$BK$93,82)","v":194.23}]
[null,null,"B","Auxílio Alimentação",null,{"$f":"HLOOKUP($B$5,'Dados Gerais'!$D$5:$BK$93,89)","v":972}]
[null,null,"C","Assistência Médica e Familiar",null,{"$f":"HLOOKUP($B$5,'Dados Gerais'!$D$5:$BK$101,97)","v":0}]
[null,null,"D","Outros (Seguro de vida e auxílio funeral e auxílio odontológico)",null,{"$f":"HLOOKUP($B$5,'Dados Gerais'!$D$5:$BK$118,114)","v":0},null,"* Nota 1 - O valor informado deverá ser o custo real do benefício (descontado o valor eventualmente pago pelo empregado)."]
[null,null,null,null,null,null,null,"* Nota 2 - Observar a previsão dos benefícios contidos em Acordos, Convenções e Dissídios Coletivos de Trabalho e o disposto no art. 6º da IN 5/2017"]
[null,null,null,"QUADRO-RESUMO DO MÓDULO 2"]
[null,null,null,"2.1 - 13º Salário, Férias e Adicional de Férias - 13º Destacado - Calculado no Módulo 7 ",{"$f":"SUM(E20:E21)","v":3.03030303030303E-2},{"$f":"F20+F21","v":81.400000000000006}]
[null,null,null,"2.2 - Encargos Previdenciários (GPS), Fundo de Garantia por Tempo de Serviço (FGTS) e Contribuições",{"$f":"SUM(E24:E32)","v":0.36800000000000005},{"$f":"SUM(F24:F32)","v":1128.08}]
[null,null,null,"2.3 - Benefícios Mensais e Diários",null,{"$f":"SUM(F35:F38)","v":1166.23}]
[]
[null,null,null,"TOTAL DOS ENCARGOS E BENEFÍCIOS",null,{"$f":"SUM(F41:F43)","v":2375.71}]
[]
[null,"MÓDULO 3 - PREVISÃO PARA RESCISÃO",null,null,"Percentuais","Valor"]
[null,null,"A","Aviso Prévio Indenizado (Art. 7º, inciso XXI, da CF/1988 e arts. 477, 487, §1º, e 491 da CLT)",{"$f":"'Encargos Sociais'!E36","v":8.3333333333333332E-3},{"$f":"ROUND(E48*$F$16,2)","v":22.38}]
[null,null,"B","Incidência do FGTS sobre o Aviso Prévio Indenizado (Súmula 305 TST)",{"$f":"'Encargos Sociais'!E37","v":6.6666666666666664E-4},1.79,null,"* Nota 1 - Adotou-se os parâmetros do estudo do STF (http://www.stf.jus.br/arquivo/cms/sobrestfestudosci/anexo/encargos_sociais_03102007.pdf), onde 5% do pessoal é demitido pelo empregador no decurso do contrato (para estes, considerou-se o aviso prévio indenizado). Desprezou-se as demissões por justa causa e os pedidos de demissão."]
[null,null,"C","Multa do FGTS e Contribuição Social sobre o Aviso Prévio Indenizado (Art. 18, §1º, da Lei 8.036/1990 e art. 1º da LC nº 110/2001)",{"$f":"'Encargos Sociais'!E38","v":7.7170666666666644E-3},20.73,null,"* Nota 2 - No cálculo do percentual, considerou-se 36 dias, correspondendo à metade da duração média dos contratos (2 anos)"]
[null,null,"D","Aviso Prévio Trabalhado (Art. 488, parágrafo único, CLT)",{"$f":"'Encargos Sociais'!E39","v":1.2037037037037035E-2},32.33,null,"* Nota 3 - Incide sobre a Remuneração + 13º salário (1/12) + Férias (1/12) + Adicional de Férias (1/36) x 50% multa (40% para o empregado e 10% de contribuição social) x 8% FGTS"]
[null,null,"E","Incidência de GPS, FGTS e outras contribuições sobre o Aviso Prévio Trabalhado",{"$f":"'Encargos Sociais'!E40","v":4.4296296296296288E-3},11.9,null,"* Nota 4 - Os 95% restantes do cálculo, a um prazo médio de contrato de 4 anos. Assim, calcula-se 7 dias para o 1º ano de contrato e mais 3 dias para os 3 anos seguintes."]
[null,null,"F","Multa do FGTS e Contribuição Social sobre o Aviso Prévio Trabalhado",{"$f":"'Encargos Sociais'!E41","v":3.0505155555555549E-2},81.94]
[]
[null,null,null,"TOTAL DE PREVISÃO PARA RESCISÃO",null,{"$f":"SUM(F48:F53)","v":171.07}]
[]
[null,"MÓDULO 4 - CUSTO DO PROFISSIONAL AUSENTE",null,null,"Percentuais","Valor"]
[null,"Submódulo 4.1 - Ausências Legais"]
[null,null,"A","Férias (Arts. 129 e 130, inc. I, da CLT)",{"$f":"'Encargos Sociais'!E25","v":9.0909090909090912E-2},{"$f":"ROUND(E59*$F$16,2)","v":244.19},null,"* Nota 1 - As alíneas “A” a “F” referem-se somente ao custo que será pago ao repositor pelos dias \ntrabalhados quando da necessidade de substituir a mão de obra alocada na prestação do serviço."]
[null,null,"B","Ausências Legais (Arts. 131 e 473 da CLT)",{"$f":"'Encargos Sociais'!E26","v":7.9365079365079361E-3},21.32,null,"* Nota 2 - Adotou-se a estimativa do SINAPI de 2 dias por ano."]
[null,null,"C","Licença-Paternidade (Art. 7º, XIX, e art. 10, §1º, do ADCT, CF/1988 e Art. 1º, II, da Lei 11.770/2008)",{"$f":"'Encargos Sociais'!E27","v":8.2777777777777776E-4},2.2200000000000002,null,"* Nota 3 - Utilizada a proporção de 50% para homens, 5 dias de afastamento, e a probabilidade de um trabalhador requerer a Licença Paternidade em 5,22%, conforme SINAPI (citando dados da PNAD 2015)"]
[null,null,"D","Ausência por Acidente de Trabalho (Art. 131, III, da CLT)",{"$f":"'Encargos Sociais'!E28","v":8.541666666666667E-4},2.29,null,"* Nota 4 - Utilzada a estatística de 1,96% dos contribuintes beneficiados com a emissão do auxílio, conforme Anuário Estatístico da Previdência Social. Afastamento de 15 dias a cargo da empresa."]
[null,null,"E","Afastamento Maternidade (Art. 71 da Lei nº 8.213/1991)",{"$f":"'Encargos Sociais'!E29","v":3.2925925925925922E-3},8.84,null,"* Nota 5 - Utilizada a proporção de 50% para mulheres, 180 dias de afastamento, e a probabilidade de uma trabalhadora requerer a Licença Maternidade em 4,91%, conforme SINAPI (citando dados do IBGE 2016)"]
[null,null,"F","Auxílio Enfermidade - Doença (Art. 59 da Lei nº 8.213/1991)",{"$f":"'Encargos Sociais'!E30","v":7.1222222222222225E-3},19.13,null,"* Nota 6 - Utilizada a estatística de 3,37% dos contribuintes beneficiados com o auxílio, conforme Anuário Estatístico da Previdência Social de 2015 (acrescidos de 2 dias ao ano, para os quais o trabalhador nem requer o benefício da Previdência - conforme SINAPI)"]
[]
[null,"Submódulo 4.2 - Intrajornada"]
[null,null,"A","Intervalo para repouso ou alimentação",{"$f":"'Encargos Sociais'!E33","v":0},{"$f":"ROUND(E67*$F$16,2)","v":0}]
[]
[null,null,null,"QUADRO-RESUMO DO MÓDULO 4",null,"Valor"]
[null,null,null,"4.1 - Ausências Legais",{"$f":"SUM(E59:E64)","v":0.11094235810485811},{"$f":"ROUND(E70*$F$16,2)","v":298}]
[null,null,null,"4.2 - Intrajornada",{"$f":"E67","v":0},{"$f":"ROUND(E71*$F$16,2)","v":0}]
[]
[null,null,null,"TOTAL DE PREVISÃO PARA RESCISÃO E INTERVALO INTRAJORNADA",null,{"$f":"SUM(F70:F71)","v":298}]
[]
[null,"MÓDULO 5 - INSUMOS DIVERSOS",null,null,null,"Valor"]
[null,null,"A","Uniformes - aquisição",null,{"$f":"ROUND(HLOOKUP($B$5,Uniformes!L4:EA6,3)/12,2)","v":43.27}]
[null,null,"B","Materiais de consumo relacionados ao posto - aquisição",null,{"$f":"ROUND(HLOOKUP(B5,'Mat Cons'!I11:DX13,3)/12,2)","v":0}]
[null,null,"C","Materiais permanentes relacionados ao posto - remuneração da sua depreciação / manutenção",null,{"$f":"HLOOKUP(B5,'Mat Perm'!Q11:EF13,3)","v":0}]
[null,null,"D","Equipamentos relacionados ao posto - remuneração da sua depreciação / manutenção",null,{"$f":"HLOOKUP(B5,'Equip Rel'!Q11:EF13,3)","v":0}]
[null,null,"E","Equipamentos de Proteção Individual - EPI - aquisição",null,{"$f":"ROUND(HLOOKUP(B5,EPI!J4:DY6,3)/12,2)","v":30.37}]
[]
[null,null,null,"TOTAL DE INSUMOS DIVERSOS",null,{"$f":"SUM(F76:F81)","v":73.64},null,"* Nota - Valores mensais por empregado"]
[]
[null,"MÓDULO 6 - CUSTOS INDIRETOS, TRIBUTOS E LUCRO - BDI",null,null,"Percentuais","Valor"]
[null,null,"A","Custos Indiretos",{"$f":"BDI!E6","v":2.7000000000000003E-2}]
[null,null,"A.1","Administração Central",{"$f":"BDI!E7","v":2.1600000000000001E-2}]
[null,null,"A.2","Seguros, Garantias e Riscos",{"$f":"BDI!E8","v":5.4000000000000003E-3}]
[null,null,"B","Lucro",{"$f":"BDI!E10","v":3.3399999999999999E-2}]
[null,null,"C","Tributos",{"$f":"SUM(E90:E91)","v":0.124}]
[null,null,"C.1","Tributos Federais (COFINS, PIS e CPRB)",{"$f":"BDI!E18","v":7.3999999999999996E-2}]
[null,null,"C.2","Tributos Distritais (ISS)",{"$f":"BDI!E23","v":0.05},null,null,"* Nota - Utilizou-se o indicado pelo Sindicato da Arquitetura e da Engenharia (Sinaenco, 2008, p. 22), que adota um percentual redutor de 20% no cálculo dos custos tributários relativos às contribuições PIS e COFINS"]
[null,null,"D","Despesas Financeiras",{"$f":"BDI!E13","v":5.6394995474364773E-3}]
[]
[null,null,null,"TOTAL DE BDI",{"$f":"BDI!E26","v":0.21840000000000001},{"$f":"E94*E102","v":1224.0206160000002}]
[]
[null,null,null,"QUADRO-RESUMO DO CUSTO MENSAL POR EMPREGADO - SEM O 13º","Valor"]
[null,null,null,"Módulo 1 - Composição da Remuneração",{"$f":"F16","v":2686.07}]
[null,null,null,"Módulo 2 - Encargos e Benefícios Anuais, Mensais e Diários",{"$f":"F45","v":2375.71}]
[null,null,null,"Módulo 3 - Provisão para Rescisão",{"$f":"F55","v":171.07}]
[null,null,null,"Módulo 4 - Custo de Reposição do Profissional Ausente",{"$f":"F73","v":298}]
[null,null,null,"Módulo 5 - Insumos Diversos",{"$f":"F82","v":73.64}]
[null,null,null,"SUBTOTAL (A+B+C+D+E)",{"$f":"SUM(E97:E101)","v":5604.4900000000007}]
[null,null,null,"Módulo 6 - Custos Indiretos, Tributos e Lucro",{"$f":"F94","v":1224.0206160000002}]
[]
[null,null,null,"TOTAL DO POSTO",{"$f":"SUM(E102:E103)","v":6828.5106160000014}]
[]
[null,"MÓDULO 7 - DESTAQUE DO MÓDULO 2 - 13º SALÁRIO",null,null,"Percentuais","Valor"]
[null,null,"A","13º Salário",{"$f":"'Encargos Sociais'!E32","v":8.3333333333333329E-2},{"$f":"ROUND(E108*F$16,2)","v":223.84}]
[null,null,"B","Encargos Sociais sobre o 13º Salário - Taxa calculada no SUBMÓDULO 2.2",{"$f":"SUM($E$24:$E$32)","v":0.36800000000000005},{"$f":"ROUND(E109*$F$108,2)","v":82.37},null,"* Nota 1 - Provisiona-se, mensalmente, o proporcional a 1/12 dos valores referentes a gratificação natalina e adicional de férias."]
[null,null,"C","BDI sobre o 13º Salário - Taxa calculada no MÓDULO 6",{"$f":"E94","v":0.21840000000000001},{"$f":"ROUND(E110*($F$108+$F$109),2)","v":66.88}]
[]
[null,null,null,"TOTAL DO DESTAQUE DO 13º SALÁRIO",null,{"$f":"SUM(F108:F110)","v":373.09000000000003}]
[]
[null,null,null,"QUADRO-RESUMO DO CUSTO MENSAL POR EMPREGADO","Valor"]
[null,null,null,"Custo total - sem o 13º Salário",{"$f":"E105","v":6828.5106160000014}]
[null,null,null,"Destaque do 13º Salário (valor mensal)",{"$f":"F112","v":373.09000000000003}]
[]
[null,null,null,"TOTAL DO POSTO",{"$f":"E115+E116","v":7201.6006160000015}]

{"sheet":"7","index":10,"n_rows":118,"n_cols":8,"rows_kept":118,"cut":false,"hidden":false,"merged":[[17,1,17,3],[1,1,1,5],[2,1,2,5],[4,1,4,2],[5,1,5,2],[7,1,7,3],[106,1,106,3],[39,3,39,5],[46,1,46,3],[56,1,56,3],[68,3,68,5],[74,1,74,3],[83,1,83,3]]}
[]
[null,"PLANILHA DE ESTIMATIVA DE CUSTOS"]
[null,"Padrão IN 05/2017 e IN 07/2018 - MPDG"]
[]
[null,7,null,{"$f":"HLOOKUP($B$5,'Dados Gerais'!$D$5:$BK$20,6)","v":"SERVENTE"},"QUANTIDADE",{"$f":"HLOOKUP($B$5,'Dados Gerais'!$D$5:$BK$20,10)","v":151}]
[null,"CCT",null,{"$f":"HLOOKUP($B$5,'Dados Gerais'!$D$5:$BK$20,15)","v":"SEAC/DF X SINDISERVIÇOS/DF 2023/2023 Nº DF000037/2023"},"DATA-BASE",{"$f":"HLOOKUP($B$5,'Dados Gerais'!$D$5:$BK$20,16)","v":"2023-01-01"}]
[]
[null,"MÓDULO 1 - COMPOSIÇÃO DA REMUNERAÇÃO",null,null,null,"Valor"]
[null,null,"A","Salário-Base",null,{"$f":"HLOOKUP($B$5,'Dados Gerais'!$D$5:$BK$20,8)","v":1898.58}]
[null,null,"B","Adicional de Periculosidade",null,{"$f":"HLOOKUP($B$5,'Dados Gerais'!$D$5:$BK$37,25)","v":0}]
[null,null,"C","Adicional de Insalubridade",null,{"$f":"HLOOKUP($B$5,'Dados Gerais'!$D$5:$BK$37,31)","v":0}]
[null,null,"D","Adicional Noturno",null,{"$f":"HLOOKUP($B$5,'Dados Gerais'!$D$5:$BK$50,46)","v":0},null,"* Nota 1 - O Módulo 1 refere-se ao valor mensal devido ao empregado pela prestação do serviço no período de 12 meses."]
[null,null,"E","Adicional de Hora Extra",null,{"$f":"HLOOKUP($B$5,'Dados Gerais'!$D$5:$BK$67,63)","v":0},null,"* Nota 2 - O adicional de hora extra no feriado trabalhado foi suprimido pela Lei 13.467/17"]
[null,null,"F","Outros (especificar)",null,{"$f":"HLOOKUP($B$5,'Dados Gerais'!$D$5:$BK$59,33)","v":0},null,"* Nota 3 - ART. 7º, § 2º, DA LEI Nº 605/49.Sendo mensalista o obreiro, o adicional noturno pago de forma fixa já é considerado integrado para os efeitos do pagamento do repouso semanal remunerado, nos termos do art. 7º, § 2º, da Lei nº 605/49."]
[]
[null,null,null,"TOTAL DA REMUNERAÇÃO",null,{"$f":"SUM(F9:F14)","v":1898.58}]
[]
[null,"MÓDULO 2 - ENCARGOS E BENEFÍCIOS ANUAIS, MENSAIS E DIÁRIOS",null,null,"Percentuais","Valor"]
[null,"Submódulo 2.1 - 13º Salário, Férias e Adicional de Férias"]
[null,null,"A","13º Salário - Calculado no Módulo 7 - Destacado",0,{"$f":"ROUND(E20*F$16,2)","v":0}]
[null,null,"B","Férias e Adicional de Férias",{"$f":"'Encargos Sociais'!E31","v":3.03030303030303E-2},{"$f":"ROUND(E21*F$16,2)","v":57.53},null,"* Nota 1 - Provisiona-se, mensalmente, o proporcional a 1/12 dos valores referentes a gratificação natalina, férias e adicional de férias."]
[null,null,null,null,null,null,null,"* Nota 2 - O adicional de férias contido no Submódulo 2.1 corresponde a 1/3 da remuneração que, por sua vez, é dividida por 12 contome Nota 1."]
[null,"Submódulo 2.2 - Encargos Previdenciários (GPS), Fundo de Garantia por Tempo de Serviço (FGTS) e Outras Contribuições"]
[null,null,"A","INSS (art. 22, inciso I, Lei nº 8.212/91)",{"$f":"'Encargos Sociais'!E14","v":0.2},{"$f":"ROUND(E24*($F$16+$F$41+$F$73),2)","v":433.35}]
[null,null,"B","Salário Educação (art. 3º, inciso I, Decreto nº 87.043/82)",{"$f":"'Encargos Sociais'!E15","v":2.5000000000000001E-2},{"$f":"ROUND(E25*($F$16+$F$41+$F$73),2)","v":54.17}]
[null,null,"C","SAT/RAT (art. 22, II, Lei 8.212/91 e Anexo V, Decreto 6.042/07) - Enquadramento 8211-3/00",{"$f":"'Encargos Sociais'!E16","v":0.03},65]
[null,null,"D","SESC ou SESI (art. 30, Lei nº 8.036/90 e art. 1º, Lei 8.154/90)",{"$f":"'Encargos Sociais'!E17","v":1.4999999999999999E-2},32.5]
[null,null,"E","SENAI ou SENAC (Decreto nº 2.318/86)",{"$f":"'Encargos Sociais'!E18","v":0.01},21.67]
[null,null,"F","SEBRAE (§ 3º, art. 8º, Lei 8.029/90, alterada pela Lei nº 8.154/90)",{"$f":"'Encargos Sociais'!E19","v":6.0000000000000001E-3},13]
[null,null,"G","INCRA (art. 1º, I, Decreto Lei 1.146/70 e Lei 7.787, de 30/06/89)",{"$f":"'Encargos Sociais'!E20","v":2E-3},4.33,null,"* Nota 1 - Os percentuais dos encargos previdenciários, do FGTS e demais contribuições são estabelecidos por legislação vigente."]
[null,null,"H","FGTS (Lei Complementar nº 110/01 e art. 30, Lei nº 8.036/90)",{"$f":"'Encargos Sociais'!E21","v":0.08},173.34,null,"* Nota 2 - O SAT, a depender do grau de risco do serviço, irá variar entre 1%, para risco leve, de 2%, para risco médio, e de 3% para risco grave."]
[null,null,"I","SECONCI (Convenções Coletivas de Trabalho da construção)",{"$f":"'Encargos Sociais'!E22","v":0},0,null,"* Nota 3 - Os percentuais do Submódulo 2.2 incidem sobre o Módulo 1 e o Submódulo 2.1."]
[]
[null,"Submódulo 2.3 - Benefícios Mensais e Diários"]
[null,null,"A","Auxílio Transporte",null,{"$f":"HLOOKUP($B$5,'Dados Gerais'!$D$5:$BK$93,82)","v":241.48}]
[null,null,"B","Auxílio Alimentação",null,{"$f":"HLOOKUP($B$5,'Dados Gerais'!$D$5:$BK$93,89)","v":972}]
[null,null,"C","Assistência Médica e Familiar",null,{"$f":"HLOOKUP($B$5,'Dados Gerais'!$D$5:$BK$101,97)","v":0}]
[null,null,"D","Outros (Seguro de vida e auxílio funeral e auxílio odontológico)",null,{"$f":"HLOOKUP($B$5,'Dados Gerais'!$D$5:$BK$118,114)","v":0},null,"* Nota 1 - O valor informado deverá ser o custo real do benefício (descontado o valor eventualmente pago pelo empregado)."]
[null,null,null,null,null,null,null,"* Nota 2 - Observar a previsão dos benefícios contidos em Acordos, Convenções e Dissídios Coletivos de Trabalho e o disposto no art. 6º da IN 5/2017"]
[null,null,null,"QUADRO-RESUMO DO MÓDULO 2"]
[null,null,null,"2.1 - 13º Salário, Férias e Adicional de Férias - 13º Destacado - Calculado no Módulo 7 ",{"$f":"SUM(E20:E21)","v":3.03030303030303E-2},{"$f":"F20+F21","v":57.53}]
[null,null,null,"2.2 - Encargos Previdenciários (GPS), Fundo de Garantia por Tempo de Serviço (FGTS) e Contribuições",{"$f":"SUM(E24:E32)","v":0.36800000000000005},{"$f":"SUM(F24:F32)","v":797.36}]
[null,null,null,"2.3 - Benefícios Mensais e Diários",null,{"$f":"SUM(F35:F38)","v":1213.48}]
[]
[null,null,null,"TOTAL DOS ENCARGOS E BENEFÍCIOS",null,{"$f":"SUM(F41:F43)","v":2068.37}]
[]
[null,"MÓDULO 3 - PREVISÃO PARA RESCISÃO",null,null,"Percentuais","Valor"]
[null,null,"A","Aviso Prévio Indenizado (Art. 7º, inciso XXI, da CF/1988 e arts. 477, 487, §1º, e 491 da CLT)",{"$f":"'Encargos Sociais'!E36","v":8.3333333333333332E-3},{"$f":"ROUND(E48*$F$16,2)","v":15.82}]
[null,null,"B","Incidência do FGTS sobre o Aviso Prévio Indenizado (Súmula 305 TST)",{"$f":"'Encargos Sociais'!E37","v":6.6666666666666664E-4},1.27,null,"* Nota 1 - Adotou-se os parâmetros do estudo do STF (http://www.stf.jus.br/arquivo/cms/sobrestfestudosci/anexo/encargos_sociais_03102007.pdf), onde 5% do pessoal é demitido pelo empregador no decurso do contrato (para estes, considerou-se o aviso prévio indenizado). Desprezou-se as demissões por justa causa e os pedidos de demissão."]
[null,null,"C","Multa do FGTS e Contribuição Social sobre o Aviso Prévio Indenizado (Art. 18, §1º, da Lei 8.036/1990 e art. 1º da LC nº 110/2001)",{"$f":"'Encargos Sociais'!E38","v":7.7170666666666644E-3},14.65,null,"* Nota 2 - No cálculo do percentual, considerou-se 36 dias, correspondendo à metade da duração média dos contratos (2 anos)"]
[null,null,"D","Aviso Prévio Trabalhado (Art. 488, parágrafo único, CLT)",{"$f":"'Encargos Sociais'!E39","v":1.2037037037037035E-2},22.85,null,"* Nota 3 - Incide sobre a Remuneração + 13º salário (1/12) + Férias (1/12) + Adicional de Férias (1/36) x 50% multa (40% para o empregado e 10% de contribuição social) x 8% FGTS"]
[null,null,"E","Incidência de GPS, FGTS e outras contribuições sobre o Aviso Prévio Trabalhado",{"$f":"'Encargos Sociais'!E40","v":4.4296296296296288E-3},8.41,null,"* Nota 4 - Os 95% restantes do cálculo, a um prazo médio de contrato de 4 anos. Assim, calcula-se 7 dias para o 1º ano de contrato e mais 3 dias para os 3 anos seguintes."]
[null,null,"F","Multa do FGTS e Contribuição Social sobre o Aviso Prévio Trabalhado",{"$f":"'Encargos Sociais'!E41","v":3.0505155555555549E-2},57.92]
[]
[null,null,null,"TOTAL DE PREVISÃO PARA RESCISÃO",null,{"$f":"SUM(F48:F53)","v":120.92}]
[]
[null,"MÓDULO 4 - CUSTO DO PROFISSIONAL AUSENTE",null,null,"Percentuais","Valor"]
[null,"Submódulo 4.1 - Ausências Legais"]
[null,null,"A","Férias (Arts. 129 e 130, inc. I, da CLT)",{"$f":"'Encargos Sociais'!E25","v":9.0909090909090912E-2},{"$f":"ROUND(E59*$F$16,2)","v":172.6},null,"* Nota 1 - As alíneas “A” a “F” referem-se somente ao custo que será pago ao repositor pelos dias \ntrabalhados quando da necessidade de substituir a mão de obra alocada na prestação do serviço."]
[null,null,"B","Ausências Legais (Arts. 131 e 473 da CLT)",{"$f":"'Encargos Sociais'!E26","v":7.9365079365079361E-3},15.07,null,"* Nota 2 - Adotou-se a estimativa do SINAPI de 2 dias por ano."]
[null,null,"C","Licença-Paternidade (Art. 7º, XIX, e art. 10, §1º, do ADCT, CF/1988 e Art. 1º, II, da Lei 11.770/2008)",{"$f":"'Encargos Sociais'!E27","v":8.2777777777777776E-4},1.57,null,"* Nota 3 - Utilizada a proporção de 50% para homens, 5 dias de afastamento, e a probabilidade de um trabalhador requerer a Licença Paternidade em 5,22%, conforme SINAPI (citando dados da PNAD 2015)"]
[null,null,"D","Ausência por Acidente de Trabalho (Art. 131, III, da CLT)",{"$f":"'Encargos Sociais'!E28","v":8.541666666666667E-4},1.62,null,"* Nota 4 - Utilzada a estatística de 1,96% dos contribuintes beneficiados com a emissão do auxílio, conforme Anuário Estatístico da Previdência Social. Afastamento de 15 dias a cargo da empresa."]
[null,null,"E","Afastamento Maternidade (Art. 71 da Lei nº 8.213/1991)",{"$f":"'Encargos Sociais'!E29","v":3.2925925925925922E-3},6.25,null,"* Nota 5 - Utilizada a proporção de 50% para mulheres, 180 dias de afastamento, e a probabilidade de uma trabalhadora requerer a Licença Maternidade em 4,91%, conforme SINAPI (citando dados do IBGE 2016)"]
[null,null,"F","Auxílio Enfermidade - Doença (Art. 59 da Lei nº 8.213/1991)",{"$f":"'Encargos Sociais'!E30","v":7.1222222222222225E-3},13.52,null,"* Nota 6 - Utilizada a estatística de 3,37% dos contribuintes beneficiados com o auxílio, conforme Anuário Estatístico da Previdência Social de 2015 (acrescidos de 2 dias ao ano, para os quais o trabalhador nem requer o benefício da Previdência - conforme SINAPI)"]
[]
[null,"Submódulo 4.2 - Intrajornada"]
[null,null,"A","Intervalo para repouso ou alimentação",{"$f":"'Encargos Sociais'!E33","v":0},{"$f":"ROUND(E67*$F$16,2)","v":0}]
[]
[null,null,null,"QUADRO-RESUMO DO MÓDULO 4",null,"Valor"]
[null,null,null,"4.1 - Ausências Legais",{"$f":"SUM(E59:E64)","v":0.11094235810485811},{"$f":"ROUND(E70*$F$16,2)","v":210.63}]
[null,null,null,"4.2 - Intrajornada",{"$f":"E67","v":0},{"$f":"ROUND(E71*$F$16,2)","v":0}]
[]
[null,null,null,"TOTAL DE PREVISÃO PARA RESCISÃO E INTERVALO INTRAJORNADA",null,{"$f":"SUM(F70:F71)","v":210.63}]
[]
[null,"MÓDULO 5 - INSUMOS DIVERSOS",null,null,null,"Valor"]
[null,null,"A","Uniformes - aquisição",null,{"$f":"ROUND(HLOOKUP($B$5,Uniformes!L4:EA6,3)/12,2)","v":43.27}]
[null,null,"B","Materiais de consumo relacionados ao posto - aquisição",null,{"$f":"ROUND(HLOOKUP(B5,'Mat Cons'!I11:DX13,3)/12,2)","v":0}]
[null,null,"C","Materiais permanentes relacionados ao posto - remuneração da sua depreciação / manutenção",null,{"$f":"HLOOKUP(B5,'Mat Perm'!Q11:EF13,3)","v":0}]
[null,null,"D","Equipamentos relacionados ao posto - remuneração da sua depreciação / manutenção",null,{"$f":"HLOOKUP(B5,'Equip Rel'!Q11:EF13,3)","v":0}]
[null,null,"E","Equipamentos de Proteção Individual - EPI - aquisição",null,{"$f":"ROUND(HLOOKUP(B5,EPI!J4:DY6,3)/12,2)","v":39.08}]
[]
[null,null,null,"TOTAL DE INSUMOS DIVERSOS",null,{"$f":"SUM(F76:F81)","v":82.35},null,"* Nota - Valores mensais por empregado"]
[]
[null,"MÓDULO 6 - CUSTOS INDIRETOS, TRIBUTOS E LUCRO - BDI",null,null,"Percentuais","Valor"]
[null,null,"A","Custos Indiretos",{"$f":"BDI!E6","v":2.7000000000000003E-2}]
[null,null,"A.1","Administração Central",{"$f":"BDI!E7","v":2.1600000000000001E-2}]
[null,null,"A.2","Seguros, Garantias e Riscos",{"$f":"BDI!E8","v":5.4000000000000003E-3}]
[null,null,"B","Lucro",{"$f":"BDI!E10","v":3.3399999999999999E-2}]
[null,null,"C","Tributos",{"$f":"SUM(E90:E91)","v":0.124}]
[null,null,"C.1","Tributos Federais (COFINS, PIS e CPRB)",{"$f":"BDI!E18","v":7.3999999999999996E-2}]
[null,null,"C.2","Tributos Distritais (ISS)",{"$f":"BDI!E23","v":0.05},null,null,"* Nota - Utilizou-se o indicado pelo Sindicato da Arquitetura e da Engenharia (Sinaenco, 2008, p. 22), que adota um percentual redutor de 20% no cálculo dos custos tributários relativos às contribuições PIS e COFINS"]
[null,null,"D","Despesas Financeiras",{"$f":"BDI!E13","v":5.6394995474364773E-3}]
[]
[null,null,null,"TOTAL DE BDI",{"$f":"BDI!E26","v":0.21840000000000001},{"$f":"E94*E102","v":956.77764000000013}]
[]
[null,null,null,"QUADRO-RESUMO DO CUSTO MENSAL POR EMPREGADO - SEM O 13º","Valor"]
[null,null,null,"Módulo 1 - Composição da Remuneração",{"$f":"F16","v":1898.58}]
[null,null,null,"Módulo 2 - Encargos e Benefícios Anuais, Mensais e Diários",{"$f":"F45","v":2068.37}]
[null,null,null,"Módulo 3 - Provisão para Rescisão",{"$f":"F55","v":120.92}]
[null,null,null,"Módulo 4 - Custo de Reposição do Profissional Ausente",{"$f":"F73","v":210.63}]
[null,null,null,"Módulo 5 - Insumos Diversos",{"$f":"F82","v":82.35}]
[null,null,null,"SUBTOTAL (A+B+C+D+E)",{"$f":"SUM(E97:E101)","v":4380.8500000000004}]
[null,null,null,"Módulo 6 - Custos Indiretos, Tributos e Lucro",{"$f":"F94","v":956.77764000000013}]
[]
[null,null,null,"TOTAL DO POSTO",{"$f":"SUM(E102:E103)","v":5337.6276400000006}]
[]
[null,"MÓDULO 7 - DESTAQUE DO MÓDULO 2 - 13º SALÁRIO",null,null,"Percentuais","Valor"]
[null,null,"A","13º Salário",{"$f":"'Encargos Sociais'!E32","v":8.3333333333333329E-2},{"$f":"ROUND(E108*F$16,2)","v":158.22}]
[null,null,"B","Encargos Sociais sobre o 13º Salário - Taxa calculada no SUBMÓDULO 2.2",{"$f":"SUM($E$24:$E$32)","v":0.36800000000000005},{"$f":"ROUND(E109*$F$108,2)","v":58.22},null,"* Nota 1 - Provisiona-se, mensalmente, o proporcional a 1/12 dos valores referentes a gratificação natalina e adicional de férias."]
[null,null,"C","BDI sobre o 13º Salário - Taxa calculada no MÓDULO 6",{"$f":"E94","v":0.21840000000000001},{"$f":"ROUND(E110*($F$108+$F$109),2)","v":47.27}]
[]
[null,null,null,"TOTAL DO DESTAQUE DO 13º SALÁRIO",null,{"$f":"SUM(F108:F110)","v":263.70999999999998}]
[]
[null,null,null,"QUADRO-RESUMO DO CUSTO MENSAL POR EMPREGADO","Valor"]
[null,null,null,"Custo total - sem o 13º Salário",{"$f":"E105","v":5337.6276400000006}]
[null,null,null,"Destaque do 13º Salário (valor mensal)",{"$f":"F112","v":263.70999999999998}]
[]
[null,null,null,"TOTAL DO POSTO",{"$f":"E115+E116","v":5601.3376400000006}]

{"sheet":"8","index":11,"n_rows":118,"n_cols":8,"rows_kept":118,"cut":false,"hidden":false,"merged":[[17,1,17,3],[1,1,1,5],[2,1,2,5],[4,1,4,2],[5,1,5,2],[7,1,7,3],[106,1,106,3],[39,3,39,5],[46,1,46,3],[56,1,56,3],[68,3,68,5],[74,1,74,3],[83,1,83,3]]}
[]
[null,"PLANILHA DE ESTIMATIVA DE CUSTOS"]
[null,"Padrão IN 05/2017 e IN 07/2018 - MPDG"]
[]
[null,8,null,{"$f":"HLOOKUP($B$5,'Dados Gerais'!$D$5:$BK$20,6)","v":"SERVENTE COM ADICIONAL DE INSALUBRIDADE"},"QUANTIDADE",{"$f":"HLOOKUP($B$5,'Dados Gerais'!$D$5:$BK$20,10)","v":25}]
[null,"CCT",null,{"$f":"HLOOKUP($B$5,'Dados Gerais'!$D$5:$BK$20,15)","v":"SEAC/DF X SINDISERVIÇOS/DF 2023/2023 Nº DF000037/2023"},"DATA-BASE",{"$f":"HLOOKUP($B$5,'Dados Gerais'!$D$5:$BK$20,16)","v":"2023-01-01"}]
[]
[null,"MÓDULO 1 - COMPOSIÇÃO DA REMUNERAÇÃO",null,null,null,"Valor"]
[null,null,"A","Salário-Base",null,{"$f":"HLOOKUP($B$5,'Dados Gerais'!$D$5:$BK$20,8)","v":1898.58}]
[null,null,"B","Adicional de Periculosidade",null,{"$f":"HLOOKUP($B$5,'Dados Gerais'!$D$5:$BK$37,25)","v":0}]
[null,null,"C","Adicional de Insalubridade",null,{"$f":"HLOOKUP($B$5,'Dados Gerais'!$D$5:$BK$37,31)","v":260.40000000000003}]
[null,null,"D","Adicional Noturno",null,{"$f":"HLOOKUP($B$5,'Dados Gerais'!$D$5:$BK$50,46)","v":0},null,"* Nota 1 - O Módulo 1 refere-se ao valor mensal devido ao empregado pela prestação do serviço no período de 12 meses."]
[null,null,"E","Adicional de Hora Extra",null,{"$f":"HLOOKUP($B$5,'Dados Gerais'!$D$5:$BK$67,63)","v":0},null,"* Nota 2 - O adicional de hora extra no feriado trabalhado foi suprimido pela Lei 13.467/17"]
[null,null,"F","Outros (especificar)",null,{"$f":"HLOOKUP($B$5,'Dados Gerais'!$D$5:$BK$59,33)","v":0},null,"* Nota 3 - ART. 7º, § 2º, DA LEI Nº 605/49.Sendo mensalista o obreiro, o adicional noturno pago de forma fixa já é considerado integrado para os efeitos do pagamento do repouso semanal remunerado, nos termos do art. 7º, § 2º, da Lei nº 605/49."]
[]
[null,null,null,"TOTAL DA REMUNERAÇÃO",null,{"$f":"SUM(F9:F14)","v":2158.98}]
[]
[null,"MÓDULO 2 - ENCARGOS E BENEFÍCIOS ANUAIS, MENSAIS E DIÁRIOS",null,null,"Percentuais","Valor"]
[null,"Submódulo 2.1 - 13º Salário, Férias e Adicional de Férias"]
[null,null,"A","13º Salário - Calculado no Módulo 7 - Destacado",0,{"$f":"ROUND(E20*F$16,2)","v":0}]
[null,null,"B","Férias e Adicional de Férias",{"$f":"'Encargos Sociais'!E31","v":3.03030303030303E-2},{"$f":"ROUND(E21*F$16,2)","v":65.42},null,"* Nota 1 - Provisiona-se, mensalmente, o proporcional a 1/12 dos valores referentes a gratificação natalina, férias e adicional de férias."]
[null,null,null,null,null,null,null,"* Nota 2 - O adicional de férias contido no Submódulo 2.1 corresponde a 1/3 da remuneração que, por sua vez, é dividida por 12 contome Nota 1."]
[null,"Submódulo 2.2 - Encargos Previdenciários (GPS), Fundo de Garantia por Tempo de Serviço (FGTS) e Outras Contribuições"]
[null,null,"A","INSS (art. 22, inciso I, Lei nº 8.212/91)",{"$f":"'Encargos Sociais'!E14","v":0.2},{"$f":"ROUND(E24*($F$16+$F$41+$F$73),2)","v":492.78}]
[null,null,"B","Salário Educação (art. 3º, inciso I, Decreto nº 87.043/82)",{"$f":"'Encargos Sociais'!E15","v":2.5000000000000001E-2},{"$f":"ROUND(E25*($F$16+$F$41+$F$73),2)","v":61.6}]
[null,null,"C","SAT/RAT (art. 22, II, Lei 8.212/91 e Anexo V, Decreto 6.042/07) - Enquadramento 8211-3/00",{"$f":"'Encargos Sociais'!E16","v":0.03},73.92]
[null,null,"D","SESC ou SESI (art. 30, Lei nº 8.036/90 e art. 1º, Lei 8.154/90)",{"$f":"'Encargos Sociais'!E17","v":1.4999999999999999E-2},36.96]
[null,null,"E","SENAI ou SENAC (Decreto nº 2.318/86)",{"$f":"'Encargos Sociais'!E18","v":0.01},24.64]
[null,null,"F","SEBRAE (§ 3º, art. 8º, Lei 8.029/90, alterada pela Lei nº 8.154/90)",{"$f":"'Encargos Sociais'!E19","v":6.0000000000000001E-3},14.78]
[null,null,"G","INCRA (art. 1º, I, Decreto Lei 1.146/70 e Lei 7.787, de 30/06/89)",{"$f":"'Encargos Sociais'!E20","v":2E-3},4.93,null,"* Nota 1 - Os percentuais dos encargos previdenciários, do FGTS e demais contribuições são estabelecidos por legislação vigente."]
[null,null,"H","FGTS (Lei Complementar nº 110/01 e art. 30, Lei nº 8.036/90)",{"$f":"'Encargos Sociais'!E21","v":0.08},197.11,null,"* Nota 2 - O SAT, a depender do grau de risco do serviço, irá variar entre 1%, para risco leve, de 2%, para risco médio, e de 3% para risco grave."]
[null,null,"I","SECONCI (Convenções Coletivas de Trabalho da construção)",{"$f":"'Encargos Sociais'!E22","v":0},0,null,"* Nota 3 - Os percentuais do Submódulo 2.2 incidem sobre o Módulo 1 e o Submódulo 2.1."]
[]
[null,"Submódulo 2.3 - Benefícios Mensais e Diários"]
[null,null,"A","Auxílio Transporte",null,{"$f":"HLOOKUP($B$5,'Dados Gerais'!$D$5:$BK$93,82)","v":241.48}]
[null,null,"B","Auxílio Alimentação",null,{"$f":"HLOOKUP($B$5,'Dados Gerais'!$D$5:$BK$93,89)","v":972}]
[null,null,"C","Assistência Médica e Familiar",null,{"$f":"HLOOKUP($B$5,'Dados Gerais'!$D$5:$BK$101,97)","v":0}]
[null,null,"D","Outros (Seguro de vida e auxílio funeral e auxílio odontológico)",null,{"$f":"HLOOKUP($B$5,'Dados Gerais'!$D$5:$BK$118,114)","v":0},null,"* Nota 1 - O valor informado deverá ser o custo real do benefício (descontado o valor eventualmente pago pelo empregado)."]
[null,null,null,null,null,null,null,"* Nota 2 - Observar a previsão dos benefícios contidos em Acordos, Convenções e Dissídios Coletivos de Trabalho e o disposto no art. 6º da IN 5/2017"]
[null,null,null,"QUADRO-RESUMO DO MÓDULO 2"]
[null,null,null,"2.1 - 13º Salário, Férias e Adicional de Férias - 13º Destacado - Calculado no Módulo 7 ",{"$f":"SUM(E20:E21)","v":3.03030303030303E-2},{"$f":"F20+F21","v":65.42}]
[null,null,null,"2.2 - Encargos Previdenciários (GPS), Fundo de Garantia por Tempo de Serviço (FGTS) e Contribuições",{"$f":"SUM(E24:E32)","v":0.36800000000000005},{"$f":"SUM(F24:F32)","v":906.71999999999991}]
[null,null,null,"2.3 - Benefícios Mensais e Diários",null,{"$f":"SUM(F35:F38)","v":1213.48}]
[]
[null,null,null,"TOTAL DOS ENCARGOS E BENEFÍCIOS",null,{"$f":"SUM(F41:F43)","v":2185.62}]
[]
[null,"MÓDULO 3 - PREVISÃO PARA RESCISÃO",null,null,"Percentuais","Valor"]
[null,null,"A","Aviso Prévio Indenizado (Art. 7º, inciso XXI, da CF/1988 e arts. 477, 487, §1º, e 491 da CLT)",{"$f":"'Encargos Sociais'!E36","v":8.3333333333333332E-3},{"$f":"ROUND(E48*$F$16,2)","v":17.989999999999998}]
[null,null,"B","Incidência do FGTS sobre o Aviso Prévio Indenizado (Súmula 305 TST)",{"$f":"'Encargos Sociais'!E37","v":6.6666666666666664E-4},1.44,null,"* Nota 1 - Adotou-se os parâmetros do estudo do STF (http://www.stf.jus.br/arquivo/cms/sobrestfestudosci/anexo/encargos_sociais_03102007.pdf), onde 5% do pessoal é demitido pelo empregador no decurso do contrato (para estes, considerou-se o aviso prévio indenizado). Desprezou-se as demissões por justa causa e os pedidos de demissão."]
[null,null,"C","Multa do FGTS e Contribuição Social sobre o Aviso Prévio Indenizado (Art. 18, §1º, da Lei 8.036/1990 e art. 1º da LC nº 110/2001)",{"$f":"'Encargos Sociais'!E38","v":7.7170666666666644E-3},16.66,null,"* Nota 2 - No cálculo do percentual, considerou-se 36 dias, correspondendo à metade da duração média dos contratos (2 anos)"]
[null,null,"D","Aviso Prévio Trabalhado (Art. 488, parágrafo único, CLT)",{"$f":"'Encargos Sociais'!E39","v":1.2037037037037035E-2},25.99,null,"* Nota 3 - Incide sobre a Remuneração + 13º salário (1/12) + Férias (1/12) + Adicional de Férias (1/36) x 50% multa (40% para o empregado e 10% de contribuição social) x 8% FGTS"]
[null,null,"E","Incidência de GPS, FGTS e outras contribuições sobre o Aviso Prévio Trabalhado",{"$f":"'Encargos Sociais'!E40","v":4.4296296296296288E-3},9.56,null,"* Nota 4 - Os 95% restantes do cálculo, a um prazo médio de contrato de 4 anos. Assim, calcula-se 7 dias para o 1º ano de contrato e mais 3 dias para os 3 anos seguintes."]
[null,null,"F","Multa do FGTS e Contribuição Social sobre o Aviso Prévio Trabalhado",{"$f":"'Encargos Sociais'!E41","v":3.0505155555555549E-2},65.86]
[]
[null,null,null,"TOTAL DE PREVISÃO PARA RESCISÃO",null,{"$f":"SUM(F48:F53)","v":137.5}]
[]
[null,"MÓDULO 4 - CUSTO DO PROFISSIONAL AUSENTE",null,null,"Percentuais","Valor"]
[null,"Submódulo 4.1 - Ausências Legais"]
[null,null,"A","Férias (Arts. 129 e 130, inc. I, da CLT)",{"$f":"'Encargos Sociais'!E25","v":9.0909090909090912E-2},{"$f":"ROUND(E59*$F$16,2)","v":196.27},null,"* Nota 1 - As alíneas “A” a “F” referem-se somente ao custo que será pago ao repositor pelos dias \ntrabalhados quando da necessidade de substituir a mão de obra alocada na prestação do serviço."]
[null,null,"B","Ausências Legais (Arts. 131 e 473 da CLT)",{"$f":"'Encargos Sociais'!E26","v":7.9365079365079361E-3},17.13,null,"* Nota 2 - Adotou-se a estimativa do SINAPI de 2 dias por ano."]
[null,null,"C","Licença-Paternidade (Art. 7º, XIX, e art. 10, §1º, do ADCT, CF/1988 e Art. 1º, II, da Lei 11.770/2008)",{"$f":"'Encargos Sociais'!E27","v":8.2777777777777776E-4},1.79,null,"* Nota 3 - Utilizada a proporção de 50% para homens, 5 dias de afastamento, e a probabilidade de um trabalhador requerer a Licença Paternidade em 5,22%, conforme SINAPI (citando dados da PNAD 2015)"]
[null,null,"D","Ausência por Acidente de Trabalho (Art. 131, III, da CLT)",{"$f":"'Encargos Sociais'!E28","v":8.541666666666667E-4},1.84,null,"* Nota 4 - Utilzada a estatística de 1,96% dos contribuintes beneficiados com a emissão do auxílio, conforme Anuário Estatístico da Previdência Social. Afastamento de 15 dias a cargo da empresa."]
[null,null,"E","Afastamento Maternidade (Art. 71 da Lei nº 8.213/1991)",{"$f":"'Encargos Sociais'!E29","v":3.2925925925925922E-3},7.11,null,"* Nota 5 - Utilizada a proporção de 50% para mulheres, 180 dias de afastamento, e a probabilidade de uma trabalhadora requerer a Licença Maternidade em 4,91%, conforme SINAPI (citando dados do IBGE 2016)"]
[null,null,"F","Auxílio Enfermidade - Doença (Art. 59 da Lei nº 8.213/1991)",{"$f":"'Encargos Sociais'!E30","v":7.1222222222222225E-3},15.38,null,"* Nota 6 - Utilizada a estatística de 3,37% dos contribuintes beneficiados com o auxílio, conforme Anuário Estatístico da Previdência Social de 2015 (acrescidos de 2 dias ao ano, para os quais o trabalhador nem requer o benefício da Previdência - conforme SINAPI)"]
[]
[null,"Submódulo 4.2 - Intrajornada"]
[null,null,"A","Intervalo para repouso ou alimentação",{"$f":"'Encargos Sociais'!E33","v":0},{"$f":"ROUND(E67*$F$16,2)","v":0}]
[]
[null,null,null,"QUADRO-RESUMO DO MÓDULO 4",null,"Valor"]
[null,null,null,"4.1 - Ausências Legais",{"$f":"SUM(E59:E64)","v":0.11094235810485811},{"$f":"ROUND(E70*$F$16,2)","v":239.52}]
[null,null,null,"4.2 - Intrajornada",{"$f":"E67","v":0},{"$f":"ROUND(E71*$F$16,2)","v":0}]
[]
[null,null,null,"TOTAL DE PREVISÃO PARA RESCISÃO E INTERVALO INTRAJORNADA",null,{"$f":"SUM(F70:F71)","v":239.52}]
[]
[null,"MÓDULO 5 - INSUMOS DIVERSOS",null,null,null,"Valor"]
[null,null,"A","Uniformes - aquisição",null,{"$f":"ROUND(HLOOKUP($B$5,Uniformes!L4:EA6,3)/12,2)","v":43.27}]
[null,null,"B","Materiais de consumo relacionados ao posto - aquisição",null,{"$f":"ROUND(HLOOKUP(B5,'Mat Cons'!I11:DX13,3)/12,2)","v":0}]
[null,null,"C","Materiais permanentes relacionados ao posto - remuneração da sua depreciação / manutenção",null,{"$f":"HLOOKUP(B5,'Mat Perm'!Q11:EF13,3)","v":0}]
[null,null,"D","Equipamentos relacionados ao posto - remuneração da sua depreciação / manutenção",null,{"$f":"HLOOKUP(B5,'Equip Rel'!Q11:EF13,3)","v":0}]
[null,null,"E","Equipamentos de Proteção Individual - EPI - aquisição",null,{"$f":"ROUND(HLOOKUP(B5,EPI!J4:DY6,3)/12,2)","v":39.08}]
[]
[null,null,null,"TOTAL DE INSUMOS DIVERSOS",null,{"$f":"SUM(F76:F81)","v":82.35},null,"* Nota - Valores mensais por empregado"]
[]
[null,"MÓDULO 6 - CUSTOS INDIRETOS, TRIBUTOS E LUCRO - BDI",null,null,"Percentuais","Valor"]
[null,null,"A","Custos Indiretos",{"$f":"BDI!E6","v":2.7000000000000003E-2}]
[null,null,"A.1","Administração Central",{"$f":"BDI!E7","v":2.1600000000000001E-2}]
[null,null,"A.2","Seguros, Garantias e Riscos",{"$f":"BDI!E8","v":5.4000000000000003E-3}]
[null,null,"B","Lucro",{"$f":"BDI!E10","v":3.3399999999999999E-2}]
[null,null,"C","Tributos",{"$f":"SUM(E90:E91)","v":0.124}]
[null,null,"C.1","Tributos Federais (COFINS, PIS e CPRB)",{"$f":"BDI!E18","v":7.3999999999999996E-2}]
[null,null,"C.2","Tributos Distritais (ISS)",{"$f":"BDI!E23","v":0.05},null,null,"* Nota - Utilizou-se o indicado pelo Sindicato da Arquitetura e da Engenharia (Sinaenco, 2008, p. 22), que adota um percentual redutor de 20% no cálculo dos custos tributários relativos às contribuições PIS e COFINS"]
[null,null,"D","Despesas Financeiras",{"$f":"BDI!E13","v":5.6394995474364773E-3}]
[]
[null,null,null,"TOTAL DE BDI",{"$f":"BDI!E26","v":0.21840000000000001},{"$f":"E94*E102","v":1049.1870480000002}]
[]
[null,null,null,"QUADRO-RESUMO DO CUSTO MENSAL POR EMPREGADO - SEM O 13º","Valor"]
[null,null,null,"Módulo 1 - Composição da Remuneração",{"$f":"F16","v":2158.98}]
[null,null,null,"Módulo 2 - Encargos e Benefícios Anuais, Mensais e Diários",{"$f":"F45","v":2185.62}]
[null,null,null,"Módulo 3 - Provisão para Rescisão",{"$f":"F55","v":137.5}]
[null,null,null,"Módulo 4 - Custo de Reposição do Profissional Ausente",{"$f":"F73","v":239.52}]
[null,null,null,"Módulo 5 - Insumos Diversos",{"$f":"F82","v":82.35}]
[null,null,null,"SUBTOTAL (A+B+C+D+E)",{"$f":"SUM(E97:E101)","v":4803.9700000000012}]
[null,null,null,"Módulo 6 - Custos Indiretos, Tributos e Lucro",{"$f":"F94","v":1049.1870480000002}]
[]
[null,null,null,"TOTAL DO POSTO",{"$f":"SUM(E102:E103)","v":5853.1570480000009}]
[]
[null,"MÓDULO 7 - DESTAQUE DO MÓDULO 2 - 13º SALÁRIO",null,null,"Percentuais","Valor"]
[null,null,"A","13º Salário",{"$f":"'Encargos Sociais'!E32","v":8.3333333333333329E-2},{"$f":"ROUND(E108*F$16,2)","v":179.92}]
[null,null,"B","Encargos Sociais sobre o 13º Salário - Taxa calculada no SUBMÓDULO 2.2",{"$f":"SUM($E$24:$E$32)","v":0.36800000000000005},{"$f":"ROUND(E109*$F$108,2)","v":66.209999999999994},null,"* Nota 1 - Provisiona-se, mensalmente, o proporcional a 1/12 dos valores referentes a gratificação natalina e adicional de férias."]
[null,null,"C","BDI sobre o 13º Salário - Taxa calculada no MÓDULO 6",{"$f":"E94","v":0.21840000000000001},{"$f":"ROUND(E110*($F$108+$F$109),2)","v":53.75}]
[]
[null,null,null,"TOTAL DO DESTAQUE DO 13º SALÁRIO",null,{"$f":"SUM(F108:F110)","v":299.88}]
[]
[null,null,null,"QUADRO-RESUMO DO CUSTO MENSAL POR EMPREGADO","Valor"]
[null,null,null,"Custo total - sem o 13º Salário",{"$f":"E105","v":5853.1570480000009}]
[null,null,null,"Destaque do 13º Salário (valor mensal)",{"$f":"F112","v":299.88}]
[]
[null,null,null,"TOTAL DO POSTO",{"$f":"E115+E116","v":6153.0370480000011}]

{"sheet":"9","index":12,"n_rows":118,"n_cols":8,"rows_kept":118,"cut":false,"hidden":false,"merged":[[17,1,17,3],[1,1,1,5],[2,1,2,5],[4,1,4,2],[5,1,5,2],[7,1,7,3],[106,1,106,3],[39,3,39,5],[46,1,46,3],[56,1,56,3],[68,3,68,5],[74,1,74,3],[83,1,83,3]]}
[]
[null,"PLANILHA DE ESTIMATIVA DE CUSTOS"]
[null,"Padrão IN 05/2017 e IN 07/2018 - MPDG"]
[]
[null,9,null,{"$f":"HLOOKUP($B$5,'Dados Gerais'!$D$5:$BK$20,6)","v":"SERVENTE COM ADICIONAL DE INSALUBRIDADE E ADICIONAL NOTURNO"},"QUANTIDADE",{"$f":"HLOOKUP($B$5,'Dados Gerais'!$D$5:$BK$20,10)","v":2}]
[null,"CCT",null,{"$f":"HLOOKUP($B$5,'Dados Gerais'!$D$5:$BK$20,15)","v":"SEAC/DF X SINDISERVIÇOS/DF 2023/2023 Nº DF000037/2023"},"DATA-BASE",{"$f":"HLOOKUP($B$5,'Dados Gerais'!$D$5:$BK$20,16)","v":"2023-01-01"}]
[]
[null,"MÓDULO 1 - COMPOSIÇÃO DA REMUNERAÇÃO",null,null,null,"Valor"]
[null,null,"A","Salário-Base",null,{"$f":"HLOOKUP($B$5,'Dados Gerais'!$D$5:$BK$20,8)","v":1898.58}]
[null,null,"B","Adicional de Periculosidade",null,{"$f":"HLOOKUP($B$5,'Dados Gerais'!$D$5:$BK$37,25)","v":0}]
[null,null,"C","Adicional de Insalubridade",null,{"$f":"HLOOKUP($B$5,'Dados Gerais'!$D$5:$BK$37,31)","v":260.40000000000003}]
[null,null,"D","Adicional Noturno",null,{"$f":"HLOOKUP($B$5,'Dados Gerais'!$D$5:$BK$50,46)","v":54.43},null,"* Nota 1 - O Módulo 1 refere-se ao valor mensal devido ao empregado pela prestação do serviço no período de 12 meses."]
[null,null,"E","Adicional de Hora Extra",null,{"$f":"HLOOKUP($B$5,'Dados Gerais'!$D$5:$BK$67,63)","v":0},null,"* Nota 2 - O adicional de hora extra no feriado trabalhado foi suprimido pela Lei 13.467/17"]
[null,null,"F","Outros (especificar)",null,{"$f":"HLOOKUP($B$5,'Dados Gerais'!$D$5:$BK$59,33)","v":0},null,"* Nota 3 - ART. 7º, § 2º, DA LEI Nº 605/49.Sendo mensalista o obreiro, o adicional noturno pago de forma fixa já é considerado integrado para os efeitos do pagamento do repouso semanal remunerado, nos termos do art. 7º, § 2º, da Lei nº 605/49."]
[]
[null,null,null,"TOTAL DA REMUNERAÇÃO",null,{"$f":"SUM(F9:F14)","v":2213.41}]
[]
[null,"MÓDULO 2 - ENCARGOS E BENEFÍCIOS ANUAIS, MENSAIS E DIÁRIOS",null,null,"Percentuais","Valor"]
[null,"Submódulo 2.1 - 13º Salário, Férias e Adicional de Férias"]
[null,null,"A","13º Salário - Calculado no Módulo 7 - Destacado",0,{"$f":"ROUND(E20*F$16,2)","v":0}]
[null,null,"B","Férias e Adicional de Férias",{"$f":"'Encargos Sociais'!E31","v":3.03030303030303E-2},{"$f":"ROUND(E21*F$16,2)","v":67.069999999999993},null,"* Nota 1 - Provisiona-se, mensalmente, o proporcional a 1/12 dos valores referentes a gratificação natalina, férias e adicional de férias."]
[null,null,null,null,null,null,null,"* Nota 2 - O adicional de férias contido no Submódulo 2.1 corresponde a 1/3 da remuneração que, por sua vez, é dividida por 12 contome Nota 1."]
[null,"Submódulo 2.2 - Encargos Previdenciários (GPS), Fundo de Garantia por Tempo de Serviço (FGTS) e Outras Contribuições"]
[null,null,"A","INSS (art. 22, inciso I, Lei nº 8.212/91)",{"$f":"'Encargos Sociais'!E14","v":0.2},{"$f":"ROUND(E24*($F$16+$F$41+$F$73),2)","v":505.21}]
[null,null,"B","Salário Educação (art. 3º, inciso I, Decreto nº 87.043/82)",{"$f":"'Encargos Sociais'!E15","v":2.5000000000000001E-2},{"$f":"ROUND(E25*($F$16+$F$41+$F$73),2)","v":63.15}]
[null,null,"C","SAT/RAT (art. 22, II, Lei 8.212/91 e Anexo V, Decreto 6.042/07) - Enquadramento 8211-3/00",{"$f":"'Encargos Sociais'!E16","v":0.03},75.78]
[null,null,"D","SESC ou SESI (art. 30, Lei nº 8.036/90 e art. 1º, Lei 8.154/90)",{"$f":"'Encargos Sociais'!E17","v":1.4999999999999999E-2},37.89]
[null,null,"E","SENAI ou SENAC (Decreto nº 2.318/86)",{"$f":"'Encargos Sociais'!E18","v":0.01},25.26]
[null,null,"F","SEBRAE (§ 3º, art. 8º, Lei 8.029/90, alterada pela Lei nº 8.154/90)",{"$f":"'Encargos Sociais'!E19","v":6.0000000000000001E-3},15.16]
[null,null,"G","INCRA (art. 1º, I, Decreto Lei 1.146/70 e Lei 7.787, de 30/06/89)",{"$f":"'Encargos Sociais'!E20","v":2E-3},5.05,null,"* Nota 1 - Os percentuais dos encargos previdenciários, do FGTS e demais contribuições são estabelecidos por legislação vigente."]
[null,null,"H","FGTS (Lei Complementar nº 110/01 e art. 30, Lei nº 8.036/90)",{"$f":"'Encargos Sociais'!E21","v":0.08},202.08,null,"* Nota 2 - O SAT, a depender do grau de risco do serviço, irá variar entre 1%, para risco leve, de 2%, para risco médio, e de 3% para risco grave."]
[null,null,"I","SECONCI (Convenções Coletivas de Trabalho da construção)",{"$f":"'Encargos Sociais'!E22","v":0},0,null,"* Nota 3 - Os percentuais do Submódulo 2.2 incidem sobre o Módulo 1 e o Submódulo 2.1."]
[]
[null,"Submódulo 2.3 - Benefícios Mensais e Diários"]
[null,null,"A","Auxílio Transporte",null,{"$f":"HLOOKUP($B$5,'Dados Gerais'!$D$5:$BK$93,82)","v":241.48}]
[null,null,"B","Auxílio Alimentação",null,{"$f":"HLOOKUP($B$5,'Dados Gerais'!$D$5:$BK$93,89)","v":972}]
[null,null,"C","Assistência Médica e Familiar",null,{"$f":"HLOOKUP($B$5,'Dados Gerais'!$D$5:$BK$101,97)","v":0}]
[null,null,"D","Outros (Seguro de vida e auxílio funeral e auxílio odontológico)",null,{"$f":"HLOOKUP($B$5,'Dados Gerais'!$D$5:$BK$118,114)","v":0},null,"* Nota 1 - O valor informado deverá ser o custo real do benefício (descontado o valor eventualmente pago pelo empregado)."]
[null,null,null,null,null,null,null,"* Nota 2 - Observar a previsão dos benefícios contidos em Acordos, Convenções e Dissídios Coletivos de Trabalho e o disposto no art. 6º da IN 5/2017"]
[null,null,null,"QUADRO-RESUMO DO MÓDULO 2"]
[null,null,null,"2.1 - 13º Salário, Férias e Adicional de Férias - 13º Destacado - Calculado no Módulo 7 ",{"$f":"SUM(E20:E21)","v":3.03030303030303E-2},{"$f":"F20+F21","v":67.069999999999993}]
[null,null,null,"2.2 - Encargos Previdenciários (GPS), Fundo de Garantia por Tempo de Serviço (FGTS) e Contribuições",{"$f":"SUM(E24:E32)","v":0.36800000000000005},{"$f":"SUM(F24:F32)","v":929.57999999999993}]
[null,null,null,"2.3 - Benefícios Mensais e Diários",null,{"$f":"SUM(F35:F38)","v":1213.48}]
[]
[null,null,null,"TOTAL DOS ENCARGOS E BENEFÍCIOS",null,{"$f":"SUM(F41:F43)","v":2210.13}]
[]
[null,"MÓDULO 3 - PREVISÃO PARA RESCISÃO",null,null,"Percentuais","Valor"]
[null,null,"A","Aviso Prévio Indenizado (Art. 7º, inciso XXI, da CF/1988 e arts. 477, 487, §1º, e 491 da CLT)",{"$f":"'Encargos Sociais'!E36","v":8.3333333333333332E-3},{"$f":"ROUND(E48*$F$16,2)","v":18.45}]
[null,null,"B","Incidência do FGTS sobre o Aviso Prévio Indenizado (Súmula 305 TST)",{"$f":"'Encargos Sociais'!E37","v":6.6666666666666664E-4},1.48,null,"* Nota 1 - Adotou-se os parâmetros do estudo do STF (http://www.stf.jus.br/arquivo/cms/sobrestfestudosci/anexo/encargos_sociais_03102007.pdf), onde 5% do pessoal é demitido pelo empregador no decurso do contrato (para estes, considerou-se o aviso prévio indenizado). Desprezou-se as demissões por justa causa e os pedidos de demissão."]
[null,null,"C","Multa do FGTS e Contribuição Social sobre o Aviso Prévio Indenizado (Art. 18, §1º, da Lei 8.036/1990 e art. 1º da LC nº 110/2001)",{"$f":"'Encargos Sociais'!E38","v":7.7170666666666644E-3},17.079999999999998,null,"* Nota 2 - No cálculo do percentual, considerou-se 36 dias, correspondendo à metade da duração média dos contratos (2 anos)"]
[null,null,"D","Aviso Prévio Trabalhado (Art. 488, parágrafo único, CLT)",{"$f":"'Encargos Sociais'!E39","v":1.2037037037037035E-2},26.64,null,"* Nota 3 - Incide sobre a Remuneração + 13º salário (1/12) + Férias (1/12) + Adicional de Férias (1/36) x 50% multa (40% para o empregado e 10% de contribuição social) x 8% FGTS"]
[null,null,"E","Incidência de GPS, FGTS e outras contribuições sobre o Aviso Prévio Trabalhado",{"$f":"'Encargos Sociais'!E40","v":4.4296296296296288E-3},9.8000000000000007,null,"* Nota 4 - Os 95% restantes do cálculo, a um prazo médio de contrato de 4 anos. Assim, calcula-se 7 dias para o 1º ano de contrato e mais 3 dias para os 3 anos seguintes."]
[null,null,"F","Multa do FGTS e Contribuição Social sobre o Aviso Prévio Trabalhado",{"$f":"'Encargos Sociais'!E41","v":3.0505155555555549E-2},67.52]
[]
[null,null,null,"TOTAL DE PREVISÃO PARA RESCISÃO",null,{"$f":"SUM(F48:F53)","v":140.97}]
[]
[null,"MÓDULO 4 - CUSTO DO PROFISSIONAL AUSENTE",null,null,"Percentuais","Valor"]
[null,"Submódulo 4.1 - Ausências Legais"]
[null,null,"A","Férias (Arts. 129 e 130, inc. I, da CLT)",{"$f":"'Encargos Sociais'!E25","v":9.0909090909090912E-2},{"$f":"ROUND(E59*$F$16,2)","v":201.22},null,"* Nota 1 - As alíneas “A” a “F” referem-se somente ao custo que será pago ao repositor pelos dias \ntrabalhados quando da necessidade de substituir a mão de obra alocada na prestação do serviço."]
[null,null,"B","Ausências Legais (Arts. 131 e 473 da CLT)",{"$f":"'Encargos Sociais'!E26","v":7.9365079365079361E-3},17.57,null,"* Nota 2 - Adotou-se a estimativa do SINAPI de 2 dias por ano."]
[null,null,"C","Licença-Paternidade (Art. 7º, XIX, e art. 10, §1º, do ADCT, CF/1988 e Art. 1º, II, da Lei 11.770/2008)",{"$f":"'Encargos Sociais'!E27","v":8.2777777777777776E-4},1.83,null,"* Nota 3 - Utilizada a proporção de 50% para homens, 5 dias de afastamento, e a probabilidade de um trabalhador requerer a Licença Paternidade em 5,22%, conforme SINAPI (citando dados da PNAD 2015)"]
[null,null,"D","Ausência por Acidente de Trabalho (Art. 131, III, da CLT)",{"$f":"'Encargos Sociais'!E28","v":8.541666666666667E-4},1.89,null,"* Nota 4 - Utilzada a estatística de 1,96% dos contribuintes beneficiados com a emissão do auxílio, conforme Anuário Estatístico da Previdência Social. Afastamento de 15 dias a cargo da empresa."]
[null,null,"E","Afastamento Maternidade (Art. 71 da Lei nº 8.213/1991)",{"$f":"'Encargos Sociais'!E29","v":3.2925925925925922E-3},7.29,null,"* Nota 5 - Utilizada a proporção de 50% para mulheres, 180 dias de afastamento, e a probabilidade de uma trabalhadora requerer a Licença Maternidade em 4,91%, conforme SINAPI (citando dados do IBGE 2016)"]
[null,null,"F","Auxílio Enfermidade - Doença (Art. 59 da Lei nº 8.213/1991)",{"$f":"'Encargos Sociais'!E30","v":7.1222222222222225E-3},15.76,null,"* Nota 6 - Utilizada a estatística de 3,37% dos contribuintes beneficiados com o auxílio, conforme Anuário Estatístico da Previdência Social de 2015 (acrescidos de 2 dias ao ano, para os quais o trabalhador nem requer o benefício da Previdência - conforme SINAPI)"]
[]
[null,"Submódulo 4.2 - Intrajornada"]
[null,null,"A","Intervalo para repouso ou alimentação",{"$f":"'Encargos Sociais'!E33","v":0},{"$f":"ROUND(E67*$F$16,2)","v":0}]
[]
[null,null,null,"QUADRO-RESUMO DO MÓDULO 4",null,"Valor"]
[null,null,null,"4.1 - Ausências Legais",{"$f":"SUM(E59:E64)","v":0.11094235810485811},{"$f":"ROUND(E70*$F$16,2)","v":245.56}]
[null,null,null,"4.2 - Intrajornada",{"$f":"E67","v":0},{"$f":"ROUND(E71*$F$16,2)","v":0}]
[]
[null,null,null,"TOTAL DE PREVISÃO PARA RESCISÃO E INTERVALO INTRAJORNADA",null,{"$f":"SUM(F70:F71)","v":245.56}]
[]
[null,"MÓDULO 5 - INSUMOS DIVERSOS",null,null,null,"Valor"]
[null,null,"A","Uniformes - aquisição",null,{"$f":"ROUND(HLOOKUP($B$5,Uniformes!L4:EA6,3)/12,2)","v":43.27}]
[null,null,"B","Materiais de consumo relacionados ao posto - aquisição",null,{"$f":"ROUND(HLOOKUP(B5,'Mat Cons'!I11:DX13,3)/12,2)","v":0}]
[null,null,"C","Materiais permanentes relacionados ao posto - remuneração da sua depreciação / manutenção",null,{"$f":"HLOOKUP(B5,'Mat Perm'!Q11:EF13,3)","v":0}]
[null,null,"D","Equipamentos relacionados ao posto - remuneração da sua depreciação / manutenção",null,{"$f":"HLOOKUP(B5,'Equip Rel'!Q11:EF13,3)","v":0}]
[null,null,"E","Equipamentos de Proteção Individual - EPI - aquisição",null,{"$f":"ROUND(HLOOKUP(B5,EPI!J4:DY6,3)/12,2)","v":39.08}]
[]
[null,null,null,"TOTAL DE INSUMOS DIVERSOS",null,{"$f":"SUM(F76:F81)","v":82.35},null,"* Nota - Valores mensais por empregado"]
[]
[null,"MÓDULO 6 - CUSTOS INDIRETOS, TRIBUTOS E LUCRO - BDI",null,null,"Percentuais","Valor"]
[null,null,"A","Custos Indiretos",{"$f":"BDI!E6","v":2.7000000000000003E-2}]
[null,null,"A.1","Administração Central",{"$f":"BDI!E7","v":2.1600000000000001E-2}]
[null,null,"A.2","Seguros, Garantias e Riscos",{"$f":"BDI!E8","v":5.4000000000000003E-3}]
[null,null,"B","Lucro",{"$f":"BDI!E10","v":3.3399999999999999E-2}]
[null,null,"C","Tributos",{"$f":"SUM(E90:E91)","v":0.124}]
[null,null,"C.1","Tributos Federais (COFINS, PIS e CPRB)",{"$f":"BDI!E18","v":7.3999999999999996E-2}]
[null,null,"C.2","Tributos Distritais (ISS)",{"$f":"BDI!E23","v":0.05},null,null,"* Nota - Utilizou-se o indicado pelo Sindicato da Arquitetura e da Engenharia (Sinaenco, 2008, p. 22), que adota um percentual redutor de 20% no cálculo dos custos tributários relativos às contribuições PIS e COFINS"]
[null,null,"D","Despesas Financeiras",{"$f":"BDI!E13","v":5.6394995474364773E-3}]
[]
[null,null,null,"TOTAL DE BDI",{"$f":"BDI!E26","v":0.21840000000000001},{"$f":"E94*E102","v":1068.5045280000002}]
[]
[null,null,null,"QUADRO-RESUMO DO CUSTO MENSAL POR EMPREGADO - SEM O 13º","Valor"]
[null,null,null,"Módulo 1 - Composição da Remuneração",{"$f":"F16","v":2213.41}]
[null,null,null,"Módulo 2 - Encargos e Benefícios Anuais, Mensais e Diários",{"$f":"F45","v":2210.13}]
[null,null,null,"Módulo 3 - Provisão para Rescisão",{"$f":"F55","v":140.97}]
[null,null,null,"Módulo 4 - Custo de Reposição do Profissional Ausente",{"$f":"F73","v":245.56}]
[null,null,null,"Módulo 5 - Insumos Diversos",{"$f":"F82","v":82.35}]
[null,null,null,"SUBTOTAL (A+B+C+D+E)",{"$f":"SUM(E97:E101)","v":4892.420000000001}]
[null,null,null,"Módulo 6 - Custos Indiretos, Tributos e Lucro",{"$f":"F94","v":1068.5045280000002}]
[]
[null,null,null,"TOTAL DO POSTO",{"$f":"SUM(E102:E103)","v":5960.9245280000014}]
[]
[null,"MÓDULO 7 - DESTAQUE DO MÓDULO 2 - 13º SALÁRIO",null,null,"Percentuais","Valor"]
[null,null,"A","13º Salário",{"$f":"'Encargos Sociais'!E32","v":8.3333333333333329E-2},{"$f":"ROUND(E108*F$16,2)","v":184.45}]
[null,null,"B","Encargos Sociais sobre o 13º Salário - Taxa calculada no SUBMÓDULO 2.2",{"$f":"SUM($E$24:$E$32)","v":0.36800000000000005},{"$f":"ROUND(E109*$F$108,2)","v":67.88},null,"* Nota 1 - Provisiona-se, mensalmente, o proporcional a 1/12 dos valores referentes a gratificação natalina e adicional de férias."]
[null,null,"C","BDI sobre o 13º Salário - Taxa calculada no MÓDULO 6",{"$f":"E94","v":0.21840000000000001},{"$f":"ROUND(E110*($F$108+$F$109),2)","v":55.11}]
[]
[null,null,null,"TOTAL DO DESTAQUE DO 13º SALÁRIO",null,{"$f":"SUM(F108:F110)","v":307.44}]
[]
[null,null,null,"QUADRO-RESUMO DO CUSTO MENSAL POR EMPREGADO","Valor"]
[null,null,null,"Custo total - sem o 13º Salário",{"$f":"E105","v":5960.9245280000014}]
[null,null,null,"Destaque do 13º Salário (valor mensal)",{"$f":"F112","v":307.44}]
[]
[null,null,null,"TOTAL DO POSTO",{"$f":"E115+E116","v":6268.364528000001}]

{"sheet":"Dados Gerais","index":13,"n_rows":118,"n_cols":63,"rows_kept":118,"cut":false,"hidden":false,"merged":[[2,1,2,2]]}
[]
[]
[null,"INFORMAÇÕES DE ENTRADA"]
[]
[null,null,null,1,2,3,4,5,6,7,8,9,10,11,12,13,14,15,16,17,18,19,20,21,22,23,24,25,26,27,28,29,30,31,32,33,34,35,36,37,38,39,40,41,42,43,44,45,46,47,48,49,50,51,52,53,54,55,56,57,58,59,60]
[null,"",null,"CARGO 1","CARGO 2","CARGO 3","CARGO 4","CARGO 5","CARGO 6","CARGO 7","CARGO 8","CARGO 9","CARGO 10","CARGO 11","CARGO 12","CARGO 13","CARGO 14","CARGO 15","CARGO 16","CARGO 17","CARGO 18","CARGO 19","CARGO 20","CARGO 21","CARGO 22","CARGO 23","CARGO 24","CARGO 25","CARGO 26","CARGO 27","CARGO 28","CARGO 29","CARGO 30","CARGO 31","CARGO 32","CARGO 33","CARGO 34","CARGO 35","CARGO 36","CARGO 37","CARGO 38","CARGO 39","CARGO 40","CARGO 41","CARGO 42","CARGO 43","CARGO 44","CARGO 45","CARGO 46","CARGO 47","CARGO 48","CARGO 49","CARGO 50","CARGO 51","CARGO 52","CARGO 53","CARGO 54","CARGO 55","CARGO 56","CARGO 57","CARGO 58","CARGO 59","CARGO 60"]
[null,"INFORMAÇÕES BÁSICAS"]
[]
[null,"DESCRIÇÃO DOS POSTOS DE SERVIÇO"]
[null,null,null,"ENCARREGADO GERAL","ENCARREGADO SETORIAL","ENCARREGADO DE SERVIÇO","ENCARREGADO DE SERVIÇO COM ADICIONAL DE INSALUBRIDADE","AUXILIAR DE ENCARREGADO","ALMOXARIFE","SERVENTE","SERVENTE COM ADICIONAL DE INSALUBRIDADE","SERVENTE COM ADICIONAL DE INSALUBRIDADE E ADICIONAL NOTURNO"]
[null,"REMUNERAÇÕES"]
[null,null,null,7376.1,3951.73,3317.57,{"$f":"F12","v":3317.57},2244.21,2686.07,1898.58,{"$f":"J12","v":1898.58},{"$f":"K12","v":1898.58}]
[null,"QUANTIDADE DE POSTOS"]
[null,null,null,1,1,{"$f":"15-G14","v":13},2,1,2,{"$f":"178-K14-L14","v":151},25,2]
[null,"JORNADA"]
[null,null,"HORAS",220,{"$f":"44*5","v":220},220,220,220,220,220,220,220]
[null,null,"DIAS/MÊS",24,24,24,24,24,24,24,24,24]
[null,"CCT UTILIZADA"]
[null,null,"SINDICATOS E REFERÊNCIA","SEAC/DF X SINDISERVIÇOS/DF 2023/2023 Nº DF000037/2023","SEAC/DF X SINDISERVIÇOS/DF 2023/2023 Nº DF000037/2023","SEAC/DF X SINDISERVIÇOS/DF 2023/2023 Nº DF000037/2023","SEAC/DF X SINDISERVIÇOS/DF 2023/2023 Nº DF000037/2023","SEAC/DF X SINDISERVIÇOS/DF 2023/2023 Nº DF000037/2023","SEAC/DF X SINDISERVIÇOS/DF 2023/2023 Nº DF000037/2023","SEAC/DF X SINDISERVIÇOS/DF 2023/2023 Nº DF000037/2023","SEAC/DF X SINDISERVIÇOS/DF 2023/2023 Nº DF000037/2023","SEAC/DF X SINDISERVIÇOS/DF 2023/2023 Nº DF000037/2023"]
[null,null,"DATA-BASE","2023-01-01","2023-01-01","2023-01-01","2023-01-01","2023-01-01","2023-01-01","2023-01-01","2023-01-01","2023-01-01"]
[]
[null,"ADICIONAIS LEGAIS E GRATIFICAÇÕES"]
[]
[null,"PERICULOSIDADE (PERCENTUAL)"]
[null,null,null,0,0,0,0,0,0,0,0,0]
[null,"BASE DE CÁLCULO DO ADICIONAL DE PERICULOSIDADE (SALÁRIO BÁSICO)"]
[null,null,null,{"$f":"D12","v":7376.1},2386.75,2386.75,2386.75,2386.75,2386.75,2386.75,2386.75,2386.75]
[null,"VALOR MENSAL DO ADICIONAL DE PERICULOSIDADE"]
[null,null,null,{"$f":"ROUND(D25*D12,2)","v":0},0,0,0,0,0,0,0,0]
[null,"INSALUBRIDADE (PERCENTUAL)"]
[null,null,null,0,0,0,0.2,0,0,0,0.2,0.2]
[null,"BASE DE CÁLCULO DO ADICIONAL DE INSALUBRIDADE (SALÁRIO MÍNIMO LEGAL)"]
[null,null,null,1302,{"$f":"D33","v":1302},{"$f":"E33","v":1302},1302,1302,1302,1302,1302,1302]
[null,"VALOR MENSAL DO ADICIONAL DE INSALUBRIDADE"]
[null,null,null,{"$f":"D31*D33","v":0},0,0,{"$f":"G31*G33","v":260.40000000000003},{"$f":"H31*H33","v":0},0,0,{"$f":"K31*K33","v":260.40000000000003},{"$f":"L31*L33","v":260.40000000000003}]
[null,"GRATIFICAÇÃO - VALOR MENSAL (R$)"]
[null,null,null,0,0,0,0,0,0,0,0,0]
[]
[null,"ADICIONAL NOTURNO"]
[]
[null,"INCIDÊNCIA (PERCENTUAL CONFORME CCT)"]
[null,null,null,0.2,{"$f":"D42","v":0.2},{"$f":"E42","v":0.2},0.2,0.2,0.2,0.2,0.2,0.2]
[null,"HORAS REAIS POR DIA"]
[null,null,null,0,0,0,0,0,0,0,0,{"$f":"7*52/360","v":1.0111111111111111}]
[null,"HORAS FICTAS POR DIA"]
[null,null,null,{"$f":"D44*8/7","v":0},0,{"$f":"F44*8/7","v":0},{"$f":"G44*8/7","v":0},0,0,0,{"$f":"K44*8/7","v":0},1.1555555555555554]
[null,"BASE DE CÁLCULO DO ADICIONAL NOTURNO (INCLUINDO ADICIONAIS E GRATIFICAÇÕES)"]
[null,null,null,{"$f":"D12+D29+D35+D37","v":7376.1},{"$f":"E12+E29+E35+E37","v":3951.73},{"$f":"F12+F29+F35+F37","v":3317.57},{"$f":"G12+G29+G35+G37","v":3577.9700000000003},{"$f":"H12+H29+H35+H37","v":2244.21},2686.07,1898.58,{"$f":"K12+K29+K35+K37","v":2158.98},{"$f":"L12+L29+L35+L37","v":2158.98}]
[null,"VALOR MENSAL DO ADICIONAL NOTURNO (HORA NORMAL + HORA REDUZIDA) - POR POSTO"]
[null,null,null,{"$f":"ROUND(D46*D17*D42*D48/D16,2)","v":0},{"$f":"ROUND(E46*E17*E42*E48/E16,2)","v":0},{"$f":"ROUND(F46*F17*F42*F48/F16,2)","v":0},{"$f":"ROUND(G46*G17*G42*G48/G16,2)","v":0},0,0,0,{"$f":"ROUND(K46*K17*K42*K48/K16,2)","v":0},{"$f":"ROUND(L46*L17*L42*L48/L16,2)","v":54.43}]
[]
[null,"ADICIONAL DE HORA EXTRA"]
[]
[null,"INCIDÊNCIA (PERCENTUAL 1)"]
[null,null,null,0.5,0.5,0.5,0.5,0.5,0.5,0.5,0.5,0.5]
[null,"HORAS EXTRAS POR MÊS (PERCENTUAL 1)"]
[null,null,null,0,0,0,0,0,0,0,0,0]
[null,"VALOR MENSAL DO ADICIONAL DE HORAS EXTRAS (PERCENTUAL 1) - POR POSTO"]
[null,null,null,{"$f":"ROUND(D57*D55*D12/D16,2)","v":0},0,0,0,0,0,0,0,0]
[null,"INCIDÊNCIA (PERCENTUAL 2)"]
[null,null,null,1,1,1,1,1,1,1,1,1]
[null,"HORAS EXTRAS POR MÊS (PERCENTUAL 2)"]
[null,null,null,0,0,0,0,0,0,0,0,0]
[null,"VALOR MENSAL DO ADICIONAL DE HORAS EXTRAS (PERCENTUAL 2) - POR POSTO"]
[null,null,null,{"$f":"ROUND(D63*D61*D12/D16,2)","v":0},0,0,0,0,0,0,0,0]
[null,"TOTAL MENSAL DOS ADICIONAIS DE HORAS EXTRAS - POR POSTO"]
[null,null,null,{"$f":"D65+D59","v":0},0,0,0,0,0,0,0,0]
[]
[null,"BENEFÍCIOS COMUNS - AUXÍLIO TRANSPORTE"]
[]
[null,"DISTRIBUIÇÃO ESTIMADA DE PROCEDÊNCIA"]
[null,null,"Cidade-satélite",0.68,0.68,0.68,0.68,0.68,0.68,0.68,0.68,0.68]
[null,null,"Região do entorno",0.32,0.32,0.32,0.32,0.32,0.32,0.32,0.32,0.32]
[null,null,"Esplanada - apenas para os que vêm do entorno",{"$f":"D73","v":0.32},{"$f":"E73","v":0.32},0.32,{"$f":"G73","v":0.32},0.32,0.32,0.32,{"$f":"K73","v":0.32},0.32]
[null,"VALORES DOS VALES"]
[null,null,"Cidade-satélite",5.5,{"$f":"D76","v":5.5},{"$f":"E76","v":5.5},{"$f":"F76","v":5.5},{"$f":"G76","v":5.5},{"$f":"H76","v":5.5},{"$f":"I76","v":5.5},{"$f":"J76","v":5.5},{"$f":"K76","v":5.5}]
[null,null,"Região do entorno",8.6999999999999993,8.6999999999999993,8.6999999999999993,8.6999999999999993,8.6999999999999993,8.6999999999999993,8.6999999999999993,8.6999999999999993,8.6999999999999993]
[null,null,"Esplanada",2.75,2.75,2.75,2.75,2.75,2.75,2.75,2.75,2.75]
[null,"VALOR MENSAL BRUTO DE PAGAMENTO - POR POSTO"]
[null,null,null,{"$f":"ROUND((D72*D76+D73*D77+D74*D78)*2*D17,2)","v":355.39},{"$f":"ROUND((E72*E76+E73*E77+E74*E78)*2*E17,2)","v":355.39},355.39,{"$f":"ROUND((G72*G76+G73*G77+G74*G78)*2*G17,2)","v":355.39},355.39,355.39,355.39,{"$f":"ROUND((K72*K76+K73*K77+K74*K78)*2*K17,2)","v":355.39},355.39]
[null,"PERCENTUAL DE DESCONTO"]
[null,null,null,0.06,0.06,0.06,0.06,0.06,0.06,0.06,0.06,0.06]
[null,"VALOR MENSAL DO DESCONTO - POR POSTO"]
[null,null,null,{"$f":"ROUND(D82*D12,2)","v":442.57},{"$f":"ROUND(E82*E12,2)","v":237.1},{"$f":"ROUND(F82*F12,2)","v":199.05},{"$f":"ROUND(G82*G12,2)","v":199.05},134.65,161.16,113.91,{"$f":"ROUND(K82*K12,2)","v":113.91},113.91]
[null,"VALOR MENSAL LÍQUIDO DO VALE TRANSPORTE - POR POSTO"]
[null,null,null,{"$f":"IF(D80>D84,D80-D84,0)","v":0},118.28999999999999,{"$f":"IF(F80>F84,F80-F84,0)","v":156.33999999999997},{"$f":"IF(G80>G84,G80-G84,0)","v":156.33999999999997},220.73999999999998,194.23,241.48,{"$f":"IF(K80>K84,K80-K84,0)","v":241.48},241.48]
[null,null,null,{"$f":"D86*D14","v":0},2962.54,2962.54,2962.54,2962.54,2962.54,2962.54,2962.54,2962.54]
[null,"BENEFÍCIOS COMUNS - AUXÍLIO ALIMENTAÇÃO"]
[]
[null,null,"VALOR CCT",40.5,{"$f":"D90","v":40.5},{"$f":"E90","v":40.5},40.5,40.5,40.5,40.5,40.5,40.5]
[null,null,"VALOR CD",35,35,35,35,35,35,35,35,35]
[null,"VALOR MENSAL DO AUXÍLIO ALIMENTAÇÃO - POR POSTO"]
[null,null,null,{"$f":"ROUND(LARGE(D90:D91,1)*D17,2)","v":972},{"$f":"ROUND(LARGE(E90:E91,1)*E17,2)","v":972},972,{"$f":"ROUND(LARGE(G90:G91,1)*G17,2)","v":972},972,972,972,{"$f":"ROUND(LARGE(K90:K91,1)*K17,2)","v":972},972]
[null,null,null,{"$f":"D93*D14","v":972},10339.56,10339.56,10339.56,10339.56,10339.56,10339.56,10339.56,10339.56]
[null,"BENEFÍCIOS ESPECIAIS - ASSISTÊNCIA MÉDICA E FAMILIAR"]
[]
[null,null,"OBRIGAÇÃO DE PAGTO","NÃO","NÃO","NÃO","NÃO","NÃO","NÃO","NÃO","NÃO","NÃO"]
[null,null,"VALOR CCT",0,0,0,0,0,0,0,0,0]
[null,null,"VALOR MERCADO",0,0,0,0,0,0,0,0,0]
[null,"VALOR MENSAL DO AUXÍLIO ESPECIAL - ASSISTÊNCIA MÉDICA E FAMILIAR - POR POSTO"]
[null,null,null,{"$f":"IF(D97=\"SIM\",ROUND(SMALL(D98:D99,1),2),0)","v":0},0,{"$f":"IF(F97=\"SIM\",ROUND(SMALL(F98:F99,1),2),0)","v":0},{"$f":"IF(G97=\"SIM\",ROUND(SMALL(G98:G99,1),2),0)","v":0},0,0,0,{"$f":"IF(K97=\"SIM\",ROUND(SMALL(K98:K99,1),2),0)","v":0},0]
[]
[null,"BENEFÍCIOS ESPECIAIS - SEGURO DE VIDA E AUXÍLIO-FUNERAL, AUX ODONT, AUX CRECHE"]
[]
[null,"SEGURO DE VIDA E AUXÍLIO FUNERAL"]
[null,null,"OBRIGAÇÃO DE PAGTO","NÃO","NÃO","NÃO","NÃO","NÃO","NÃO","NÃO","NÃO","NÃO"]
[null,null,"VALOR CCT",0,0,0,0,0,0,0,0,0]
[null,null,"VALOR MERCADO",0,0,0,0,0,0,0,0,0]
[null,"VALOR MENSAL DO AUXÍLIO ESPECIAL - SEGURO DE VIDA E AUXÍLIO FUNERAL - POR POSTO"]
[null,null,null,{"$f":"IF(D106=\"SIM\",ROUND(SMALL(D107:D108,1),2),0)","v":0},0,{"$f":"IF(F106=\"SIM\",ROUND(SMALL(F107:F108,1),2),0)","v":0},{"$f":"IF(G106=\"SIM\",ROUND(SMALL(G107:G108,1),2),0)","v":0},0,0,0,{"$f":"IF(K106=\"SIM\",ROUND(SMALL(K107:K108,1),2),0)","v":0},0]
[null,"AUXÍLIO ODONTOLÓGICO"]
[null,null,"OBRIGAÇÃO DE PAGTO","NÃO","NÃO","NÃO","NÃO","NÃO","NÃO","NÃO","NÃO","NÃO"]
[null,null,"VALOR CCT",0,0,0,0,0,0,0,0,0]
[null,null,"VALOR MERCADO",0,0,0,0,0,0,0,0,0]
[null,"VALOR MENSAL DO AUXÍLIO ODONTOLÓGICO - POR POSTO"]
[null,null,null,{"$f":"IF(D112=\"SIM\",ROUND(SMALL(D113:D114,1),2)*D17,0)","v":0},0,0,0,0,0,0,0,0]
[null,"TOTAL MENSAL DOS AUXÍLIOS ESPECIAIS - POR POSTO"]
[null,null,null,{"$f":"D116+D110","v":0},0,{"$f":"F116+F110","v":0},{"$f":"G116+G110","v":0},0,0,0,{"$f":"K116+K110","v":0},0]

{"sheet":"Encargos Sociais","index":14,"n_rows":46,"n_cols":7,"rows_kept":46,"cut":false,"hidden":false,"merged":[[2,1,2,3],[3,1,3,4]]}
[]
[]
[]
[null,"ENCARGOS SOCIAIS SOBRE A MÃO DE OBRA"]
[null,null,null,null,"Percentuais"]
[]
[null,"Referência:"]
[null,null,"SINAPI OUT/2018"]
[]
[null,"Categorias:"]
[null,null,"TODAS"]
[]
[null,"GRUPO A: Encargos Sociais Básicos - Previdenciários (GPS), Fundo de Garantia por Tempo de Serviço (FGTS) e Outras Contribuições",null,null,{"$f":"ROUND(SUM(E14:E22),4)","v":0.36799999999999999}]
[null,null,"A","INSS (art. 22, inciso I, Lei nº 8.212/91)",0.2]
[null,null,"B","Salário Educação (art. 3º, inciso I, Decreto nº 87.043/82)",2.5000000000000001E-2]
[null,null,"C","SAT/RAT (art. 22, II, Lei 8.212/91 e Anexo V, Decreto 6.042/07) - Enquadramento 8121-4/00",0.03]
[null,null,"D","SESC ou SESI (art. 30, Lei nº 8.036/90 e art. 1º, Lei 8.154/90)",1.4999999999999999E-2]
[null,null,"E","SENAI ou SENAC (Decreto nº 2.318/86)",0.01]
[null,null,"F","SEBRAE (§ 3º, art. 8º, Lei 8.029/90, alterada pela Lei nº 8.154/90)",6.0000000000000001E-3,null,"* Nota 1 - Os percentuais dos encargos previdenciários, do FGTS e demais contribuições são estabelecidos por legislação vigente."]
[null,null,"G","INCRA (art. 1º, I, Decreto Lei 1.146/70 e Lei 7.787, de 30/06/89)",2E-3,null,"* Nota 2 - O SAT, a depender do grau de risco do serviço, irá variar entre 1%, para risco leve, de 2%, para risco médio, e de 3% para risco grave."]
[null,null,"H","FGTS (Lei Complementar nº 110/01 e art. 30, Lei nº 8.036/90)",0.08,null,"* Nota 3 - Os percentuais do Submódulo 2.2 incidem sobre o Módulo 1, o Submódulo 2.1, o Módulo 3, o Módulo 4 e o Módulo 6."]
[null,null,"I","SECONCI (Convenções Coletivas de Trabalho da construção)",0]
[]
[null,"GRUPO B: Encargos Sociais Relacionados ao Custo do Profissional Ausente - Ausências Legais",null,null,{"$f":"ROUND(SUM(E25:E33),4)","v":0.22459999999999999}]
[null,null,"A","Férias (Arts. 129 e 130, inc. I, da CLT)",{"$f":"1/11","v":9.0909090909090912E-2},null,"Nota 1 - As alíneas “A” a “F” referem-se  ao custo que será pago pela empresa ao profissional ausente (férias e ausências legais)"]
[null,null,"B","Ausências Legais (Arts. 131 e 473 da CLT)",{"$f":"2/252","v":7.9365079365079361E-3},null,"* Nota 2 - Adotou-se a estimativa do SINAPI de 2 dias por ano. Em 252 dias úteis por ano."]
[null,null,"C","Licença-Paternidade (Art. 7º, XIX, e art. 10, §1º, do ADCT, CF/1988 e Art. 1º, II, da Lei 11.770/2008)",{"$f":"(5/(30*12))*0.0596","v":8.2777777777777776E-4},null,"* Nota 3 - Utilizada a proporção de 50% para homens, 5 dias de afastamento, e a probabilidade de um trabalhador requerer a Licença Paternidade em 5,96%, conforme SINAPI (Anuário Estatístico da Previdência Social - 2017)"]
[null,null,"D","Ausência por Acidente de Trabalho (Art. 131, III, da CLT)",{"$f":"0.0205*15/360","v":8.541666666666667E-4},null,"* Nota 4 - Utilzada a estatística de 2,05% dos contribuintes beneficiados com a emissão do auxílio, conforme Anuário Estatístico da Previdência Social. Afastamento de 15 dias a cargo da empresa."]
[null,null,"E","Afastamento Maternidade (Art. 71 da Lei nº 8.213/1991)",{"$f":"0.0508*(120/360)*(30+30*4/3)/360","v":3.2925925925925922E-3},null,"* Nota 5 - Utilizada a estimativa de 120 dias de afastamento, e a probabilidade de uma trabalhadora requerer a Licença Maternidade em 5,08%, conforme SINAPI (citando dados do IBGE 2017) - A própria previdência paga o benefício pelos 120 dias, contudo o empregador arca com o 13º e com as férias"]
[null,null,"F","Auxílio Enfermidade - Doença (Art. 59 da Lei nº 8.213/1991)",{"$f":"((0.0376*15)+2)/360","v":7.1222222222222225E-3},null,"* Nota 6 - Utilizada a estatística de 3,76% dos contribuintes beneficiados com o auxílio, conforme Anuário Estatístico da Previdência Social de 2016 (acrescidos de 2 dias ao ano, para os quais o trabalhador nem requer o benefício da Previdência - conforme SINAPI)"]
[null,null,"G","Adicional de Férias (componente do Submódulo 2.1)",{"$f":"1/3*1/11","v":3.03030303030303E-2},null,"* Nota 7 - O adicional de férias contido no Submódulo 2.1 corresponde a 1/3 da remuneração que, por sua vez, é dividida por 11 contome Nota 1."]
[null,null,"H","13º Salário (destacado na planilha de custos)",{"$f":"1/12","v":8.3333333333333329E-2},null,"* Nota 8 - Provisiona-se, mensalmente, o proporcional a 1/12 dos valores referentes a gratificação natalina e adicional de férias."]
[null,null,"I","Intervalo para repouso ou alimentação (componente do Submódulo 4.2)",0]
[]
[null,"GRUPO C: Encargos Sociais Relacionados à Previsão para Rescisão Trabalhista",null,null,{"$f":"ROUND(SUM(E36:E41),4)","v":6.3700000000000007E-2}]
[null,null,"A","Aviso Prévio Indenizado (Art. 7º, inciso XXI, da CF/1988 e arts. 477, 487, §1º, e 491 da CLT)",{"$f":"0.1*30/360","v":8.3333333333333332E-3},null,"* Nota 1 - Considerou-se demissões de 10% por ano para substituições, a um prazo estimado de contrato de 3 anos. Aviso prévio - 1º ano 30 dias. Considerou-se os 10% demitidos sem justa causa e recebendo aviso indenizado."]
[null,null,"B","Incidência do FGTS sobre o Aviso Prévio Indenizado (Súmula 305 TST)",{"$f":"E21*E36","v":6.6666666666666664E-4}]
[null,null,"C","Multa do FGTS e Contribuição Social sobre o Aviso Prévio Indenizado (Art. 18, §1º, da Lei 8.036/1990 e art. 1º da LC nº 110/2001)",{"$f":"(1+1/12+1/12+1/36)*0.4*E21*0.2019","v":7.7170666666666644E-3},null,"* Nota 2 - Incide sobre a Remuneração + 13º salário (1/12) + Férias (1/12) + Adicional de Férias (1/36) x 40% multa para o empregador x 8% FGTS"]
[null,null,"D","Aviso Prévio Trabalhado (Art. 488, parágrafo único, CLT)",{"$f":"((7+2*3)*100%/360)/3","v":1.2037037037037035E-2},null,"* Nota 3 - Considerou-se demissões de 100% ao final do contrato, com um prazo médio estimado de 3 anos. Assim, calcula-se 7 dias para o 1º ano de contrato e mais 3 dias para os 2 anos seguintes. Total 13 dias."]
[null,null,"E","Incidência de GPS, FGTS e outras contribuições sobre o Aviso Prévio Trabalhado",{"$f":"E39*E13","v":4.4296296296296288E-3}]
[null,null,"F","Multa do FGTS e Contribuição Social sobre o Aviso Prévio Trabalhado",{"$f":"(1+1/12+1/12+1/36)*0.4*E21*(1-0.2019)","v":3.0505155555555549E-2},null,"* Nota 4 - Incide sobre a Remuneração + 13º salário (1/12) + Férias (1/12) + Adicional de Férias (1/36) x 40% multa para o empregador x 8% FGTS"]
[]
[null,"GRUPO D: Reincidências",null,null,{"$f":"ROUND(SUM(E44:E44),4)","v":8.2699999999999996E-2}]
[null,null,"A","Reincidência do Grupo A sobre o Grupo B",{"$f":"E13*E24","v":8.2652799999999998E-2}]
[]
[null,null,null,"SOMATÓRIO - ENCARGOS SOCIAIS SOBRE A MÃO DE OBRA",{"$f":"E43+E35+E24+E13","v":0.73899999999999999}]

{"sheet":"BDI","index":15,"n_rows":26,"n_cols":7,"rows_kept":26,"cut":false,"hidden":false,"merged":[[1,1,1,3],[2,1,2,4]]}
[]
[]
[null,"COMPOSIÇÃO DA TAXA DE CUSTOS INDIRETOS, TRIBUTOS E LUCRO - BDI"]
[null,"APLICAÇÃO: MÃO DE OBRA, 13º, MATERIAIS, EPC E EQUIPAMENTO DE REGISTRO DE FREQUÊNCIA",null,null,"Percentuais"]
[]
[null,"Custos Indiretos da Contratada",null,null,{"$f":"SUM(E7:E8)","v":2.7000000000000003E-2}]
[null,null,"A","Administração Central",2.1600000000000001E-2,null,"* Nota 1 - O Somatório da Administração Central com o Lucro deve ser inferior a 12%"]
[null,null,"B","Seguros, Garantias e Riscos",{"$f":"0.34%+0.2%","v":5.4000000000000003E-3},null,"* Nota 2 - O risco previsto para o porte do contrato majorado em mais 0,20% devido ao não pagamento dos insumos componentes do custo do posto quando da ausência do mesmo."]
[]
[null,"Lucro",null,null,{"$f":"SUM(E11:E11)","v":3.3399999999999999E-2}]
[null,null,"A","Lucro Real sobre os Custos Administrados",3.3399999999999999E-2]
[]
[null,"Despesas Financeiras",null,null,{"$f":"E14","v":5.6394995474364773E-3}]
[null,null,"A","Cálculo Baseado no Prazo para a Restituição dos Desembolsos Realizados pelo Contratado e na Taxa de Retorno Arbitrada",{"$f":"(1+E16)^(E15/252)-1","v":5.6394995474364773E-3},null,"* Nota 1 - DF = [(1+TR)^(DU/252)]/100"]
[null,null,"A.1","Dias Úteis Considerados",11,null,"* Nota 2 - Diferença de dias entre o desembolso, pelo contratado, e o pagamento, pela Câmara"]
[null,null,"A.2","Taxa de Retorno",0.13750000000000001,null,"* Nota 3 - A taxa sugerida é a meta da SELIC"]
[]
[null,"Impostos - Tributos Federais",null,null,{"$f":"SUM(E19:E21)","v":7.3999999999999996E-2}]
[null,null,"A","Contribuição para o Financiamento da Seguridade Social - COFINS",{"$f":"0.8*7.6%","v":6.08E-2},null,"* Nota 1 - Redução de 20% considerando as deduções permitidas em Lei, conforme SENGE, citado pelo TCU - Acórdão 2622/2013"]
[null,null,"B","Programa de Integração Social - PIS",{"$f":"0.8*1.65%","v":1.3200000000000002E-2},null,"* Nota 2 - Redução de 20% considerando as deduções permitidas em Lei, conforme SENGE, citado pelo TCU - Acórdão 2622/2013"]
[null,null,"C","Contribuição Previdenciária sobre a Receita Bruta - CPRB",0,null,"* Nota 3 - Lei 12.546/2011 - Verificar atualizações e setores beneficiados"]
[]
[null,"Impostos - Tributos Distritais",null,null,{"$f":"SUM(E24:E24)","v":0.05}]
[null,null,"A","Imposto sobre Serviço de Qualquer Natureza - ISS",0.05]
[]
[null,null,null,"SOMATÓRIO - ENCARGOS SOCIAIS SOBRE A MÃO DE OBRA",{"$f":"ROUND((((1+E6)*(1+E10)*(1+E13)/(1-E18-E23))-1),4)","v":0.21840000000000001},null,"* Nota 1 - [(1+AC+SGR)*(1+L)*(1+DF)/(1-CONFINS-PIS-CPRB-ISS)]-1"]

{"sheet":"Uniformes","index":16,"n_rows":94,"n_cols":131,"rows_kept":94,"cut":false,"hidden":false,"merged":[[87,2,89,2],[90,2,92,2],[69,2,74,2],[2,1,2,3],[3,1,3,8],[14,2,19,2],[20,2,25,2],[63,2,68,2]]}
[]
[]
[]
[null,"UNIFORMES - AQUISIÇÃO",null,null,null,null,null,null,null,null,null,1,null,{"$f":"L4+1","v":2},null,{"$f":"N4+1","v":3},null,{"$f":"P4+1","v":4},null,{"$f":"R4+1","v":5},null,{"$f":"T4+1","v":6},null,{"$f":"V4+1","v":7},null,{"$f":"X4+1","v":8},null,{"$f":"Z4+1","v":9},null,{"$f":"AB4+1","v":10},null,{"$f":"AD4+1","v":11},null,{"$f":"AF4+1","v":12},null,{"$f":"AH4+1","v":13},null,{"$f":"AJ4+1","v":14},null,{"$f":"AL4+1","v":15},null,{"$f":"AN4+1","v":16},null,{"$f":"AP4+1","v":17},null,{"$f":"AR4+1","v":18},null,{"$f":"AT4+1","v":19},null,{"$f":"AV4+1","v":20},null,{"$f":"AX4+1","v":21},null,{"$f":"AZ4+1","v":22},null,{"$f":"BB4+1","v":23},null,{"$f":"BD4+1","v":24},null,{"$f":"BF4+1","v":25},null,{"$f":"BH4+1","v":26},null,{"$f":"BJ4+1","v":27},null,{"$f":"BL4+1","v":28},null,{"$f":"BN4+1","v":29},null,{"$f":"BP4+1","v":30},null,{"$f":"BR4+1","v":31},null,{"$f":"BT4+1","v":32},null,{"$f":"BV4+1","v":33},null,{"$f":"BX4+1","v":34},null,{"$f":"BZ4+1","v":35},null,{"$f":"CB4+1","v":36},null,{"$f":"CD4+1","v":37},null,{"$f":"CF4+1","v":38},null,{"$f":"CH4+1","v":39},null,{"$f":"CJ4+1","v":40},null,{"$f":"CL4+1","v":41},null,{"$f":"CN4+1","v":42},null,{"$f":"CP4+1","v":43},null,{"$f":"CR4+1","v":44},null,{"$f":"CT4+1","v":45},null,{"$f":"CV4+1","v":46},null,{"$f":"CX4+1","v":47},null,{"$f":"CZ4+1","v":48},null,{"$f":"DB4+1","v":49},null,{"$f":"DD4+1","v":50},null,{"$f":"DF4+1","v":51},null,{"$f":"DH4+1","v":52},null,{"$f":"DJ4+1","v":53},null,{"$f":"DL4+1","v":54},null,{"$f":"DN4+1","v":55},null,{"$f":"DP4+1","v":56},null,{"$f":"DR4+1","v":57},null,{"$f":"DT4+1","v":58},null,{"$f":"DV4+1","v":59},null,{"$f":"DX4+1","v":60}]
[]
[null,null,null,null,null,null,null,null,null,null,null,{"$f":"ROUND(SUM(M5:M114),2)","v":2221},null,{"$f":"ROUND(SUM(O5:O114),2)","v":2221},null,{"$f":"ROUND(SUM(Q5:Q114),2)","v":1401.85},null,{"$f":"ROUND(SUM(S5:S114),2)","v":1401.85},null,{"$f":"ROUND(SUM(U5:U114),2)","v":1401.85},null,{"$f":"ROUND(SUM(W5:W114),2)","v":519.29},null,{"$f":"ROUND(SUM(Y5:Y114),2)","v":519.29},null,{"$f":"ROUND(SUM(AA5:AA114),2)","v":519.29},null,{"$f":"ROUND(SUM(AC5:AC114),2)","v":519.29},null,{"$f":"ROUND(SUM(AE5:AE114),2)","v":0},null,{"$f":"ROUND(SUM(AG5:AG114),2)","v":0},null,{"$f":"ROUND(SUM(AI5:AI114),2)","v":0},null,{"$f":"ROUND(SUM(AK5:AK114),2)","v":0},null,{"$f":"ROUND(SUM(AM5:AM114),2)","v":0},null,{"$f":"ROUND(SUM(AO5:AO114),2)","v":0},null,{"$f":"ROUND(SUM(AQ5:AQ114),2)","v":0},null,{"$f":"ROUND(SUM(AS5:AS114),2)","v":0},null,{"$f":"ROUND(SUM(AU5:AU114),2)","v":0},null,{"$f":"ROUND(SUM(AW5:AW114),2)","v":0},null,{"$f":"ROUND(SUM(AY5:AY114),2)","v":0},null,{"$f":"ROUND(SUM(BA5:BA114),2)","v":0},null,{"$f":"ROUND(SUM(BC5:BC114),2)","v":0},null,{"$f":"ROUND(SUM(BE5:BE114),2)","v":0},null,{"$f":"ROUND(SUM(BG5:BG114),2)","v":0},null,{"$f":"ROUND(SUM(BI5:BI114),2)","v":0},null,{"$f":"ROUND(SUM(BK5:BK114),2)","v":0},null,{"$f":"ROUND(SUM(BM5:BM114),2)","v":0},null,{"$f":"ROUND(SUM(BO5:BO114),2)","v":0},null,{"$f":"ROUND(SUM(BQ5:BQ114),2)","v":0},null,{"$f":"ROUND(SUM(BS5:BS114),2)","v":0},null,{"$f":"ROUND(SUM(BU5:BU114),2)","v":0},null,{"$f":"ROUND(SUM(BW5:BW114),2)","v":0},null,{"$f":"ROUND(SUM(BY5:BY114),2)","v":0},null,{"$f":"ROUND(SUM(CA5:CA114),2)","v":0},null,{"$f":"ROUND(SUM(CC5:CC114),2)","v":0},null,{"$f":"ROUND(SUM(CE5:CE114),2)","v":0},null,{"$f":"ROUND(SUM(CG5:CG114),2)","v":0},null,{"$f":"ROUND(SUM(CI5:CI114),2)","v":0},null,{"$f":"ROUND(SUM(CK5:CK114),2)","v":0},null,{"$f":"ROUND(SUM(CM5:CM114),2)","v":0},null,{"$f":"ROUND(SUM(CO5:CO114),2)","v":0},null,{"$f":"ROUND(SUM(CQ5:CQ114),2)","v":0},null,{"$f":"ROUND(SUM(CS5:CS114),2)","v":0},null,{"$f":"ROUND(SUM(CU5:CU114),2)","v":0},null,{"$f":"ROUND(SUM(CW5:CW114),2)","v":0},null,{"$f":"ROUND(SUM(CY5:CY114),2)","v":0},null,{"$f":"ROUND(SUM(DA5:DA114),2)","v":0},null,{"$f":"ROUND(SUM(DC5:DC114),2)","v":0},null,{"$f":"ROUND(SUM(DE5:DE114),2)","v":0},null,{"$f":"ROUND(SUM(DG5:DG114),2)","v":0},null,{"$f":"ROUND(SUM(DI5:DI114),2)","v":0},null,{"$f":"ROUND(SUM(DK5:DK114),2)","v":0},null,{"$f":"ROUND(SUM(DM5:DM114),2)","v":0},null,{"$f":"ROUND(SUM(DO5:DO114),2)","v":0},null,{"$f":"ROUND(SUM(DQ5:DQ114),2)","v":0},null,{"$f":"ROUND(SUM(DS5:DS114),2)","v":0},null,{"$f":"ROUND(SUM(DU5:DU114),2)","v":0},null,{"$f":"ROUND(SUM(DW5:DW114),2)","v":0},null,{"$f":"ROUND(SUM(DY5:DY114),2)","v":0},null,{"$f":"ROUND(SUM(EA5:EA114),2)","v":0}]
[null,null,"CATEGORIAS",null,null,null,null,null,"QUANTIDADE"]
[null,null,null,null,null,null,null,null,null,null,null,{"$f":"IF($C8=L$4,1,0)","v":0}]
[null,null,1,{"$f":"HLOOKUP($C9,'Dados Gerais'!$D$5:$BK$10,6)","v":"ENCARREGADO GERAL"},null,null,null,null,{"$f":"HLOOKUP($C9,'Dados Gerais'!$D$5:$BK$14,10)","v":1},null,null,1,null,{"$f":"IF($C9=N$4,1,0)","v":0},null,{"$f":"IF($C9=P$4,1,0)","v":0},null,{"$f":"IF($C9=R$4,1,0)","v":0},null,{"$f":"IF($C9=T$4,1,0)","v":0},null,{"$f":"IF($C9=V$4,1,0)","v":0},null,{"$f":"IF($C9=X$4,1,0)","v":0},null,{"$f":"IF($C9=Z$4,1,0)","v":0},null,{"$f":"IF($C9=AB$4,1,0)","v":0},null,{"$f":"IF($C9=AD$4,1,0)","v":0},null,{"$f":"IF($C9=AF$4,1,0)","v":0},null,{"$f":"IF($C9=AH$4,1,0)","v":0},null,{"$f":"IF($C9=AJ$4,1,0)","v":0},null,{"$f":"IF($C9=AL$4,1,0)","v":0},null,{"$f":"IF($C9=AN$4,1,0)","v":0},null,{"$f":"IF($C9=AP$4,1,0)","v":0},null,{"$f":"IF($C9=AR$4,1,0)","v":0},null,{"$f":"IF($C9=AT$4,1,0)","v":0},null,{"$f":"IF($C9=AV$4,1,0)","v":0},null,{"$f":"IF($C9=AX$4,1,0)","v":0},null,{"$f":"IF($C9=AZ$4,1,0)","v":0},null,{"$f":"IF($C9=BB$4,1,0)","v":0},null,{"$f":"IF($C9=BD$4,1,0)","v":0},null,{"$f":"IF($C9=BF$4,1,0)","v":0},null,{"$f":"IF($C9=BH$4,1,0)","v":0},null,{"$f":"IF($C9=BJ$4,1,0)","v":0},null,{"$f":"IF($C9=BL$4,1,0)","v":0},null,{"$f":"IF($C9=BN$4,1,0)","v":0},null,{"$f":"IF($C9=BP$4,1,0)","v":0},null,{"$f":"IF($C9=BR$4,1,0)","v":0},null,{"$f":"IF($C9=BT$4,1,0)","v":0},null,{"$f":"IF($C9=BV$4,1,0)","v":0},null,{"$f":"IF($C9=BX$4,1,0)","v":0},null,{"$f":"IF($C9=BZ$4,1,0)","v":0},null,{"$f":"IF($C9=CB$4,1,0)","v":0},null,{"$f":"IF($C9=CD$4,1,0)","v":0},null,{"$f":"IF($C9=CF$4,1,0)","v":0},null,{"$f":"IF($C9=CH$4,1,0)","v":0},null,{"$f":"IF($C9=CJ$4,1,0)","v":0},null,{"$f":"IF($C9=CL$4,1,0)","v":0},null,{"$f":"IF($C9=CN$4,1,0)","v":0},null,{"$f":"IF($C9=CP$4,1,0)","v":0},null,{"$f":"IF($C9=CR$4,1,0)","v":0},null,{"$f":"IF($C9=CT$4,1,0)","v":0},null,{"$f":"IF($C9=CV$4,1,0)","v":0},null,{"$f":"IF($C9=CX$4,1,0)","v":0},null,{"$f":"IF($C9=CZ$4,1,0)","v":0},null,{"$f":"IF($C9=DB$4,1,0)","v":0},null,{"$f":"IF($C9=DD$4,1,0)","v":0},null,{"$f":"IF($C9=DF$4,1,0)","v":0},null,{"$f":"IF($C9=DH$4,1,0)","v":0},null,{"$f":"IF($C9=DJ$4,1,0)","v":0},null,{"$f":"IF($C9=DL$4,1,0)","v":0},null,{"$f":"IF($C9=DN$4,1,0)","v":0},null,{"$f":"IF($C9=DP$4,1,0)","v":0},null,{"$f":"IF($C9=DR$4,1,0)","v":0},null,{"$f":"IF($C9=DT$4,1,0)","v":0},null,{"$f":"IF($C9=DV$4,1,0)","v":0},null,{"$f":"IF($C9=DX$4,1,0)","v":0},null,{"$f":"IF($C9=DZ$4,1,0)","v":0}]
[null,null,2,{"$f":"HLOOKUP($C10,'Dados Gerais'!$D$5:$BK$10,6)","v":"ENCARREGADO SETORIAL"},null,null,null,null,{"$f":"HLOOKUP($C10,'Dados Gerais'!$D$5:$BK$14,10)","v":1},null,null,{"$f":"IF($C10=L$4,1,0)","v":0},null,1,null,0,null,0,null,0,null,0,null,0,null,0,null,0,null,0,null,0,null,0,null,0,null,0,null,0,null,0,null,0,null,0,null,0,null,0,null,0,null,0,null,0,null,0,null,0,null,0,null,0,null,0,null,0,null,0,null,0,null,0,null,0,null,0,null,0,null,0,null,0,null,0,null,0,null,0,null,0,null,0,null,0,null,0,null,0,null,0,null,0,null,0,null,0,null,0,null,0,null,0,null,0,null,0,null,0,null,0,null,0,null,0,null,0,null,0]
[null,null,null,null,null,null,null,null,null,null,null,0]
[]
[null,null,"ITEM","DESCRIÇÃO","QUANT ANUAL\nPOR POSTO","% ESTIMADO POR GÊNERO","Nº DE POSTOS","QUANT ANUAL\nTOTAL ESTIMADA","VALOR"]
[null,null,null,null,null,null,null,null,null,null,null,null,{"$f":"IF(SUM(L$8:L$11)>0,$E14*$I14,0)","v":0},null,{"$f":"IF(SUM(N$8:N$11)>0,$E14*$I14,0)","v":0},null,{"$f":"IF(SUM(P$8:P$11)>0,$E14*$I14,0)","v":0},null,{"$f":"IF(SUM(R$8:R$11)>0,$E14*$I14,0)","v":0},null,{"$f":"IF(SUM(T$8:T$11)>0,$E14*$I14,0)","v":0},null,{"$f":"IF(SUM(V$8:V$11)>0,$E14*$I14,0)","v":0},null,{"$f":"IF(SUM(X$8:X$11)>0,$E14*$I14,0)","v":0},null,{"$f":"IF(SUM(Z$8:Z$11)>0,$E14*$I14,0)","v":0},null,{"$f":"IF(SUM(AB$8:AB$11)>0,$E14*$I14,0)","v":0},null,{"$f":"IF(SUM(AD$8:AD$11)>0,$E14*$I14,0)","v":0},null,{"$f":"IF(SUM(AF$8:AF$11)>0,$E14*$I14,0)","v":0},null,{"$f":"IF(SUM(AH$8:AH$11)>0,$E14*$I14,0)","v":0},null,{"$f":"IF(SUM(AJ$8:AJ$11)>0,$E14*$I14,0)","v":0},null,{"$f":"IF(SUM(AL$8:AL$11)>0,$E14*$I14,0)","v":0},null,{"$f":"IF(SUM(AN$8:AN$11)>0,$E14*$I14,0)","v":0},null,{"$f":"IF(SUM(AP$8:AP$11)>0,$E14*$I14,0)","v":0},null,{"$f":"IF(SUM(AR$8:AR$11)>0,$E14*$I14,0)","v":0},null,{"$f":"IF(SUM(AT$8:AT$11)>0,$E14*$I14,0)","v":0},null,{"$f":"IF(SUM(AV$8:AV$11)>0,$E14*$I14,0)","v":0},null,{"$f":"IF(SUM(AX$8:AX$11)>0,$E14*$I14,0)","v":0},null,{"$f":"IF(SUM(AZ$8:AZ$11)>0,$E14*$I14,0)","v":0},null,{"$f":"IF(SUM(BB$8:BB$11)>0,$E14*$I14,0)","v":0},null,{"$f":"IF(SUM(BD$8:BD$11)>0,$E14*$I14,0)","v":0},null,{"$f":"IF(SUM(BF$8:BF$11)>0,$E14*$I14,0)","v":0},null,{"$f":"IF(SUM(BH$8:BH$11)>0,$E14*$I14,0)","v":0},null,{"$f":"IF(SUM(BJ$8:BJ$11)>0,$E14*$I14,0)","v":0},null,{"$f":"IF(SUM(BL$8:BL$11)>0,$E14*$I14,0)","v":0},null,{"$f":"IF(SUM(BN$8:BN$11)>0,$E14*$I14,0)","v":0},null,{"$f":"IF(SUM(BP$8:BP$11)>0,$E14*$I14,0)","v":0},null,{"$f":"IF(SUM(BR$8:BR$11)>0,$E14*$I14,0)","v":0},null,{"$f":"IF(SUM(BT$8:BT$11)>0,$E14*$I14,0)","v":0},null,{"$f":"IF(SUM(BV$8:BV$11)>0,$E14*$I14,0)","v":0},null,{"$f":"IF(SUM(BX$8:BX$11)>0,$E14*$I14,0)","v":0},null,{"$f":"IF(SUM(BZ$8:BZ$11)>0,$E14*$I14,0)","v":0},null,{"$f":"IF(SUM(CB$8:CB$11)>0,$E14*$I14,0)","v":0},null,{"$f":"IF(SUM(CD$8:CD$11)>0,$E14*$I14,0)","v":0},null,{"$f":"IF(SUM(CF$8:CF$11)>0,$E14*$I14,0)","v":0},null,{"$f":"IF(SUM(CH$8:CH$11)>0,$E14*$I14,0)","v":0},null,{"$f":"IF(SUM(CJ$8:CJ$11)>0,$E14*$I14,0)","v":0},null,{"$f":"IF(SUM(CL$8:CL$11)>0,$E14*$I14,0)","v":0},null,{"$f":"IF(SUM(CN$8:CN$11)>0,$E14*$I14,0)","v":0},null,{"$f":"IF(SUM(CP$8:CP$11)>0,$E14*$I14,0)","v":0},null,{"$f":"IF(SUM(CR$8:CR$11)>0,$E14*$I14,0)","v":0},null,{"$f":"IF(SUM(CT$8:CT$11)>0,$E14*$I14,0)","v":0},null,{"$f":"IF(SUM(CV$8:CV$11)>0,$E14*$I14,0)","v":0},null,{"$f":"IF(SUM(CX$8:CX$11)>0,$E14*$I14,0)","v":0},null,{"$f":"IF(SUM(CZ$8:CZ$11)>0,$E14*$I14,0)","v":0},null,{"$f":"IF(SUM(DB$8:DB$11)>0,$E14*$I14,0)","v":0},null,{"$f":"IF(SUM(DD$8:DD$11)>0,$E14*$I14,0)","v":0},null,{"$f":"IF(SUM(DF$8:DF$11)>0,$E14*$I14,0)","v":0},null,{"$f":"IF(SUM(DH$8:DH$11)>0,$E14*$I14,0)","v":0},null,{"$f":"IF(SUM(DJ$8:DJ$11)>0,$E14*$I14,0)","v":0},null,{"$f":"IF(SUM(DL$8:DL$11)>0,$E14*$I14,0)","v":0},null,{"$f":"IF(SUM(DN$8:DN$11)>0,$E14*$I14,0)","v":0},null,{"$f":"IF(SUM(DP$8:DP$11)>0,$E14*$I14,0)","v":0},null,{"$f":"IF(SUM(DR$8:DR$11)>0,$E14*$I14,0)","v":0},null,{"$f":"IF(SUM(DT$8:DT$11)>0,$E14*$I14,0)","v":0},null,{"$f":"IF(SUM(DV$8:DV$11)>0,$E14*$I14,0)","v":0},null,{"$f":"IF(SUM(DX$8:DX$11)>0,$E14*$I14,0)","v":0},null,{"$f":"IF(SUM(DZ$8:DZ$11)>0,$E14*$I14,0)","v":0}]
[null,null,"MASCULINO","Terno completo (calça) na cor preta, em microfibra",4,{"$f":"ROUNDUP(1/2,2)","v":0.5},{"$f":"SUM($I$9:$I$10)","v":2},{"$f":"ROUNDUP(E15*F15*G15,0)","v":4},322.83999999999997,null,null,null,{"$f":"IF(SUM(L$8:L$11)>0,$H15*$I15,0)/SUM($I$9:$I$10)","v":645.67999999999995},null,{"$f":"IF(SUM(N$8:N$11)>0,$H15*$I15,0)/SUM($I$9:$I$10)","v":645.67999999999995},null,{"$f":"IF(SUM(P$8:P$11)>0,$H15*$I15,0)/SUM($I$9:$I$10)","v":0},null,{"$f":"IF(SUM(R$8:R$11)>0,$H15*$I15,0)","v":0},null,{"$f":"IF(SUM(T$8:T$11)>0,$H15*$I15,0)","v":0},null,{"$f":"IF(SUM(V$8:V$11)>0,$H15*$I15,0)","v":0},null,{"$f":"IF(SUM(X$8:X$11)>0,$H15*$I15,0)","v":0},null,{"$f":"IF(SUM(Z$8:Z$11)>0,$H15*$I15,0)","v":0},null,{"$f":"IF(SUM(AB$8:AB$11)>0,$H15*$I15,0)","v":0},null,{"$f":"IF(SUM(AD$8:AD$11)>0,$H15*$I15,0)","v":0},null,0,null,0,null,0,null,0,null,0,null,0,null,0,null,{"$f":"IF(SUM(AT$8:AT$11)>0,$H15*$I15,0)","v":0},null,0,null,0,null,0,null,0,null,0,null,0,null,0,null,0,null,0,null,0,null,0,null,0,null,0,null,0,null,0,null,0,null,0,null,0,null,0,null,0,null,0,null,0,null,0,null,0,null,0,null,0,null,0,null,0,null,0,null,0,null,0,null,{"$f":"IF(SUM(DF$8:DF$11)>0,$H15*$I15,0)","v":0},null,0,null,0,null,0,null,0,null,0,null,0,null,0,null,0,null,0,null,0]
[null,null,null,"Camisa social branca, tecido leve em algodão",4,{"$f":"F15","v":0.5},2,{"$f":"ROUNDUP(E16*F16*G16,0)","v":4},89.1,null,null,null,{"$f":"IF(SUM(L$8:L$11)>0,$H16*$I16,0)/SUM($I$9:$I$10)","v":178.2},null,{"$f":"IF(SUM(N$8:N$11)>0,$H16*$I16,0)/SUM($I$9:$I$10)","v":178.2},null,0,null,0,null,0,null,0,null,0,null,0,null,0,null,0,null,{"$f":"IF(SUM(AF$8:AF$11)>0,$H16*$I16,0)","v":0},null,0,null,0,null,0,null,0,null,0,null,0,null,0,null,0,null,0,null,0,null,0,null,0,null,0,null,0,null,0,null,0,null,0,null,0,null,0,null,0,null,0,null,0,null,0,null,0,null,0,null,0,null,0,null,0,null,0,null,0,null,0,null,0,null,0,null,0,null,0,null,0,null,0,null,0,null,0,null,0,null,0,null,0,null,0,null,0,null,0,null,0,null,0,null,0,null,0]
[null,null,null,"Gravata na cor preta, tecido em poliéster",4,{"$f":"F16","v":0.5},2,4,33.49,null,null,null,66.98,null,{"$f":"IF(SUM(N$8:N$11)>0,$H17*$I17,0)/SUM($I$9:$I$10)","v":66.98},null,0,null,0,null,0,null,0,null,0,null,0,null,0,null,0,null,0,null,0,null,0,null,0,null,0,null,0,null,0,null,0,null,0,null,0,null,0,null,0,null,0,null,0,null,0,null,0,null,0,null,0,null,0,null,0,null,0,null,0,null,0,null,0,null,0,null,0,null,0,null,0,null,0,null,0,null,0,null,0,null,0,null,0,null,0,null,0,null,0,null,0,null,0,null,0,null,0,null,0,null,0,null,0,null,0,null,0,null,0,null,0,null,0,null,0]
[null,null,null,"Cinto em couro na cor preta",2,0.5,2,2,35.5,null,null,null,35.5,null,{"$f":"IF(SUM(N$8:N$11)>0,$H18*$I18,0)/SUM($I$9:$I$10)","v":35.5},null,0,null,0,null,0,null,0,null,0,null,0,null,0,null,0,null,0,null,0,null,0,null,0,null,0,null,0,null,0,null,0,null,0,null,0,null,0,null,0,null,0,null,0,null,0,null,0,null,0,null,0,null,0,null,0,null,0,null,0,null,0,null,0,null,0,null,0,null,0,null,0,null,0,null,0,null,0,null,0,null,0,null,0,null,0,null,0,null,0,null,0,null,0,null,0,null,0,null,0,null,0,null,0,null,0,null,0,null,0,null,0,null,0,null,0]
[null,null,null,"Meia social na cor preta",4,0.5,2,4,14.5,null,null,null,29,null,{"$f":"IF(SUM(N$8:N$11)>0,$H19*$I19,0)/SUM($I$9:$I$10)","v":29},null,0,null,0,null,0,null,0,null,0,null,0,null,0,null,0,null,0,null,0,null,0,null,0,null,0,null,0,null,0,null,0,null,0,null,0,null,0,null,0,null,0,null,0,null,0,null,0,null,0,null,0,null,0,null,0,null,0,null,0,null,0,null,0,null,0,null,0,null,0,null,0,null,0,null,0,null,0,null,0,null,0,null,0,null,0,null,0,null,0,null,0,null,0,null,0,null,0,null,0,null,0,null,0,null,0,null,0,null,0,null,0,null,0,null,0]
[null,null,null,"Sapato social preto, em couro acolchoado, com solo antiderrapante",4,0.5,2,4,93.633333333333326,null,null,null,187.26666666666665,null,{"$f":"IF(SUM(N$8:N$11)>0,$H20*$I20,0)/SUM($I$9:$I$10)","v":187.26666666666665},null,0,null,0,null,0,null,0,null,0,null,0,null,0,null,0,null,0,null,0,null,0,null,0,null,0,null,0,null,0,null,0,null,0,null,0,null,0,null,0,null,0,null,0,null,0,null,0,null,0,null,0,null,0,null,0,null,0,null,0,null,0,null,0,null,0,null,0,null,0,null,0,null,0,null,0,null,0,null,0,null,0,null,0,null,0,null,0,null,0,null,0,null,0,null,0,null,0,null,0,null,0,null,0,null,0,null,0,null,0,null,0,null,0,null,0]
[null,null,"FEMININO","Terno completo (saia) na cor preta, em microfibra",{"$f":"E15","v":4},{"$f":"100%-F20","v":0.5},2,4,228.85,null,null,null,457.7,null,{"$f":"IF(SUM(N$8:N$11)>0,$H21*$I21,0)/SUM($I$9:$I$10)","v":457.7},null,0,null,0,null,0,null,0,null,0,null,0,null,0,null,0,null,0,null,0,null,0,null,0,null,0,null,0,null,0,null,0,null,0,null,0,null,0,null,0,null,0,null,0,null,0,null,0,null,0,null,0,null,0,null,0,null,0,null,0,null,0,null,0,null,0,null,0,null,0,null,0,null,0,null,0,null,0,null,0,null,0,null,0,null,0,null,0,null,0,null,0,null,0,null,0,null,0,null,0,null,0,null,0,null,0,null,0,null,0,null,0,null,0,null,0]
[null,null,null,"Blusa social branca, tecido leve em algodão",{"$f":"E16","v":4},{"$f":"F21","v":0.5},2,4,81.217500000000001,null,null,null,162.435,null,{"$f":"IF(SUM(N$8:N$11)>0,$H22*$I22,0)/SUM($I$9:$I$10)","v":162.435},null,0,null,0,null,0,null,0,null,0,null,0,null,0,null,0,null,0,null,0,null,0,null,0,null,0,null,0,null,0,null,0,null,0,null,0,null,0,null,0,null,0,null,0,null,0,null,0,null,0,null,0,null,0,null,0,null,0,null,0,null,0,null,0,null,0,null,0,null,0,null,0,null,0,null,0,null,0,null,0,null,0,null,0,null,0,null,0,null,0,null,0,null,0,null,0,null,0,null,0,null,0,null,0,null,0,null,0,null,0,null,0,null,0,null,0]
[null,null,null,"Lenço na cor preta, tecido em poliéster",4,{"$f":"F22","v":0.5},2,4,34.950000000000003,null,null,null,69.900000000000006,null,{"$f":"IF(SUM(N$8:N$11)>0,$H23*$I23,0)/SUM($I$9:$I$10)","v":69.900000000000006},null,0,null,0,null,0,null,0,null,0,null,0,null,0,null,0,null,0,null,0,null,0,null,0,null,0,null,0,null,0,null,0,null,0,null,0,null,0,null,0,null,0,null,0,null,0,null,0,null,0,null,0,null,0,null,0,null,0,null,0,null,0,null,0,null,0,null,0,null,0,null,0,null,0,null,0,null,0,null,{"$f":"IF(SUM(CP$8:CP$11)>0,$H23*$I23,0)","v":0},null,0,null,0,null,0,null,0,null,0,null,0,null,0,null,0,null,0,null,0,null,0,null,0,null,0,null,0,null,0,null,0,null,0,null,0]
[null,null,null,"Cinto em couro na cor preta",2,0.5,2,2,36.5,null,null,null,36.5,null,{"$f":"IF(SUM(N$8:N$11)>0,$H24*$I24,0)/SUM($I$9:$I$10)","v":36.5},null,0,null,0,null,0,null,0,null,0,null,0,null,0,null,0,null,{"$f":"IF(SUM(AF$8:AF$11)>0,$H24*$I24,0)","v":0},null,0,null,0,null,0,null,0,null,0,null,0,null,0,null,0,null,0,null,0,null,0,null,0,null,0,null,0,null,0,null,0,null,0,null,0,null,0,null,0,null,0,null,0,null,0,null,0,null,0,null,0,null,0,null,0,null,0,null,0,null,0,null,0,null,0,null,0,null,0,null,0,null,0,null,0,null,0,null,0,null,0,null,0,null,0,null,0,null,0,null,0,null,0,null,0,null,0]
[null,null,null,"Meia social na cor preta",4,0.5,2,4,25.95,null,null,null,51.9,null,{"$f":"IF(SUM(N$8:N$11)>0,$H25*$I25,0)/SUM($I$9:$I$10)","v":51.9},null,0,null,0,null,0,null,0,null,0,null,0,null,0,null,0,null,0,null,0,null,0,null,0,null,0,null,0,null,0,null,0,null,0,null,0,null,0,null,0,null,0,null,0,null,0,null,0,null,0,null,0,null,0,null,0,null,0,null,0,null,0,null,0,null,0,null,0,null,0,null,0,null,0,null,0,null,0,null,0,null,0,null,0,null,0,null,0,null,0,null,0,null,0,null,0,null,0,null,0,null,0,null,0,null,0,null,0,null,0,null,0,null,0,null,0]
[null,null,null,"Sapato social preto, em couro acolchoado, com solo antiderrapante",4,0.5,2,4,149.96666666666667,null,null,null,299.93333333333334,null,{"$f":"IF(SUM(N$8:N$11)>0,$H26*$I26,0)/SUM($I$9:$I$10)","v":299.93333333333334},null,0,null,0,null,0,null,0,null,0,null,0,null,0,null,0,null,0,null,0,null,0,null,0,null,0,null,0,null,0,null,0,null,0,null,0,null,0,null,0,null,0,null,0,null,0,null,0,null,0,null,0,null,0,null,0,null,0,null,0,null,0,null,0,null,0,null,0,null,0,null,0,null,0,null,0,null,0,null,0,null,0,null,0,null,0,null,0,null,0,null,0,null,0,null,0,null,0,null,0,null,0,null,0,null,0,null,0,null,0,null,0,null,0,null,0]
[null,null,null,null,null,null,null,null,null,null,null,null,{"$f":"IF(SUM(L$8:L$11)>0,$E27*$I27,0)","v":0},null,{"$f":"IF(SUM(N$8:N$11)>0,$E27*$I27,0)","v":0},null,{"$f":"IF(SUM(P$8:P$11)>0,$E27*$I27,0)","v":0},null,{"$f":"IF(SUM(R$8:R$11)>0,$E27*$I27,0)","v":0},null,{"$f":"IF(SUM(T$8:T$11)>0,$E27*$I27,0)","v":0},null,{"$f":"IF(SUM(V$8:V$11)>0,$E27*$I27,0)","v":0},null,{"$f":"IF(SUM(X$8:X$11)>0,$E27*$I27,0)","v":0},null,{"$f":"IF(SUM(Z$8:Z$11)>0,$E27*$I27,0)","v":0},null,{"$f":"IF(SUM(AB$8:AB$11)>0,$E27*$I27,0)","v":0},null,{"$f":"IF(SUM(AD$8:AD$11)>0,$E27*$I27,0)","v":0},null,{"$f":"IF(SUM(AF$8:AF$11)>0,$E27*$I27,0)","v":0},null,{"$f":"IF(SUM(AH$8:AH$11)>0,$E27*$I27,0)","v":0},null,{"$f":"IF(SUM(AJ$8:AJ$11)>0,$E27*$I27,0)","v":0},null,{"$f":"IF(SUM(AL$8:AL$11)>0,$E27*$I27,0)","v":0},null,{"$f":"IF(SUM(AN$8:AN$11)>0,$E27*$I27,0)","v":0},null,{"$f":"IF(SUM(AP$8:AP$11)>0,$E27*$I27,0)","v":0},null,{"$f":"IF(SUM(AR$8:AR$11)>0,$E27*$I27,0)","v":0},null,{"$f":"IF(SUM(AT$8:AT$11)>0,$E27*$I27,0)","v":0},null,{"$f":"IF(SUM(AV$8:AV$11)>0,$E27*$I27,0)","v":0},null,{"$f":"IF(SUM(AX$8:AX$11)>0,$E27*$I27,0)","v":0},null,{"$f":"IF(SUM(AZ$8:AZ$11)>0,$E27*$I27,0)","v":0},null,{"$f":"IF(SUM(BB$8:BB$11)>0,$E27*$I27,0)","v":0},null,{"$f":"IF(SUM(BD$8:BD$11)>0,$E27*$I27,0)","v":0},null,{"$f":"IF(SUM(BF$8:BF$11)>0,$E27*$I27,0)","v":0},null,{"$f":"IF(SUM(BH$8:BH$11)>0,$E27*$I27,0)","v":0},null,{"$f":"IF(SUM(BJ$8:BJ$11)>0,$E27*$I27,0)","v":0},null,{"$f":"IF(SUM(BL$8:BL$11)>0,$E27*$I27,0)","v":0},null,{"$f":"IF(SUM(BN$8:BN$11)>0,$E27*$I27,0)","v":0},null,{"$f":"IF(SUM(BP$8:BP$11)>0,$E27*$I27,0)","v":0},null,{"$f":"IF(SUM(BR$8:BR$11)>0,$E27*$I27,0)","v":0},null,{"$f":"IF(SUM(BT$8:BT$11)>0,$E27*$I27,0)","v":0},null,{"$f":"IF(SUM(BV$8:BV$11)>0,$E27*$I27,0)","v":0},null,{"$f":"IF(SUM(BX$8:BX$11)>0,$E27*$I27,0)","v":0},null,{"$f":"IF(SUM(BZ$8:BZ$11)>0,$E27*$I27,0)","v":0},null,{"$f":"IF(SUM(CB$8:CB$11)>0,$E27*$I27,0)","v":0},null,{"$f":"IF(SUM(CD$8:CD$11)>0,$E27*$I27,0)","v":0},null,{"$f":"IF(SUM(CF$8:CF$11)>0,$E27*$I27,0)","v":0},null,{"$f":"IF(SUM(CH$8:CH$11)>0,$E27*$I27,0)","v":0},null,{"$f":"IF(SUM(CJ$8:CJ$11)>0,$E27*$I27,0)","v":0},null,{"$f":"IF(SUM(CL$8:CL$11)>0,$E27*$I27,0)","v":0},null,{"$f":"IF(SUM(CN$8:CN$11)>0,$E27*$I27,0)","v":0},null,{"$f":"IF(SUM(CP$8:CP$11)>0,$E27*$I27,0)","v":0},null,{"$f":"IF(SUM(CR$8:CR$11)>0,$E27*$I27,0)","v":0},null,{"$f":"IF(SUM(CT$8:CT$11)>0,$E27*$I27,0)","v":0},null,{"$f":"IF(SUM(CV$8:CV$11)>0,$E27*$I27,0)","v":0},null,{"$f":"IF(SUM(CX$8:CX$11)>0,$E27*$I27,0)","v":0},null,{"$f":"IF(SUM(CZ$8:CZ$11)>0,$E27*$I27,0)","v":0},null,{"$f":"IF(SUM(DB$8:DB$11)>0,$E27*$I27,0)","v":0},null,{"$f":"IF(SUM(DD$8:DD$11)>0,$E27*$I27,0)","v":0},null,{"$f":"IF(SUM(DF$8:DF$11)>0,$E27*$I27,0)","v":0},null,{"$f":"IF(SUM(DH$8:DH$11)>0,$E27*$I27,0)","v":0},null,{"$f":"IF(SUM(DJ$8:DJ$11)>0,$E27*$I27,0)","v":0},null,{"$f":"IF(SUM(DL$8:DL$11)>0,$E27*$I27,0)","v":0},null,{"$f":"IF(SUM(DN$8:DN$11)>0,$E27*$I27,0)","v":0},null,{"$f":"IF(SUM(DP$8:DP$11)>0,$E27*$I27,0)","v":0},null,{"$f":"IF(SUM(DR$8:DR$11)>0,$E27*$I27,0)","v":0},null,{"$f":"IF(SUM(DT$8:DT$11)>0,$E27*$I27,0)","v":0},null,{"$f":"IF(SUM(DV$8:DV$11)>0,$E27*$I27,0)","v":0},null,{"$f":"IF(SUM(DX$8:DX$11)>0,$E27*$I27,0)","v":0},null,{"$f":"IF(SUM(DZ$8:DZ$11)>0,$E27*$I27,0)","v":0}]
[]
[null,null,"CATEGORIAS",null,null,null,null,null,"QUANTIDADE"]
[null,null,null,null,null,null,null,null,null,null,null,{"$f":"IF($C30=L$4,1,0)","v":0},null,{"$f":"IF($C30=N$4,1,0)","v":0},null,{"$f":"IF($C30=P$4,1,0)","v":0},null,{"$f":"IF($C30=R$4,1,0)","v":0},null,{"$f":"IF($C30=T$4,1,0)","v":0},null,{"$f":"IF($C30=V$4,1,0)","v":0},null,{"$f":"IF($C30=X$4,1,0)","v":0},null,{"$f":"IF($C30=Z$4,1,0)","v":0},null,{"$f":"IF($C30=AB$4,1,0)","v":0},null,{"$f":"IF($C30=AD$4,1,0)","v":0},null,0,null,0,null,0,null,0,null,0,null,0,null,0,null,0,null,0,null,0,null,0,null,0,null,0,null,0,null,0,null,0,null,0,null,0,null,0,null,0,null,0,null,0,null,0,null,0,null,0,null,0,null,0,null,0,null,0,null,0,null,0,null,{"$f":"IF($C30=CP$4,1,0)","v":0},null,0,null,0,null,0,null,0,null,0,null,0,null,0,null,0,null,0,null,0,null,0,null,0,null,0,null,0,null,0,null,0,null,0,null,0]
[null,null,null,{"$f":"HLOOKUP($C31,'Dados Gerais'!$D$5:$BK$10,6)","v":{"$error":"#N/A"}},null,null,null,null,{"$f":"HLOOKUP($C31,'Dados Gerais'!$D$5:$BK$14,10)","v":{"$error":"#N/A"}},null,null,{"$f":"IF($C31=L$4,1,0)","v":0},null,0,null,0,null,0,null,0,null,0,null,0,null,0,null,0,null,0,null,0,null,0,null,0,null,0,null,0,null,0,null,0,null,0,null,0,null,0,null,0,null,0,null,0,null,0,null,0,null,0,null,0,null,0,null,0,null,0,null,0,null,0,null,0,null,0,null,0,null,0,null,0,null,0,null,0,null,0,null,0,null,0,null,0,null,0,null,0,null,0,null,0,null,0,null,0,null,0,null,0,null,0,null,0,null,0,null,0,null,0,null,0,null,0,null,0,null,0]
[null,null,null,{"$f":"HLOOKUP($C32,'Dados Gerais'!$D$5:$BK$10,6)","v":{"$error":"#N/A"}},null,null,null,null,{"$f":"HLOOKUP($C32,'Dados Gerais'!$D$5:$BK$14,10)","v":{"$error":"#N/A"}},null,null,0,null,0,null,0,null,{"$f":"IF($C32=R$4,1,0)","v":0},null,0,null,0,null,0,null,0,null,0,null,0,null,0,null,0,null,0,null,0,null,0,null,0,null,0,null,0,null,0,null,0,null,0,null,0,null,0,null,0,null,0,null,0,null,0,null,0,null,0,null,0,null,0,null,0,null,0,null,0,null,0,null,0,null,0,null,0,null,0,null,0,null,0,null,0,null,0,null,0,null,0,null,0,null,0,null,0,null,0,null,0,null,0,null,0,null,0,null,0,null,0,null,0,null,0,null,0,null,0,null,0]
[null,null,null,null,null,null,null,null,null,null,null,{"$f":"IF($C33=L$4,1,0)","v":0},null,{"$f":"IF($C33=N$4,1,0)","v":0},null,{"$f":"IF($C33=P$4,1,0)","v":0},null,0,null,0,null,0,null,0,null,0,null,0,null,0,null,{"$f":"IF($C33=AF$4,1,0)","v":0},null,0,null,0,null,0,null,0,null,0,null,0,null,0,null,0,null,0,null,0,null,0,null,0,null,0,null,0,null,0,null,0,null,0,null,0,null,0,null,0,null,0,null,0,null,0,null,0,null,0,null,0,null,0,null,0,null,0,null,0,null,0,null,0,null,0,null,0,null,0,null,0,null,0,null,0,null,0,null,0,null,0,null,0,null,0,null,0,null,0,null,0,null,0,null,0,null,0]
[]
[null,null,"ITEM","DESCRIÇÃO","QUANT ANUAL\nPOR POSTO",null,"Nº DE POSTOS","QUANT ANUAL\nTOTAL","VALOR"]
[null,null,null,null,null,null,null,null,null,null,null,null,{"$f":"IF(SUM(L$8:L$11)>0,$E36*$I36,0)","v":0},null,{"$f":"IF(SUM(N$8:N$11)>0,$E36*$I36,0)","v":0},null,{"$f":"IF(SUM(P$8:P$11)>0,$E36*$I36,0)","v":0},null,{"$f":"IF(SUM(R$8:R$11)>0,$E36*$I36,0)","v":0},null,{"$f":"IF(SUM(T$8:T$11)>0,$E36*$I36,0)","v":0},null,{"$f":"IF(SUM(V$8:V$11)>0,$E36*$I36,0)","v":0},null,{"$f":"IF(SUM(X$8:X$11)>0,$E36*$I36,0)","v":0},null,{"$f":"IF(SUM(Z$8:Z$11)>0,$E36*$I36,0)","v":0},null,{"$f":"IF(SUM(AB$8:AB$11)>0,$E36*$I36,0)","v":0},null,{"$f":"IF(SUM(AD$8:AD$11)>0,$E36*$I36,0)","v":0},null,{"$f":"IF(SUM(AF$8:AF$11)>0,$E36*$I36,0)","v":0},null,{"$f":"IF(SUM(AH$8:AH$11)>0,$E36*$I36,0)","v":0},null,{"$f":"IF(SUM(AJ$8:AJ$11)>0,$E36*$I36,0)","v":0},null,{"$f":"IF(SUM(AL$8:AL$11)>0,$E36*$I36,0)","v":0},null,{"$f":"IF(SUM(AN$8:AN$11)>0,$E36*$I36,0)","v":0},null,{"$f":"IF(SUM(AP$8:AP$11)>0,$E36*$I36,0)","v":0},null,{"$f":"IF(SUM(AR$8:AR$11)>0,$E36*$I36,0)","v":0},null,{"$f":"IF(SUM(AT$8:AT$11)>0,$E36*$I36,0)","v":0},null,{"$f":"IF(SUM(AV$8:AV$11)>0,$E36*$I36,0)","v":0},null,{"$f":"IF(SUM(AX$8:AX$11)>0,$E36*$I36,0)","v":0},null,{"$f":"IF(SUM(AZ$8:AZ$11)>0,$E36*$I36,0)","v":0},null,{"$f":"IF(SUM(BB$8:BB$11)>0,$E36*$I36,0)","v":0},null,{"$f":"IF(SUM(BD$8:BD$11)>0,$E36*$I36,0)","v":0},null,{"$f":"IF(SUM(BF$8:BF$11)>0,$E36*$I36,0)","v":0},null,{"$f":"IF(SUM(BH$8:BH$11)>0,$E36*$I36,0)","v":0},null,{"$f":"IF(SUM(BJ$8:BJ$11)>0,$E36*$I36,0)","v":0},null,{"$f":"IF(SUM(BL$8:BL$11)>0,$E36*$I36,0)","v":0},null,{"$f":"IF(SUM(BN$8:BN$11)>0,$E36*$I36,0)","v":0},null,{"$f":"IF(SUM(BP$8:BP$11)>0,$E36*$I36,0)","v":0},null,{"$f":"IF(SUM(BR$8:BR$11)>0,$E36*$I36,0)","v":0},null,{"$f":"IF(SUM(BT$8:BT$11)>0,$E36*$I36,0)","v":0},null,{"$f":"IF(SUM(BV$8:BV$11)>0,$E36*$I36,0)","v":0},null,{"$f":"IF(SUM(BX$8:BX$11)>0,$E36*$I36,0)","v":0},null,{"$f":"IF(SUM(BZ$8:BZ$11)>0,$E36*$I36,0)","v":0},null,{"$f":"IF(SUM(CB$8:CB$11)>0,$E36*$I36,0)","v":0},null,{"$f":"IF(SUM(CD$8:CD$11)>0,$E36*$I36,0)","v":0},null,{"$f":"IF(SUM(CF$8:CF$11)>0,$E36*$I36,0)","v":0},null,{"$f":"IF(SUM(CH$8:CH$11)>0,$E36*$I36,0)","v":0},null,{"$f":"IF(SUM(CJ$8:CJ$11)>0,$E36*$I36,0)","v":0},null,{"$f":"IF(SUM(CL$8:CL$11)>0,$E36*$I36,0)","v":0},null,{"$f":"IF(SUM(CN$8:CN$11)>0,$E36*$I36,0)","v":0},null,{"$f":"IF(SUM(CP$8:CP$11)>0,$E36*$I36,0)","v":0},null,{"$f":"IF(SUM(CR$8:CR$11)>0,$E36*$I36,0)","v":0},null,{"$f":"IF(SUM(CT$8:CT$11)>0,$E36*$I36,0)","v":0},null,{"$f":"IF(SUM(CV$8:CV$11)>0,$E36*$I36,0)","v":0},null,{"$f":"IF(SUM(CX$8:CX$11)>0,$E36*$I36,0)","v":0},null,{"$f":"IF(SUM(CZ$8:CZ$11)>0,$E36*$I36,0)","v":0},null,{"$f":"IF(SUM(DB$8:DB$11)>0,$E36*$I36,0)","v":0},null,{"$f":"IF(SUM(DD$8:DD$11)>0,$E36*$I36,0)","v":0},null,{"$f":"IF(SUM(DF$8:DF$11)>0,$E36*$I36,0)","v":0},null,{"$f":"IF(SUM(DH$8:DH$11)>0,$E36*$I36,0)","v":0},null,{"$f":"IF(SUM(DJ$8:DJ$11)>0,$E36*$I36,0)","v":0},null,{"$f":"IF(SUM(DL$8:DL$11)>0,$E36*$I36,0)","v":0},null,{"$f":"IF(SUM(DN$8:DN$11)>0,$E36*$I36,0)","v":0},null,{"$f":"IF(SUM(DP$8:DP$11)>0,$E36*$I36,0)","v":0},null,{"$f":"IF(SUM(DR$8:DR$11)>0,$E36*$I36,0)","v":0},null,{"$f":"IF(SUM(DT$8:DT$11)>0,$E36*$I36,0)","v":0},null,{"$f":"IF(SUM(DV$8:DV$11)>0,$E36*$I36,0)","v":0},null,{"$f":"IF(SUM(DX$8:DX$11)>0,$E36*$I36,0)","v":0},null,{"$f":"IF(SUM(DZ$8:DZ$11)>0,$E36*$I36,0)","v":0}]
[null,null,7,null,4,null,{"$f":"I31+I32","v":{"$error":"#N/A"}},{"$f":"G37*E37","v":{"$error":"#N/A"}},null,null,null,null,{"$f":"IF(SUM(L$31:L$33)>0,$E37*$I37,0)","v":0},null,{"$f":"IF(SUM(N$31:N$33)>0,$E37*$I37,0)","v":0},null,{"$f":"IF(SUM(P$31:P$33)>0,$E37*$I37,0)","v":0},null,{"$f":"IF(SUM(R$31:R$33)>0,$E37*$I37,0)","v":0},null,{"$f":"IF(SUM(T$31:T$33)>0,$E37*$I37,0)","v":0},null,{"$f":"IF(SUM(V$31:V$33)>0,$E37*$I37,0)","v":0},null,{"$f":"IF(SUM(X$31:X$33)>0,$E37*$I37,0)","v":0},null,{"$f":"IF(SUM(Z$31:Z$33)>0,$E37*$I37,0)","v":0},null,{"$f":"IF(SUM(AB$31:AB$33)>0,$E37*$I37,0)","v":0},null,{"$f":"IF(SUM(AD$31:AD$33)>0,$E37*$I37,0)","v":0},null,{"$f":"IF(SUM(AF$31:AF$33)>0,$E37*$I37,0)","v":0},null,{"$f":"IF(SUM(AH$31:AH$33)>0,$E37*$I37,0)","v":0},null,{"$f":"IF(SUM(AJ$31:AJ$33)>0,$E37*$I37,0)","v":0},null,{"$f":"IF(SUM(AL$31:AL$33)>0,$E37*$I37,0)","v":0},null,{"$f":"IF(SUM(AN$31:AN$33)>0,$E37*$I37,0)","v":0},null,{"$f":"IF(SUM(AP$31:AP$33)>0,$E37*$I37,0)","v":0},null,{"$f":"IF(SUM(AR$31:AR$33)>0,$E37*$I37,0)","v":0},null,{"$f":"IF(SUM(AT$31:AT$33)>0,$E37*$I37,0)","v":0},null,{"$f":"IF(SUM(AV$31:AV$33)>0,$E37*$I37,0)","v":0},null,{"$f":"IF(SUM(AX$31:AX$33)>0,$E37*$I37,0)","v":0},null,{"$f":"IF(SUM(AZ$31:AZ$33)>0,$E37*$I37,0)","v":0},null,{"$f":"IF(SUM(BB$31:BB$33)>0,$E37*$I37,0)","v":0},null,{"$f":"IF(SUM(BD$31:BD$33)>0,$E37*$I37,0)","v":0},null,{"$f":"IF(SUM(BF$31:BF$33)>0,$E37*$I37,0)","v":0},null,{"$f":"IF(SUM(BH$31:BH$33)>0,$E37*$I37,0)","v":0},null,{"$f":"IF(SUM(BJ$31:BJ$33)>0,$E37*$I37,0)","v":0},null,{"$f":"IF(SUM(BL$31:BL$33)>0,$E37*$I37,0)","v":0},null,{"$f":"IF(SUM(BN$31:BN$33)>0,$E37*$I37,0)","v":0},null,{"$f":"IF(SUM(BP$31:BP$33)>0,$E37*$I37,0)","v":0},null,{"$f":"IF(SUM(BR$31:BR$33)>0,$E37*$I37,0)","v":0},null,{"$f":"IF(SUM(BT$31:BT$33)>0,$E37*$I37,0)","v":0},null,{"$f":"IF(SUM(BV$31:BV$33)>0,$E37*$I37,0)","v":0},null,{"$f":"IF(SUM(BX$31:BX$33)>0,$E37*$I37,0)","v":0},null,{"$f":"IF(SUM(BZ$31:BZ$33)>0,$E37*$I37,0)","v":0},null,{"$f":"IF(SUM(CB$31:CB$33)>0,$E37*$I37,0)","v":0},null,{"$f":"IF(SUM(CD$31:CD$33)>0,$E37*$I37,0)","v":0},null,{"$f":"IF(SUM(CF$31:CF$33)>0,$E37*$I37,0)","v":0},null,{"$f":"IF(SUM(CH$31:CH$33)>0,$E37*$I37,0)","v":0},null,{"$f":"IF(SUM(CJ$31:CJ$33)>0,$E37*$I37,0)","v":0},null,{"$f":"IF(SUM(CL$31:CL$33)>0,$E37*$I37,0)","v":0},null,{"$f":"IF(SUM(CN$31:CN$33)>0,$E37*$I37,0)","v":0},null,{"$f":"IF(SUM(CP$31:CP$33)>0,$E37*$I37,0)","v":0},null,{"$f":"IF(SUM(CR$31:CR$33)>0,$E37*$I37,0)","v":0},null,{"$f":"IF(SUM(CT$31:CT$33)>0,$E37*$I37,0)","v":0},null,{"$f":"IF(SUM(CV$31:CV$33)>0,$E37*$I37,0)","v":0},null,{"$f":"IF(SUM(CX$31:CX$33)>0,$E37*$I37,0)","v":0},null,{"$f":"IF(SUM(CZ$31:CZ$33)>0,$E37*$I37,0)","v":0},null,{"$f":"IF(SUM(DB$31:DB$33)>0,$E37*$I37,0)","v":0},null,{"$f":"IF(SUM(DD$31:DD$33)>0,$E37*$I37,0)","v":0},null,{"$f":"IF(SUM(DF$31:DF$33)>0,$E37*$I37,0)","v":0},null,{"$f":"IF(SUM(DH$31:DH$33)>0,$E37*$I37,0)","v":0},null,{"$f":"IF(SUM(DJ$31:DJ$33)>0,$E37*$I37,0)","v":0},null,{"$f":"IF(SUM(DL$31:DL$33)>0,$E37*$I37,0)","v":0},null,{"$f":"IF(SUM(DN$31:DN$33)>0,$E37*$I37,0)","v":0},null,{"$f":"IF(SUM(DP$31:DP$33)>0,$E37*$I37,0)","v":0},null,{"$f":"IF(SUM(DR$31:DR$33)>0,$E37*$I37,0)","v":0},null,{"$f":"IF(SUM(DT$31:DT$33)>0,$E37*$I37,0)","v":0},null,{"$f":"IF(SUM(DV$31:DV$33)>0,$E37*$I37,0)","v":0},null,{"$f":"IF(SUM(DX$31:DX$33)>0,$E37*$I37,0)","v":0},null,{"$f":"IF(SUM(DZ$31:DZ$33)>0,$E37*$I37,0)","v":0}]
[null,null,8,null,{"$f":"E37","v":4},null,{"$f":"G37","v":{"$error":"#N/A"}},{"$error":"#N/A"},null,null,null,null,0,null,0,null,0,null,0,null,0,null,0,null,0,null,0,null,0,null,0,null,0,null,0,null,0,null,0,null,0,null,0,null,0,null,0,null,0,null,0,null,0,null,0,null,0,null,0,null,0,null,0,null,0,null,0,null,0,null,0,null,0,null,0,null,0,null,0,null,0,null,0,null,0,null,0,null,0,null,0,null,0,null,0,null,0,null,0,null,0,null,0,null,0,null,0,null,0,null,0,null,0,null,0,null,0,null,0,null,0,null,0,null,0,null,0,null,0,null,0]
[null,null,9,null,{"$f":"E38","v":4},null,{"$f":"G38","v":{"$error":"#N/A"}},{"$error":"#N/A"},null,null,null,null,0,null,0,null,0,null,0,null,0,null,0,null,0,null,0,null,0,null,0,null,0,null,0,null,0,null,0,null,0,null,0,null,0,null,0,null,0,null,0,null,0,null,0,null,0,null,0,null,0,null,0,null,0,null,0,null,0,null,0,null,0,null,0,null,0,null,0,null,0,null,0,null,0,null,0,null,0,null,0,null,0,null,0,null,0,null,0,null,0,null,0,null,0,null,0,null,0,null,0,null,0,null,0,null,0,null,0,null,0,null,0,null,0,null,0,null,0,null,0]
[null,null,10,null,4,null,{"$error":"#N/A"},{"$error":"#N/A"},null,null,null,null,0,null,0,null,0,null,0,null,0,null,0,null,0,null,0,null,0,null,0,null,0,null,0,null,0,null,0,null,0,null,0,null,0,null,0,null,0,null,0,null,0,null,0,null,0,null,0,null,0,null,0,null,0,null,0,null,0,null,0,null,0,null,0,null,0,null,0,null,0,null,0,null,0,null,0,null,0,null,0,null,0,null,0,null,0,null,0,null,0,null,0,null,0,null,0,null,0,null,0,null,0,null,0,null,0,null,0,null,0,null,0,null,0,null,0,null,0,null,0]
[null,null,11,null,4,null,{"$error":"#N/A"},{"$error":"#N/A"},null,null,null,null,0,null,0,null,0,null,0,null,0,null,0,null,0,null,0,null,0,null,0,null,0,null,0,null,0,null,0,null,0,null,0,null,0,null,0,null,0,null,0,null,0,null,0,null,0,null,0,null,0,null,0,null,0,null,0,null,0,null,0,null,0,null,0,null,0,null,0,null,0,null,0,null,0,null,0,null,0,null,0,null,0,null,0,null,0,null,0,null,0,null,0,null,0,null,0,null,0,null,0,null,0,null,0,null,0,null,0,null,0,null,0,null,0,null,0,null,0,null,0]
[null,null,12,null,4,null,{"$error":"#N/A"},{"$error":"#N/A"},null,null,null,null,0,null,0,null,0,null,0,null,0,null,0,null,0,null,0,null,0,null,0,null,0,null,0,null,0,null,0,null,0,null,0,null,0,null,0,null,0,null,0,null,0,null,0,null,0,null,0,null,0,null,0,null,0,null,0,null,0,null,0,null,0,null,0,null,0,null,0,null,0,null,0,null,0,null,0,null,0,null,0,null,0,null,0,null,0,null,0,null,0,null,0,null,0,null,0,null,0,null,0,null,0,null,0,null,0,null,0,null,0,null,0,null,0,null,0,null,0,null,0]
[null,null,null,null,null,null,null,null,null,null,null,null,0,null,0,null,0,null,0,null,0,null,0,null,0,null,0,null,0,null,0,null,0,null,0,null,0,null,0,null,0,null,0,null,0,null,0,null,0,null,0,null,0,null,0,null,0,null,0,null,0,null,0,null,0,null,0,null,0,null,0,null,0,null,0,null,0,null,0,null,0,null,0,null,0,null,0,null,0,null,0,null,0,null,0,null,0,null,0,null,0,null,0,null,0,null,0,null,0,null,0,null,0,null,0,null,0,null,0,null,0,null,0,null,0,null,0,null,0,null,0]
[null,null,"CATEGORIAS",null,null,null,null,null,"QUANTIDADE"]
[null,null,null,null,null,null,null,null,null,null,null,{"$f":"IF($C45=L$4,1,0)","v":0},null,{"$f":"IF($C45=N$4,1,0)","v":0},null,{"$f":"IF($C45=P$4,1,0)","v":0},null,{"$f":"IF($C45=R$4,1,0)","v":0},null,{"$f":"IF($C45=T$4,1,0)","v":0},null,{"$f":"IF($C45=V$4,1,0)","v":0},null,{"$f":"IF($C45=X$4,1,0)","v":0},null,{"$f":"IF($C45=Z$4,1,0)","v":0},null,{"$f":"IF($C45=AB$4,1,0)","v":0},null,{"$f":"IF($C45=AD$4,1,0)","v":0},null,0,null,0,null,0,null,0,null,0,null,0,null,0,null,0,null,0,null,0,null,0,null,0,null,0,null,0,null,0,null,0,null,0,null,0,null,0,null,0,null,0,null,0,null,0,null,0,null,0,null,0,null,0,null,0,null,0,null,0,null,0,null,{"$f":"IF($C45=CP$4,1,0)","v":0},null,0,null,0,null,0,null,0,null,0,null,0,null,0,null,0,null,0,null,0,null,0,null,0,null,0,null,0,null,0,null,0,null,0,null,0]
[null,null,null,{"$f":"HLOOKUP($C46,'Dados Gerais'!$D$5:$BK$10,6)","v":{"$error":"#N/A"}},null,null,null,null,{"$f":"HLOOKUP($C46,'Dados Gerais'!$D$5:$BK$14,10)","v":{"$error":"#N/A"}},null,null,{"$f":"IF($C46=L$4,1,0)","v":0},null,0,null,0,null,0,null,0,null,0,null,0,null,0,null,0,null,0,null,0,null,0,null,0,null,0,null,0,null,0,null,0,null,0,null,0,null,0,null,0,null,0,null,0,null,0,null,0,null,0,null,0,null,0,null,0,null,0,null,0,null,0,null,0,null,0,null,0,null,0,null,0,null,0,null,0,null,0,null,0,null,0,null,0,null,0,null,0,null,0,null,0,null,0,null,0,null,0,null,0,null,0,null,0,null,0,null,0,null,0,null,0,null,0,null,0,null,0]
[null,null,null,{"$f":"HLOOKUP($C47,'Dados Gerais'!$D$5:$BK$10,6)","v":{"$error":"#N/A"}},null,null,null,null,{"$f":"HLOOKUP($C47,'Dados Gerais'!$D$5:$BK$14,10)","v":{"$error":"#N/A"}},null,null,0,null,0,null,0,null,{"$f":"IF($C47=R$4,1,0)","v":0},null,0,null,0,null,0,null,0,null,0,null,0,null,0,null,0,null,0,null,0,null,0,null,0,null,0,null,0,null,0,null,0,null,0,null,0,null,0,null,0,null,0,null,0,null,0,null,0,null,0,null,0,null,0,null,0,null,0,null,0,null,0,null,0,null,0,null,0,null,0,null,0,null,0,null,0,null,0,null,0,null,0,null,0,null,0,null,0,null,0,null,0,null,0,null,0,null,0,null,0,null,0,null,0,null,0,null,0,null,0,null,0]
[null,null,null,null,null,null,null,null,null,null,null,{"$f":"IF($C48=L$4,1,0)","v":0},null,{"$f":"IF($C48=N$4,1,0)","v":0},null,{"$f":"IF($C48=P$4,1,0)","v":0},null,0,null,0,null,0,null,0,null,0,null,0,null,0,null,{"$f":"IF($C48=AF$4,1,0)","v":0},null,0,null,0,null,0,null,0,null,0,null,0,null,0,null,0,null,0,null,0,null,0,null,0,null,0,null,0,null,0,null,0,null,0,null,0,null,0,null,0,null,0,null,0,null,0,null,0,null,0,null,0,null,0,null,0,null,0,null,0,null,0,null,0,null,0,null,0,null,0,null,0,null,0,null,0,null,0,null,0,null,0,null,0,null,0,null,0,null,0,null,0,null,0,null,0,null,0]
[]
[null,null,"ITEM","DESCRIÇÃO","QUANT ANUAL\nPOR POSTO",null,"Nº DE POSTOS","QUANT ANUAL\nTOTAL","VALOR"]
[null,null,null,null,null,null,null,null,null,null,null,null,{"$f":"IF(SUM(L$8:L$11)>0,$E51*$I51,0)","v":0},null,{"$f":"IF(SUM(N$8:N$11)>0,$E51*$I51,0)","v":0},null,{"$f":"IF(SUM(P$8:P$11)>0,$E51*$I51,0)","v":0},null,{"$f":"IF(SUM(R$8:R$11)>0,$E51*$I51,0)","v":0},null,{"$f":"IF(SUM(T$8:T$11)>0,$E51*$I51,0)","v":0},null,{"$f":"IF(SUM(V$8:V$11)>0,$E51*$I51,0)","v":0},null,{"$f":"IF(SUM(X$8:X$11)>0,$E51*$I51,0)","v":0},null,{"$f":"IF(SUM(Z$8:Z$11)>0,$E51*$I51,0)","v":0},null,{"$f":"IF(SUM(AB$8:AB$11)>0,$E51*$I51,0)","v":0},null,{"$f":"IF(SUM(AD$8:AD$11)>0,$E51*$I51,0)","v":0},null,{"$f":"IF(SUM(AF$8:AF$11)>0,$E51*$I51,0)","v":0},null,{"$f":"IF(SUM(AH$8:AH$11)>0,$E51*$I51,0)","v":0},null,{"$f":"IF(SUM(AJ$8:AJ$11)>0,$E51*$I51,0)","v":0},null,{"$f":"IF(SUM(AL$8:AL$11)>0,$E51*$I51,0)","v":0},null,{"$f":"IF(SUM(AN$8:AN$11)>0,$E51*$I51,0)","v":0},null,{"$f":"IF(SUM(AP$8:AP$11)>0,$E51*$I51,0)","v":0},null,{"$f":"IF(SUM(AR$8:AR$11)>0,$E51*$I51,0)","v":0},null,{"$f":"IF(SUM(AT$8:AT$11)>0,$E51*$I51,0)","v":0},null,{"$f":"IF(SUM(AV$8:AV$11)>0,$E51*$I51,0)","v":0},null,{"$f":"IF(SUM(AX$8:AX$11)>0,$E51*$I51,0)","v":0},null,{"$f":"IF(SUM(AZ$8:AZ$11)>0,$E51*$I51,0)","v":0},null,{"$f":"IF(SUM(BB$8:BB$11)>0,$E51*$I51,0)","v":0},null,{"$f":"IF(SUM(BD$8:BD$11)>0,$E51*$I51,0)","v":0},null,{"$f":"IF(SUM(BF$8:BF$11)>0,$E51*$I51,0)","v":0},null,{"$f":"IF(SUM(BH$8:BH$11)>0,$E51*$I51,0)","v":0},null,{"$f":"IF(SUM(BJ$8:BJ$11)>0,$E51*$I51,0)","v":0},null,{"$f":"IF(SUM(BL$8:BL$11)>0,$E51*$I51,0)","v":0},null,{"$f":"IF(SUM(BN$8:BN$11)>0,$E51*$I51,0)","v":0},null,{"$f":"IF(SUM(BP$8:BP$11)>0,$E51*$I51,0)","v":0},null,{"$f":"IF(SUM(BR$8:BR$11)>0,$E51*$I51,0)","v":0},null,{"$f":"IF(SUM(BT$8:BT$11)>0,$E51*$I51,0)","v":0},null,{"$f":"IF(SUM(BV$8:BV$11)>0,$E51*$I51,0)","v":0},null,{"$f":"IF(SUM(BX$8:BX$11)>0,$E51*$I51,0)","v":0},null,{"$f":"IF(SUM(BZ$8:BZ$11)>0,$E51*$I51,0)","v":0},null,{"$f":"IF(SUM(CB$8:CB$11)>0,$E51*$I51,0)","v":0},null,{"$f":"IF(SUM(CD$8:CD$11)>0,$E51*$I51,0)","v":0},null,{"$f":"IF(SUM(CF$8:CF$11)>0,$E51*$I51,0)","v":0},null,{"$f":"IF(SUM(CH$8:CH$11)>0,$E51*$I51,0)","v":0},null,{"$f":"IF(SUM(CJ$8:CJ$11)>0,$E51*$I51,0)","v":0},null,{"$f":"IF(SUM(CL$8:CL$11)>0,$E51*$I51,0)","v":0},null,{"$f":"IF(SUM(CN$8:CN$11)>0,$E51*$I51,0)","v":0},null,{"$f":"IF(SUM(CP$8:CP$11)>0,$E51*$I51,0)","v":0},null,{"$f":"IF(SUM(CR$8:CR$11)>0,$E51*$I51,0)","v":0},null,{"$f":"IF(SUM(CT$8:CT$11)>0,$E51*$I51,0)","v":0},null,{"$f":"IF(SUM(CV$8:CV$11)>0,$E51*$I51,0)","v":0},null,{"$f":"IF(SUM(CX$8:CX$11)>0,$E51*$I51,0)","v":0},null,{"$f":"IF(SUM(CZ$8:CZ$11)>0,$E51*$I51,0)","v":0},null,{"$f":"IF(SUM(DB$8:DB$11)>0,$E51*$I51,0)","v":0},null,{"$f":"IF(SUM(DD$8:DD$11)>0,$E51*$I51,0)","v":0},null,{"$f":"IF(SUM(DF$8:DF$11)>0,$E51*$I51,0)","v":0},null,{"$f":"IF(SUM(DH$8:DH$11)>0,$E51*$I51,0)","v":0},null,{"$f":"IF(SUM(DJ$8:DJ$11)>0,$E51*$I51,0)","v":0},null,{"$f":"IF(SUM(DL$8:DL$11)>0,$E51*$I51,0)","v":0},null,{"$f":"IF(SUM(DN$8:DN$11)>0,$E51*$I51,0)","v":0},null,{"$f":"IF(SUM(DP$8:DP$11)>0,$E51*$I51,0)","v":0},null,{"$f":"IF(SUM(DR$8:DR$11)>0,$E51*$I51,0)","v":0},null,{"$f":"IF(SUM(DT$8:DT$11)>0,$E51*$I51,0)","v":0},null,{"$f":"IF(SUM(DV$8:DV$11)>0,$E51*$I51,0)","v":0},null,{"$f":"IF(SUM(DX$8:DX$11)>0,$E51*$I51,0)","v":0},null,{"$f":"IF(SUM(DZ$8:DZ$11)>0,$E51*$I51,0)","v":0}]
[null,null,13,null,4,null,{"$f":"I46+I47","v":{"$error":"#N/A"}},{"$f":"G52*E52","v":{"$error":"#N/A"}},null,null,null,null,{"$f":"IF(SUM(L$45:L$48)>0,$E52*$I52,0)","v":0},null,{"$f":"IF(SUM(N$45:N$48)>0,$E52*$I52,0)","v":0},null,{"$f":"IF(SUM(P$45:P$48)>0,$E52*$I52,0)","v":0},null,{"$f":"IF(SUM(R$45:R$48)>0,$E52*$I52,0)","v":0},null,{"$f":"IF(SUM(T$45:T$48)>0,$E52*$I52,0)","v":0},null,{"$f":"IF(SUM(V$45:V$48)>0,$E52*$I52,0)","v":0},null,{"$f":"IF(SUM(X$45:X$48)>0,$E52*$I52,0)","v":0},null,{"$f":"IF(SUM(Z$45:Z$48)>0,$E52*$I52,0)","v":0},null,{"$f":"IF(SUM(AB$45:AB$48)>0,$E52*$I52,0)","v":0},null,{"$f":"IF(SUM(AD$45:AD$48)>0,$E52*$I52,0)","v":0},null,{"$f":"IF(SUM(AF$45:AF$48)>0,$E52*$I52,0)","v":0},null,{"$f":"IF(SUM(AH$45:AH$48)>0,$E52*$I52,0)","v":0},null,{"$f":"IF(SUM(AJ$45:AJ$48)>0,$E52*$I52,0)","v":0},null,{"$f":"IF(SUM(AL$45:AL$48)>0,$E52*$I52,0)","v":0},null,{"$f":"IF(SUM(AN$45:AN$48)>0,$E52*$I52,0)","v":0},null,{"$f":"IF(SUM(AP$45:AP$48)>0,$E52*$I52,0)","v":0},null,{"$f":"IF(SUM(AR$45:AR$48)>0,$E52*$I52,0)","v":0},null,{"$f":"IF(SUM(AT$45:AT$48)>0,$E52*$I52,0)","v":0},null,{"$f":"IF(SUM(AV$45:AV$48)>0,$E52*$I52,0)","v":0},null,{"$f":"IF(SUM(AX$45:AX$48)>0,$E52*$I52,0)","v":0},null,{"$f":"IF(SUM(AZ$45:AZ$48)>0,$E52*$I52,0)","v":0},null,{"$f":"IF(SUM(BB$45:BB$48)>0,$E52*$I52,0)","v":0},null,{"$f":"IF(SUM(BD$45:BD$48)>0,$E52*$I52,0)","v":0},null,{"$f":"IF(SUM(BF$45:BF$48)>0,$E52*$I52,0)","v":0},null,{"$f":"IF(SUM(BH$45:BH$48)>0,$E52*$I52,0)","v":0},null,{"$f":"IF(SUM(BJ$45:BJ$48)>0,$E52*$I52,0)","v":0},null,{"$f":"IF(SUM(BL$45:BL$48)>0,$E52*$I52,0)","v":0},null,{"$f":"IF(SUM(BN$45:BN$48)>0,$E52*$I52,0)","v":0},null,{"$f":"IF(SUM(BP$45:BP$48)>0,$E52*$I52,0)","v":0},null,{"$f":"IF(SUM(BR$45:BR$48)>0,$E52*$I52,0)","v":0},null,{"$f":"IF(SUM(BT$45:BT$48)>0,$E52*$I52,0)","v":0},null,{"$f":"IF(SUM(BV$45:BV$48)>0,$E52*$I52,0)","v":0},null,{"$f":"IF(SUM(BX$45:BX$48)>0,$E52*$I52,0)","v":0},null,{"$f":"IF(SUM(BZ$45:BZ$48)>0,$E52*$I52,0)","v":0},null,{"$f":"IF(SUM(CB$45:CB$48)>0,$E52*$I52,0)","v":0},null,{"$f":"IF(SUM(CD$45:CD$48)>0,$E52*$I52,0)","v":0},null,{"$f":"IF(SUM(CF$45:CF$48)>0,$E52*$I52,0)","v":0},null,{"$f":"IF(SUM(CH$45:CH$48)>0,$E52*$I52,0)","v":0},null,{"$f":"IF(SUM(CJ$45:CJ$48)>0,$E52*$I52,0)","v":0},null,{"$f":"IF(SUM(CL$45:CL$48)>0,$E52*$I52,0)","v":0},null,{"$f":"IF(SUM(CN$45:CN$48)>0,$E52*$I52,0)","v":0},null,{"$f":"IF(SUM(CP$45:CP$48)>0,$E52*$I52,0)","v":0},null,{"$f":"IF(SUM(CR$45:CR$48)>0,$E52*$I52,0)","v":0},null,{"$f":"IF(SUM(CT$45:CT$48)>0,$E52*$I52,0)","v":0},null,{"$f":"IF(SUM(CV$45:CV$48)>0,$E52*$I52,0)","v":0},null,{"$f":"IF(SUM(CX$45:CX$48)>0,$E52*$I52,0)","v":0},null,{"$f":"IF(SUM(CZ$45:CZ$48)>0,$E52*$I52,0)","v":0},null,{"$f":"IF(SUM(DB$45:DB$48)>0,$E52*$I52,0)","v":0},null,{"$f":"IF(SUM(DD$45:DD$48)>0,$E52*$I52,0)","v":0},null,{"$f":"IF(SUM(DF$45:DF$48)>0,$E52*$I52,0)","v":0},null,{"$f":"IF(SUM(DH$45:DH$48)>0,$E52*$I52,0)","v":0},null,{"$f":"IF(SUM(DJ$45:DJ$48)>0,$E52*$I52,0)","v":0},null,{"$f":"IF(SUM(DL$45:DL$48)>0,$E52*$I52,0)","v":0},null,{"$f":"IF(SUM(DN$45:DN$48)>0,$E52*$I52,0)","v":0},null,{"$f":"IF(SUM(DP$45:DP$48)>0,$E52*$I52,0)","v":0},null,{"$f":"IF(SUM(DR$45:DR$48)>0,$E52*$I52,0)","v":0},null,{"$f":"IF(SUM(DT$45:DT$48)>0,$E52*$I52,0)","v":0},null,{"$f":"IF(SUM(DV$45:DV$48)>0,$E52*$I52,0)","v":0},null,{"$f":"IF(SUM(DX$45:DX$48)>0,$E52*$I52,0)","v":0},null,{"$f":"IF(SUM(DZ$45:DZ$48)>0,$E52*$I52,0)","v":0}]
[null,null,14,null,{"$f":"E52","v":4},null,{"$f":"G52","v":{"$error":"#N/A"}},{"$error":"#N/A"},null,null,null,null,{"$f":"IF(SUM(L$45:L$48)>0,$E53*$I53,0)","v":0},null,{"$f":"IF(SUM(N$45:N$48)>0,$E53*$I53,0)","v":0},null,{"$f":"IF(SUM(P$45:P$48)>0,$E53*$I53,0)","v":0},null,{"$f":"IF(SUM(R$45:R$48)>0,$E53*$I53,0)","v":0},null,{"$f":"IF(SUM(T$45:T$48)>0,$E53*$I53,0)","v":0},null,{"$f":"IF(SUM(V$45:V$48)>0,$E53*$I53,0)","v":0},null,{"$f":"IF(SUM(X$45:X$48)>0,$E53*$I53,0)","v":0},null,{"$f":"IF(SUM(Z$45:Z$48)>0,$E53*$I53,0)","v":0},null,{"$f":"IF(SUM(AB$45:AB$48)>0,$E53*$I53,0)","v":0},null,{"$f":"IF(SUM(AD$45:AD$48)>0,$E53*$I53,0)","v":0},null,0,null,0,null,0,null,0,null,0,null,0,null,0,null,0,null,0,null,0,null,0,null,0,null,0,null,0,null,0,null,0,null,0,null,0,null,0,null,0,null,0,null,0,null,0,null,0,null,0,null,0,null,0,null,0,null,0,null,0,null,0,null,0,null,0,null,0,null,0,null,0,null,0,null,0,null,0,null,0,null,0,null,0,null,0,null,0,null,0,null,0,null,0,null,0,null,0,null,0]
[null,null,15,null,4,null,{"$error":"#N/A"},{"$error":"#N/A"},null,null,null,null,{"$f":"IF(SUM(L$45:L$48)>0,$E54*$I54,0)","v":0},null,{"$f":"IF(SUM(N$45:N$48)>0,$E54*$I54,0)","v":0},null,{"$f":"IF(SUM(P$45:P$48)>0,$E54*$I54,0)","v":0},null,{"$f":"IF(SUM(R$45:R$48)>0,$E54*$I54,0)","v":0},null,{"$f":"IF(SUM(T$45:T$48)>0,$E54*$I54,0)","v":0},null,{"$f":"IF(SUM(V$45:V$48)>0,$E54*$I54,0)","v":0},null,{"$f":"IF(SUM(X$45:X$48)>0,$E54*$I54,0)","v":0},null,{"$f":"IF(SUM(Z$45:Z$48)>0,$E54*$I54,0)","v":0},null,{"$f":"IF(SUM(AB$45:AB$48)>0,$E54*$I54,0)","v":0},null,{"$f":"IF(SUM(AD$45:AD$48)>0,$E54*$I54,0)","v":0},null,0,null,0,null,0,null,0,null,0,null,0,null,0,null,0,null,0,null,0,null,0,null,0,null,0,null,0,null,0,null,0,null,0,null,0,null,0,null,0,null,0,null,0,null,0,null,0,null,0,null,0,null,0,null,0,null,0,null,0,null,0,null,0,null,0,null,0,null,0,null,0,null,0,null,0,null,0,null,0,null,0,null,0,null,0,null,0,null,0,null,0,null,0,null,0,null,0,null,0]
[null,null,"CATEGORIAS",null,null,null,null,null,"QUANTIDADE"]
[null,null,null,null,null,null,null,null,null,null,null,{"$f":"IF($C56=L$4,1,0)","v":0},null,0,null,0,null,0,null,0,null,0,null,0,null,0,null,{"$f":"IF($C56=AB$4,1,0)","v":0},null,0,null,0,null,0,null,0,null,0,null,0,null,0,null,0,null,0,null,0,null,0,null,0,null,0,null,0,null,0,null,0,null,0,null,0,null,0,null,0,null,0,null,0,null,0,null,0,null,0,null,0,null,0,null,0,null,0,null,0,null,0,null,{"$f":"IF($C56=CN$4,1,0)","v":0},null,0,null,0,null,0,null,0,null,0,null,0,null,0,null,0,null,0,null,0,null,0,null,0,null,0,null,0,null,0,null,0,null,0,null,0,null,0]
[null,null,3,{"$f":"HLOOKUP($C57,'Dados Gerais'!$D$5:$BK$10,6)","v":"ENCARREGADO DE SERVIÇO"},null,6,7,null,{"$f":"HLOOKUP($C57,'Dados Gerais'!$D$5:$BK$14,10)","v":13},null,null,0,null,0,null,1,null,{"$f":"IF($C57=R$4,1,0)","v":0},null,0,null,0,null,0,null,0,null,0,null,0,null,0,null,0,null,0,null,0,null,0,null,0,null,0,null,0,null,0,null,0,null,0,null,0,null,0,null,0,null,0,null,0,null,0,null,0,null,0,null,0,null,0,null,0,null,0,null,0,null,0,null,0,null,0,null,0,null,0,null,0,null,0,null,0,null,0,null,0,null,0,null,0,null,0,null,0,null,0,null,0,null,0,null,0,null,0,null,0,null,0,null,0,null,0,null,0,null,0,null,0]
[null,null,4,{"$f":"HLOOKUP($C58,'Dados Gerais'!$D$5:$BK$10,6)","v":"ENCARREGADO DE SERVIÇO COM ADICIONAL DE INSALUBRIDADE"},null,1,1,null,{"$f":"HLOOKUP($C58,'Dados Gerais'!$D$5:$BK$14,10)","v":2},null,null,0,null,0,null,0,null,1,null,0,null,0,null,0,null,0,null,0,null,0,null,{"$f":"IF($C58=AF$4,1,0)","v":0},null,0,null,0,null,0,null,0,null,0,null,0,null,0,null,0,null,0,null,0,null,0,null,0,null,0,null,0,null,0,null,0,null,0,null,0,null,0,null,0,null,0,null,0,null,0,null,0,null,0,null,0,null,0,null,0,null,0,null,0,null,0,null,0,null,0,null,0,null,0,null,0,null,0,null,0,null,0,null,0,null,0,null,0,null,0,null,0,null,0,null,0,null,0,null,0,null,0]
[null,null,5,{"$f":"HLOOKUP($C59,'Dados Gerais'!$D$5:$BK$10,6)","v":"AUXILIAR DE ENCARREGADO"},null,null,{"$f":"HLOOKUP($C59,'Dados Gerais'!$D$5:$BK$14,10)","v":1},null,{"$f":"HLOOKUP($C59,'Dados Gerais'!$D$5:$BK$14,10)","v":1},null,null,0,null,0,null,0,null,0,null,1,null,0,null,0,null,0,null,0,null,0,null,0,null,0,null,0,null,0,null,0,null,0,null,0,null,0,null,0,null,0,null,0,null,0,null,0,null,0,null,0,null,0,null,0,null,0,null,0,null,0,null,0,null,0,null,0,null,0,null,0,null,0,null,0,null,0,null,0,null,0,null,0,null,0,null,0,null,0,null,0,null,0,null,0,null,0,null,0,null,0,null,0,null,0,null,0,null,0,null,0,null,0,null,0,null,0,null,0,null,0]
[null,null,null,null,null,null,null,null,null,null,null,0,null,0,null,0,null,0,null,0,null,0,null,0,null,0,null,0,null,0,null,0,null,0,null,0,null,0,null,0,null,0,null,0,null,0,null,0,null,0,null,0,null,0,null,0,null,0,null,0,null,0,null,0,null,0,null,0,null,0,null,0,null,0,null,0,null,0,null,0,null,0,null,0,null,0,null,0,null,0,null,0,null,0,null,0,null,0,null,0,null,0,null,0,null,0,null,0,null,0,null,0,null,0,null,0,null,0,null,0,null,0,null,0,null,0,null,0,null,0]
[]
[null,null,"ITEM","DESCRIÇÃO","QUANT ANUAL\nPOR POSTO","% ESTIMADO POR GÊNERO","Nº DE POSTOS","QUANT ANUAL\nTOTAL ESTIMADA","VALOR"]
[null,null,null,null,null,null,null,null,null,null,null,null,{"$f":"IF(SUM(L$8:L$11)>0,$E63*$I63,0)","v":0},null,{"$f":"IF(SUM(N$8:N$11)>0,$E63*$I63,0)","v":0},null,{"$f":"IF(SUM(P$8:P$11)>0,$E63*$I63,0)","v":0},null,{"$f":"IF(SUM(R$8:R$11)>0,$E63*$I63,0)","v":0},null,{"$f":"IF(SUM(T$8:T$11)>0,$E63*$I63,0)","v":0},null,{"$f":"IF(SUM(V$8:V$11)>0,$E63*$I63,0)","v":0},null,{"$f":"IF(SUM(X$8:X$11)>0,$E63*$I63,0)","v":0},null,{"$f":"IF(SUM(Z$8:Z$11)>0,$E63*$I63,0)","v":0},null,{"$f":"IF(SUM(AB$8:AB$11)>0,$E63*$I63,0)","v":0},null,{"$f":"IF(SUM(AD$8:AD$11)>0,$E63*$I63,0)","v":0},null,{"$f":"IF(SUM(AF$8:AF$11)>0,$E63*$I63,0)","v":0},null,{"$f":"IF(SUM(AH$8:AH$11)>0,$E63*$I63,0)","v":0},null,{"$f":"IF(SUM(AJ$8:AJ$11)>0,$E63*$I63,0)","v":0},null,{"$f":"IF(SUM(AL$8:AL$11)>0,$E63*$I63,0)","v":0},null,{"$f":"IF(SUM(AN$8:AN$11)>0,$E63*$I63,0)","v":0},null,{"$f":"IF(SUM(AP$8:AP$11)>0,$E63*$I63,0)","v":0},null,{"$f":"IF(SUM(AR$8:AR$11)>0,$E63*$I63,0)","v":0},null,{"$f":"IF(SUM(AT$8:AT$11)>0,$E63*$I63,0)","v":0},null,{"$f":"IF(SUM(AV$8:AV$11)>0,$E63*$I63,0)","v":0},null,{"$f":"IF(SUM(AX$8:AX$11)>0,$E63*$I63,0)","v":0},null,{"$f":"IF(SUM(AZ$8:AZ$11)>0,$E63*$I63,0)","v":0},null,{"$f":"IF(SUM(BB$8:BB$11)>0,$E63*$I63,0)","v":0},null,{"$f":"IF(SUM(BD$8:BD$11)>0,$E63*$I63,0)","v":0},null,{"$f":"IF(SUM(BF$8:BF$11)>0,$E63*$I63,0)","v":0},null,{"$f":"IF(SUM(BH$8:BH$11)>0,$E63*$I63,0)","v":0},null,{"$f":"IF(SUM(BJ$8:BJ$11)>0,$E63*$I63,0)","v":0},null,{"$f":"IF(SUM(BL$8:BL$11)>0,$E63*$I63,0)","v":0},null,{"$f":"IF(SUM(BN$8:BN$11)>0,$E63*$I63,0)","v":0},null,{"$f":"IF(SUM(BP$8:BP$11)>0,$E63*$I63,0)","v":0},null,{"$f":"IF(SUM(BR$8:BR$11)>0,$E63*$I63,0)","v":0},null,{"$f":"IF(SUM(BT$8:BT$11)>0,$E63*$I63,0)","v":0},null,{"$f":"IF(SUM(BV$8:BV$11)>0,$E63*$I63,0)","v":0},null,{"$f":"IF(SUM(BX$8:BX$11)>0,$E63*$I63,0)","v":0},null,{"$f":"IF(SUM(BZ$8:BZ$11)>0,$E63*$I63,0)","v":0},null,{"$f":"IF(SUM(CB$8:CB$11)>0,$E63*$I63,0)","v":0},null,{"$f":"IF(SUM(CD$8:CD$11)>0,$E63*$I63,0)","v":0},null,{"$f":"IF(SUM(CF$8:CF$11)>0,$E63*$I63,0)","v":0},null,{"$f":"IF(SUM(CH$8:CH$11)>0,$E63*$I63,0)","v":0},null,{"$f":"IF(SUM(CJ$8:CJ$11)>0,$E63*$I63,0)","v":0},null,{"$f":"IF(SUM(CL$8:CL$11)>0,$E63*$I63,0)","v":0},null,{"$f":"IF(SUM(CN$8:CN$11)>0,$E63*$I63,0)","v":0},null,{"$f":"IF(SUM(CP$8:CP$11)>0,$E63*$I63,0)","v":0},null,{"$f":"IF(SUM(CR$8:CR$11)>0,$E63*$I63,0)","v":0},null,{"$f":"IF(SUM(CT$8:CT$11)>0,$E63*$I63,0)","v":0},null,{"$f":"IF(SUM(CV$8:CV$11)>0,$E63*$I63,0)","v":0},null,{"$f":"IF(SUM(CX$8:CX$11)>0,$E63*$I63,0)","v":0},null,{"$f":"IF(SUM(CZ$8:CZ$11)>0,$E63*$I63,0)","v":0},null,{"$f":"IF(SUM(DB$8:DB$11)>0,$E63*$I63,0)","v":0},null,{"$f":"IF(SUM(DD$8:DD$11)>0,$E63*$I63,0)","v":0},null,{"$f":"IF(SUM(DF$8:DF$11)>0,$E63*$I63,0)","v":0},null,{"$f":"IF(SUM(DH$8:DH$11)>0,$E63*$I63,0)","v":0},null,{"$f":"IF(SUM(DJ$8:DJ$11)>0,$E63*$I63,0)","v":0},null,{"$f":"IF(SUM(DL$8:DL$11)>0,$E63*$I63,0)","v":0},null,{"$f":"IF(SUM(DN$8:DN$11)>0,$E63*$I63,0)","v":0},null,{"$f":"IF(SUM(DP$8:DP$11)>0,$E63*$I63,0)","v":0},null,{"$f":"IF(SUM(DR$8:DR$11)>0,$E63*$I63,0)","v":0},null,{"$f":"IF(SUM(DT$8:DT$11)>0,$E63*$I63,0)","v":0},null,{"$f":"IF(SUM(DV$8:DV$11)>0,$E63*$I63,0)","v":0},null,{"$f":"IF(SUM(DX$8:DX$11)>0,$E63*$I63,0)","v":0},null,{"$f":"IF(SUM(DZ$8:DZ$11)>0,$E63*$I63,0)","v":0}]
[null,null,"MASCULINO","Calça social de tecido leve, na cor preta, em microfibra",4,{"$f":"ROUNDUP(9/16,2)","v":0.57000000000000006},{"$f":"SUM($I$57:$I$59)","v":16},{"$f":"ROUNDUP(E64*F64*G64,0)","v":37},74.5,null,null,null,{"$f":"IF(SUM(L$56:L$60)>0,$H64*$I64,0)/SUM($I$57:$I59)","v":0},null,{"$f":"IF(SUM(N$56:N$60)>0,$H64*$I64,0)/SUM($I$57:$I59)","v":0},null,{"$f":"IF(SUM(P$56:P$60)>0,$H64*$I64,0)/SUM($I$57:$I$59)","v":172.28125},null,{"$f":"IF(SUM(R$56:R$60)>0,$H64*$I64,0)/SUM($I$57:$I$59)","v":172.28125},null,{"$f":"IF(SUM(T$56:T$60)>0,$H64*$I64,0)/SUM($I$57:$I$59)","v":172.28125},null,{"$f":"IF(SUM(V$56:V$60)>0,$H64*$I64,0)","v":0},null,{"$f":"IF(SUM(X$56:X$60)>0,$H64*$I64,0)","v":0},null,{"$f":"IF(SUM(Z$56:Z$60)>0,$H64*$I64,0)","v":0},null,{"$f":"IF(SUM(AB$56:AB$60)>0,$H64*$I64,0)","v":0},null,{"$f":"IF(SUM(AD$56:AD$60)>0,$H64*$I64,0)","v":0},null,0,null,0,null,0,null,0,null,0,null,0,null,0,null,{"$f":"IF(SUM(AT$56:AT$60)>0,$H64*$I64,0)","v":0},null,0,null,0,null,0,null,0,null,0,null,0,null,0,null,0,null,0,null,0,null,0,null,0,null,0,null,0,null,0,null,0,null,0,null,0,null,0,null,0,null,0,null,0,null,0,null,0,null,0,null,0,null,0,null,0,null,0,null,0,null,0,null,{"$f":"IF(SUM(DF$56:DF$60)>0,$H64*$I64,0)","v":0},null,0,null,0,null,0,null,0,null,0,null,0,null,0,null,0,null,0,null,0]
[null,null,null,"Camisa social branca, tecido leve em algodão",4,{"$f":"F64","v":0.57000000000000006},{"$f":"SUM($I$57:$I$59)","v":16},{"$f":"ROUNDUP(E65*F65*G65,0)","v":37},{"$f":"I16","v":89.1},null,null,null,{"$f":"IF(SUM(L$56:L$60)>0,$H65*$I65,0)/SUM($I$57:$I60)","v":0},null,{"$f":"IF(SUM(N$56:N$60)>0,$H65*$I65,0)/SUM($I$57:$I60)","v":0},null,{"$f":"IF(SUM(P$56:P$60)>0,$H65*$I65,0)/SUM($I$57:$I$59)","v":206.04374999999999},null,206.04374999999999,null,{"$f":"IF(SUM(T$56:T$60)>0,$H65*$I65,0)/SUM($I$57:$I$59)","v":206.04374999999999},null,0,null,0,null,0,null,0,null,0,null,{"$f":"IF(SUM(AF$56:AF$60)>0,$H65*$I65,0)","v":0},null,0,null,0,null,0,null,0,null,0,null,0,null,0,null,0,null,0,null,0,null,0,null,0,null,0,null,0,null,0,null,0,null,0,null,0,null,0,null,0,null,0,null,0,null,0,null,0,null,0,null,0,null,0,null,0,null,0,null,0,null,0,null,0,null,0,null,0,null,0,null,0,null,0,null,0,null,0,null,0,null,0,null,0,null,0,null,0,null,0,null,0,null,0,null,0,null,0]
[null,null,null,"Gravata na cor preta, tecido em poliéster",4,{"$f":"F65","v":0.57000000000000006},16,{"$f":"ROUNDUP(E66*F66*G66,0)","v":37},{"$f":"I17","v":33.49},null,null,null,{"$f":"IF(SUM(L$56:L$60)>0,$H66*$I66,0)/SUM($I$57:$I61)","v":0},null,{"$f":"IF(SUM(N$56:N$60)>0,$H66*$I66,0)/SUM($I$57:$I61)","v":0},null,77.445625000000007,null,77.445625000000007,null,{"$f":"IF(SUM(T$56:T$60)>0,$H66*$I66,0)/SUM($I$57:$I$59)","v":77.445625000000007},null,0,null,0,null,0,null,0,null,0,null,0,null,0,null,0,null,0,null,0,null,0,null,0,null,0,null,0,null,0,null,0,null,0,null,0,null,0,null,0,null,0,null,0,null,0,null,0,null,0,null,0,null,0,null,0,null,0,null,0,null,0,null,0,null,0,null,0,null,0,null,0,null,0,null,0,null,0,null,0,null,0,null,0,null,0,null,0,null,0,null,0,null,0,null,0,null,0,null,0,null,0,null,0,null,0,null,0,null,0]
[null,null,null,"Cinto em couro na cor preta",2,{"$f":"F65","v":0.57000000000000006},16,19,{"$f":"I18","v":35.5},null,null,null,{"$f":"IF(SUM(L$56:L$60)>0,$H67*$I67,0)/SUM($I$57:$I62)","v":0},null,{"$f":"IF(SUM(N$56:N$60)>0,$H67*$I67,0)/SUM($I$57:$I62)","v":0},null,42.15625,null,42.15625,null,{"$f":"IF(SUM(T$56:T$60)>0,$H67*$I67,0)/SUM($I$57:$I$59)","v":42.15625},null,0,null,0,null,0,null,0,null,0,null,0,null,0,null,0,null,0,null,0,null,0,null,0,null,0,null,0,null,0,null,0,null,0,null,0,null,0,null,0,null,0,null,0,null,0,null,0,null,0,null,0,null,0,null,0,null,0,null,0,null,0,null,0,null,0,null,0,null,0,null,0,null,0,null,0,null,0,null,0,null,0,null,0,null,0,null,0,null,0,null,0,null,0,null,0,null,0,null,0,null,0,null,0,null,0,null,0,null,0]
[null,null,null,"Meia social na cor preta",4,{"$f":"F66","v":0.57000000000000006},16,{"$f":"ROUNDUP(E68*F68*G68,0)","v":37},14.5,null,null,null,{"$f":"IF(SUM(L$56:L$60)>0,$H68*$I68,0)/SUM($I$57:$I63)","v":0},null,{"$f":"IF(SUM(N$56:N$60)>0,$H68*$I68,0)/SUM($I$57:$I63)","v":0},null,33.53125,null,33.53125,null,{"$f":"IF(SUM(T$56:T$60)>0,$H68*$I68,0)/SUM($I$57:$I$59)","v":33.53125},null,0,null,0,null,0,null,0,null,0,null,0,null,0,null,0,null,0,null,0,null,0,null,0,null,0,null,0,null,0,null,0,null,0,null,0,null,0,null,0,null,0,null,0,null,0,null,0,null,0,null,0,null,0,null,0,null,0,null,0,null,0,null,0,null,0,null,0,null,0,null,0,null,0,null,0,null,0,null,0,null,0,null,0,null,0,null,0,null,0,null,0,null,0,null,0,null,0,null,0,null,0,null,0,null,0,null,0,null,0]
[null,null,null,"Sapato social preto, em couro acolchoado, com solo antiderrapante",4,0.57000000000000006,16,{"$f":"ROUNDUP(E69*F69*G69,0)","v":37},93.633333333333326,null,null,null,{"$f":"IF(SUM(L$56:L$60)>0,$H69*$I69,0)/SUM($I$57:$I64)","v":0},null,{"$f":"IF(SUM(N$56:N$60)>0,$H69*$I69,0)/SUM($I$57:$I64)","v":0},null,216.52708333333331,null,216.52708333333331,null,{"$f":"IF(SUM(T$56:T$60)>0,$H69*$I69,0)/SUM($I$57:$I$59)","v":216.52708333333331},null,0,null,0,null,0,null,0,null,0,null,0,null,0,null,0,null,0,null,0,null,0,null,0,null,0,null,0,null,0,null,0,null,0,null,0,null,0,null,0,null,0,null,0,null,0,null,0,null,0,null,0,null,0,null,0,null,0,null,0,null,0,null,0,null,0,null,0,null,0,null,0,null,0,null,0,null,0,null,0,null,0,null,0,null,0,null,0,null,0,null,0,null,0,null,0,null,0,null,0,null,0,null,0,null,0,null,0,null,0]
[null,null,"FEMININO","Saia de tecido leve, na cor preta, em microfibra",{"$f":"E64","v":4},{"$f":"100%-F69","v":0.42999999999999994},16,28,63.3,null,null,null,{"$f":"IF(SUM(L$56:L$60)>0,$H70*$I70,0)/SUM($I$57:$I65)","v":0},null,{"$f":"IF(SUM(N$56:N$60)>0,$H70*$I70,0)/SUM($I$57:$I65)","v":0},null,110.77499999999999,null,110.77499999999999,null,{"$f":"IF(SUM(T$56:T$60)>0,$H70*$I70,0)/SUM($I$57:$I$59)","v":110.77499999999999},null,0,null,0,null,0,null,0,null,0,null,0,null,0,null,0,null,0,null,0,null,0,null,0,null,0,null,0,null,0,null,0,null,0,null,0,null,0,null,0,null,0,null,0,null,0,null,0,null,0,null,0,null,0,null,0,null,0,null,0,null,0,null,0,null,0,null,0,null,0,null,0,null,0,null,0,null,0,null,0,null,0,null,0,null,0,null,0,null,0,null,0,null,0,null,0,null,0,null,0,null,0,null,0,null,0,null,0,null,0]
[null,null,null,"Blusa social branca, tecido leve em algodão",{"$f":"E65","v":4},{"$f":"F70","v":0.42999999999999994},16,28,{"$f":"I22","v":81.217500000000001},null,null,null,{"$f":"IF(SUM(L$56:L$60)>0,$H71*$I71,0)/SUM($I$57:$I66)","v":0},null,{"$f":"IF(SUM(N$56:N$60)>0,$H71*$I71,0)/SUM($I$57:$I66)","v":0},null,142.13062500000001,null,142.13062500000001,null,{"$f":"IF(SUM(T$56:T$60)>0,$H71*$I71,0)/SUM($I$57:$I$59)","v":142.13062500000001},null,0,null,0,null,0,null,0,null,0,null,0,null,0,null,0,null,0,null,0,null,0,null,0,null,0,null,0,null,0,null,0,null,0,null,0,null,0,null,0,null,0,null,0,null,0,null,0,null,0,null,0,null,0,null,0,null,0,null,0,null,0,null,0,null,0,null,0,null,0,null,0,null,0,null,0,null,0,null,0,null,0,null,0,null,0,null,0,null,0,null,0,null,0,null,0,null,0,null,0,null,0,null,0,null,0,null,0,null,0]
[null,null,null,"Lenço na cor preta, tecido em poliéster",4,{"$f":"F71","v":0.42999999999999994},16,28,{"$f":"I23","v":34.950000000000003},null,null,null,{"$f":"IF(SUM(L$56:L$60)>0,$H72*$I72,0)/SUM($I$57:$I67)","v":0},null,{"$f":"IF(SUM(N$56:N$60)>0,$H72*$I72,0)/SUM($I$57:$I67)","v":0},null,61.162500000000009,null,61.162500000000009,null,{"$f":"IF(SUM(T$56:T$60)>0,$H72*$I72,0)/SUM($I$57:$I$59)","v":61.162500000000009},null,0,null,0,null,0,null,0,null,0,null,0,null,0,null,0,null,0,null,0,null,0,null,0,null,0,null,0,null,0,null,0,null,0,null,0,null,0,null,0,null,0,null,0,null,0,null,0,null,0,null,0,null,0,null,0,null,0,null,0,null,0,null,0,null,0,null,0,null,0,null,0,null,{"$f":"IF(SUM(CP$56:CP$60)>0,$H72*$I72,0)","v":0},null,0,null,0,null,0,null,0,null,0,null,0,null,0,null,0,null,0,null,0,null,0,null,0,null,0,null,0,null,0,null,0,null,0,null,0]
[null,null,null,"Cinto em couro na cor preta",2,0.42999999999999994,16,{"$f":"ROUNDUP(E73*F73*G73,0)","v":14},36.5,null,null,null,{"$f":"IF(SUM(L$56:L$60)>0,$H73*$I73,0)/SUM($I$57:$I68)","v":0},null,{"$f":"IF(SUM(N$56:N$60)>0,$H73*$I73,0)/SUM($I$57:$I68)","v":0},null,31.9375,null,31.9375,null,{"$f":"IF(SUM(T$56:T$60)>0,$H73*$I73,0)/SUM($I$57:$I$59)","v":31.9375},null,0,null,0,null,0,null,0,null,0,null,{"$f":"IF(SUM(AF$56:AF$60)>0,$H73*$I73,0)","v":0},null,0,null,0,null,0,null,0,null,0,null,0,null,0,null,0,null,0,null,0,null,0,null,0,null,0,null,0,null,0,null,0,null,0,null,0,null,0,null,0,null,0,null,0,null,0,null,0,null,0,null,0,null,0,null,0,null,0,null,0,null,0,null,0,null,0,null,0,null,0,null,0,null,0,null,0,null,0,null,0,null,0,null,0,null,0,null,0,null,0,null,0,null,0,null,0,null,0]
[null,null,null,"Meia social na cor preta",4,0.42999999999999994,16,28,25.95,null,null,null,{"$f":"IF(SUM(L$56:L$60)>0,$H74*$I74,0)/SUM($I$57:$I69)","v":0},null,{"$f":"IF(SUM(N$56:N$60)>0,$H74*$I74,0)/SUM($I$57:$I69)","v":0},null,45.412500000000001,null,45.412500000000001,null,{"$f":"IF(SUM(T$56:T$60)>0,$H74*$I74,0)/SUM($I$57:$I$59)","v":45.412500000000001},null,0,null,0,null,0,null,0,null,0,null,0,null,0,null,0,null,0,null,0,null,0,null,0,null,0,null,0,null,0,null,0,null,0,null,0,null,0,null,0,null,0,null,0,null,0,null,0,null,0,null,0,null,0,null,0,null,0,null,0,null,0,null,0,null,0,null,0,null,0,null,0,null,0,null,0,null,0,null,0,null,0,null,0,null,0,null,0,null,0,null,0,null,0,null,0,null,0,null,0,null,0,null,0,null,0,null,0,null,0]
[null,null,null,"Sapato social preto, em couro acolchoado, com solo antiderrapante",4,0.42999999999999994,16,28,149.96666666666667,null,null,null,{"$f":"IF(SUM(L$56:L$60)>0,$H75*$I75,0)/SUM($I$57:$I70)","v":0},null,{"$f":"IF(SUM(N$56:N$60)>0,$H75*$I75,0)/SUM($I$57:$I70)","v":0},null,262.44166666666666,null,262.44166666666666,null,{"$f":"IF(SUM(T$56:T$60)>0,$H75*$I75,0)/SUM($I$57:$I$59)","v":262.44166666666666},null,0,null,0,null,0,null,0,null,0,null,0,null,0,null,0,null,0,null,0,null,0,null,0,null,0,null,0,null,0,null,0,null,0,null,0,null,0,null,0,null,0,null,0,null,0,null,0,null,0,null,0,null,0,null,0,null,0,null,0,null,0,null,0,null,0,null,0,null,0,null,0,null,0,null,0,null,0,null,0,null,0,null,0,null,0,null,0,null,0,null,0,null,0,null,0,null,0,null,0,null,0,null,0,null,0,null,0,null,0]
[null,null,null,null,null,null,null,null,null,null,null,null,{"$f":"IF(SUM(L$8:L$11)>0,$E76*$I76,0)","v":0},null,{"$f":"IF(SUM(N$8:N$11)>0,$E76*$I76,0)","v":0},null,0,null,0,null,{"$f":"IF(SUM(T$56:T$60)>0,$H76*$I76,0)/SUM($I$57:$I$59)","v":0},null,{"$f":"IF(SUM(V$8:V$11)>0,$E76*$I76,0)","v":0},null,{"$f":"IF(SUM(X$8:X$11)>0,$E76*$I76,0)","v":0},null,{"$f":"IF(SUM(Z$8:Z$11)>0,$E76*$I76,0)","v":0},null,{"$f":"IF(SUM(AB$8:AB$11)>0,$E76*$I76,0)","v":0},null,{"$f":"IF(SUM(AD$8:AD$11)>0,$E76*$I76,0)","v":0},null,{"$f":"IF(SUM(AF$8:AF$11)>0,$E76*$I76,0)","v":0},null,{"$f":"IF(SUM(AH$8:AH$11)>0,$E76*$I76,0)","v":0},null,{"$f":"IF(SUM(AJ$8:AJ$11)>0,$E76*$I76,0)","v":0},null,{"$f":"IF(SUM(AL$8:AL$11)>0,$E76*$I76,0)","v":0},null,{"$f":"IF(SUM(AN$8:AN$11)>0,$E76*$I76,0)","v":0},null,{"$f":"IF(SUM(AP$8:AP$11)>0,$E76*$I76,0)","v":0},null,{"$f":"IF(SUM(AR$8:AR$11)>0,$E76*$I76,0)","v":0},null,{"$f":"IF(SUM(AT$8:AT$11)>0,$E76*$I76,0)","v":0},null,{"$f":"IF(SUM(AV$8:AV$11)>0,$E76*$I76,0)","v":0},null,{"$f":"IF(SUM(AX$8:AX$11)>0,$E76*$I76,0)","v":0},null,{"$f":"IF(SUM(AZ$8:AZ$11)>0,$E76*$I76,0)","v":0},null,{"$f":"IF(SUM(BB$8:BB$11)>0,$E76*$I76,0)","v":0},null,{"$f":"IF(SUM(BD$8:BD$11)>0,$E76*$I76,0)","v":0},null,{"$f":"IF(SUM(BF$8:BF$11)>0,$E76*$I76,0)","v":0},null,{"$f":"IF(SUM(BH$8:BH$11)>0,$E76*$I76,0)","v":0},null,{"$f":"IF(SUM(BJ$8:BJ$11)>0,$E76*$I76,0)","v":0},null,{"$f":"IF(SUM(BL$8:BL$11)>0,$E76*$I76,0)","v":0},null,{"$f":"IF(SUM(BN$8:BN$11)>0,$E76*$I76,0)","v":0},null,{"$f":"IF(SUM(BP$8:BP$11)>0,$E76*$I76,0)","v":0},null,{"$f":"IF(SUM(BR$8:BR$11)>0,$E76*$I76,0)","v":0},null,{"$f":"IF(SUM(BT$8:BT$11)>0,$E76*$I76,0)","v":0},null,{"$f":"IF(SUM(BV$8:BV$11)>0,$E76*$I76,0)","v":0},null,{"$f":"IF(SUM(BX$8:BX$11)>0,$E76*$I76,0)","v":0},null,{"$f":"IF(SUM(BZ$8:BZ$11)>0,$E76*$I76,0)","v":0},null,{"$f":"IF(SUM(CB$8:CB$11)>0,$E76*$I76,0)","v":0},null,{"$f":"IF(SUM(CD$8:CD$11)>0,$E76*$I76,0)","v":0},null,{"$f":"IF(SUM(CF$8:CF$11)>0,$E76*$I76,0)","v":0},null,{"$f":"IF(SUM(CH$8:CH$11)>0,$E76*$I76,0)","v":0},null,{"$f":"IF(SUM(CJ$8:CJ$11)>0,$E76*$I76,0)","v":0},null,{"$f":"IF(SUM(CL$8:CL$11)>0,$E76*$I76,0)","v":0},null,{"$f":"IF(SUM(CN$8:CN$11)>0,$E76*$I76,0)","v":0},null,{"$f":"IF(SUM(CP$8:CP$11)>0,$E76*$I76,0)","v":0},null,{"$f":"IF(SUM(CR$8:CR$11)>0,$E76*$I76,0)","v":0},null,{"$f":"IF(SUM(CT$8:CT$11)>0,$E76*$I76,0)","v":0},null,{"$f":"IF(SUM(CV$8:CV$11)>0,$E76*$I76,0)","v":0},null,{"$f":"IF(SUM(CX$8:CX$11)>0,$E76*$I76,0)","v":0},null,{"$f":"IF(SUM(CZ$8:CZ$11)>0,$E76*$I76,0)","v":0},null,{"$f":"IF(SUM(DB$8:DB$11)>0,$E76*$I76,0)","v":0},null,{"$f":"IF(SUM(DD$8:DD$11)>0,$E76*$I76,0)","v":0},null,{"$f":"IF(SUM(DF$8:DF$11)>0,$E76*$I76,0)","v":0},null,{"$f":"IF(SUM(DH$8:DH$11)>0,$E76*$I76,0)","v":0},null,{"$f":"IF(SUM(DJ$8:DJ$11)>0,$E76*$I76,0)","v":0},null,{"$f":"IF(SUM(DL$8:DL$11)>0,$E76*$I76,0)","v":0},null,{"$f":"IF(SUM(DN$8:DN$11)>0,$E76*$I76,0)","v":0},null,{"$f":"IF(SUM(DP$8:DP$11)>0,$E76*$I76,0)","v":0},null,{"$f":"IF(SUM(DR$8:DR$11)>0,$E76*$I76,0)","v":0},null,{"$f":"IF(SUM(DT$8:DT$11)>0,$E76*$I76,0)","v":0},null,{"$f":"IF(SUM(DV$8:DV$11)>0,$E76*$I76,0)","v":0},null,{"$f":"IF(SUM(DX$8:DX$11)>0,$E76*$I76,0)","v":0},null,{"$f":"IF(SUM(DZ$8:DZ$11)>0,$E76*$I76,0)","v":0}]
[]
[null,null,"CATEGORIAS",null,null,null,null,null,"QUANTIDADE"]
[null,null,null,null,null,null,null,null,null,null,null,{"$f":"IF($C79=L$4,1,0)","v":0},null,0,null,0,null,0,null,0,null,0,null,0,null,0,null,{"$f":"IF($C79=AB$4,1,0)","v":0},null,0,null,0,null,0,null,0,null,{"$f":"IF($C79=AL$4,1,0)","v":0},null,0,null,0,null,0,null,0,null,0,null,0,null,0,null,0,null,0,null,0,null,0,null,0,null,0,null,0,null,0,null,0,null,0,null,0,null,0,null,0,null,0,null,0,null,0,null,0,null,0,null,0,null,0,null,0,null,0,null,0,null,0,null,{"$f":"IF($C79=CX$4,1,0)","v":0},null,0,null,0,null,0,null,0,null,0,null,0,null,0,null,0,null,0,null,0,null,0,null,0,null,0,null,0]
[null,null,6,{"$f":"HLOOKUP($C80,'Dados Gerais'!$D$5:$BK$10,6)","v":"ALMOXARIFE"},null,1,1,null,{"$f":"HLOOKUP($C80,'Dados Gerais'!$D$5:$BK$14,10)","v":2},null,null,0,null,0,null,0,null,0,null,0,null,1,null,0,null,0,null,0,null,0,null,{"$f":"IF($C80=AF$4,1,0)","v":0},null,0,null,0,null,0,null,0,null,0,null,0,null,0,null,0,null,0,null,0,null,0,null,0,null,0,null,0,null,0,null,0,null,0,null,0,null,0,null,0,null,0,null,0,null,0,null,0,null,0,null,0,null,0,null,0,null,0,null,0,null,0,null,0,null,0,null,0,null,0,null,0,null,0,null,0,null,0,null,0,null,0,null,0,null,0,null,0,null,0,null,0,null,0,null,0,null,0]
[null,null,7,{"$f":"HLOOKUP($C81,'Dados Gerais'!$D$5:$BK$10,6)","v":"SERVENTE"},null,{"$f":"I81-G81","v":87},64,null,{"$f":"HLOOKUP($C81,'Dados Gerais'!$D$5:$BK$14,10)","v":151},null,null,0,null,0,null,0,null,0,null,0,null,{"$f":"IF($C81=V$4,1,0)","v":0},null,1,null,0,null,0,null,0,null,0,null,0,null,0,null,0,null,0,null,0,null,0,null,0,null,0,null,0,null,0,null,0,null,0,null,0,null,0,null,0,null,0,null,0,null,0,null,0,null,0,null,0,null,0,null,0,null,0,null,0,null,0,null,0,null,0,null,0,null,0,null,0,null,0,null,0,null,0,null,0,null,0,null,0,null,0,null,0,null,0,null,0,null,0,null,0,null,0,null,0,null,0,null,0,null,0,null,0]
[null,null,8,{"$f":"HLOOKUP($C82,'Dados Gerais'!$D$5:$BK$10,6)","v":"SERVENTE COM ADICIONAL DE INSALUBRIDADE"},null,{"$f":"I82-G82","v":15},10,null,{"$f":"HLOOKUP($C82,'Dados Gerais'!$D$5:$BK$14,10)","v":25},null,null,0,null,0,null,0,null,0,null,0,null,0,null,0,null,1,null,0,null,0,null,{"$f":"IF($C82=AF$4,1,0)","v":0},null,0,null,0,null,0,null,0,null,0,null,0,null,0,null,0,null,0,null,0,null,0,null,0,null,0,null,0,null,0,null,0,null,0,null,0,null,0,null,0,null,0,null,0,null,0,null,0,null,0,null,0,null,0,null,0,null,0,null,0,null,0,null,0,null,0,null,0,null,0,null,0,null,0,null,0,null,0,null,0,null,0,null,0,null,0,null,0,null,0,null,0,null,0,null,0,null,0]
[null,null,9,{"$f":"HLOOKUP($C83,'Dados Gerais'!$D$5:$BK$10,6)","v":"SERVENTE COM ADICIONAL DE INSALUBRIDADE E ADICIONAL NOTURNO"},null,-1,3,null,{"$f":"HLOOKUP($C83,'Dados Gerais'!$D$5:$BK$14,10)","v":2},null,null,0,null,0,null,0,null,0,null,0,null,0,null,0,null,0,null,1,null,0,null,0,null,0,null,0,null,0,null,0,null,0,null,0,null,0,null,0,null,0,null,0,null,0,null,0,null,0,null,0,null,0,null,0,null,0,null,0,null,0,null,0,null,0,null,0,null,0,null,0,null,0,null,0,null,0,null,0,null,0,null,0,null,0,null,0,null,0,null,0,null,0,null,0,null,0,null,0,null,0,null,0,null,0,null,0,null,0,null,0,null,0,null,0,null,0,null,0,null,0]
[null,null,null,null,null,null,null,null,null,null,null,0,null,0,null,0,null,0,null,0,null,0,null,0,null,0,null,0,null,0,null,0,null,0,null,0,null,0,null,0,null,0,null,0,null,0,null,0,null,0,null,0,null,0,null,0,null,0,null,0,null,0,null,0,null,0,null,0,null,0,null,0,null,0,null,0,null,0,null,0,null,0,null,0,null,0,null,0,null,0,null,0,null,0,null,0,null,0,null,0,null,0,null,0,null,0,null,0,null,0,null,0,null,0,null,0,null,0,null,0,null,0,null,0,null,0,null,0,null,0]
[]
[null,null,"ITEM","DESCRIÇÃO","QUANT ANUAL\nPOR POSTO","% ESTIMADO POR GÊNERO","Nº DE POSTOS","QUANT ANUAL\nTOTAL ESTIMADA","VALOR"]
[null,null,null,null,null,null,null,null,null,null,null,null,{"$f":"IF(SUM(L$8:L$11)>0,$E87*$I87,0)","v":0},null,{"$f":"IF(SUM(N$8:N$11)>0,$E87*$I87,0)","v":0},null,0,null,0,null,{"$f":"IF(SUM(T$56:T$60)>0,$H87*$I87,0)/SUM($I$57:$I$59)","v":0},null,{"$f":"IF(SUM(V$8:V$11)>0,$E87*$I87,0)","v":0},null,{"$f":"IF(SUM(X$8:X$11)>0,$E87*$I87,0)","v":0},null,{"$f":"IF(SUM(Z$8:Z$11)>0,$E87*$I87,0)","v":0},null,{"$f":"IF(SUM(AB$8:AB$11)>0,$E87*$I87,0)","v":0},null,{"$f":"IF(SUM(AD$8:AD$11)>0,$E87*$I87,0)","v":0},null,{"$f":"IF(SUM(AF$8:AF$11)>0,$E87*$I87,0)","v":0},null,{"$f":"IF(SUM(AH$8:AH$11)>0,$E87*$I87,0)","v":0},null,{"$f":"IF(SUM(AJ$8:AJ$11)>0,$E87*$I87,0)","v":0},null,{"$f":"IF(SUM(AL$8:AL$11)>0,$E87*$I87,0)","v":0},null,{"$f":"IF(SUM(AN$8:AN$11)>0,$E87*$I87,0)","v":0},null,{"$f":"IF(SUM(AP$8:AP$11)>0,$E87*$I87,0)","v":0},null,{"$f":"IF(SUM(AR$8:AR$11)>0,$E87*$I87,0)","v":0},null,{"$f":"IF(SUM(AT$8:AT$11)>0,$E87*$I87,0)","v":0},null,{"$f":"IF(SUM(AV$8:AV$11)>0,$E87*$I87,0)","v":0},null,{"$f":"IF(SUM(AX$8:AX$11)>0,$E87*$I87,0)","v":0},null,{"$f":"IF(SUM(AZ$8:AZ$11)>0,$E87*$I87,0)","v":0},null,{"$f":"IF(SUM(BB$8:BB$11)>0,$E87*$I87,0)","v":0},null,{"$f":"IF(SUM(BD$8:BD$11)>0,$E87*$I87,0)","v":0},null,{"$f":"IF(SUM(BF$8:BF$11)>0,$E87*$I87,0)","v":0},null,{"$f":"IF(SUM(BH$8:BH$11)>0,$E87*$I87,0)","v":0},null,{"$f":"IF(SUM(BJ$8:BJ$11)>0,$E87*$I87,0)","v":0},null,{"$f":"IF(SUM(BL$8:BL$11)>0,$E87*$I87,0)","v":0},null,{"$f":"IF(SUM(BN$8:BN$11)>0,$E87*$I87,0)","v":0},null,{"$f":"IF(SUM(BP$8:BP$11)>0,$E87*$I87,0)","v":0},null,{"$f":"IF(SUM(BR$8:BR$11)>0,$E87*$I87,0)","v":0},null,{"$f":"IF(SUM(BT$8:BT$11)>0,$E87*$I87,0)","v":0},null,{"$f":"IF(SUM(BV$8:BV$11)>0,$E87*$I87,0)","v":0},null,{"$f":"IF(SUM(BX$8:BX$11)>0,$E87*$I87,0)","v":0},null,{"$f":"IF(SUM(BZ$8:BZ$11)>0,$E87*$I87,0)","v":0},null,{"$f":"IF(SUM(CB$8:CB$11)>0,$E87*$I87,0)","v":0},null,{"$f":"IF(SUM(CD$8:CD$11)>0,$E87*$I87,0)","v":0},null,{"$f":"IF(SUM(CF$8:CF$11)>0,$E87*$I87,0)","v":0},null,{"$f":"IF(SUM(CH$8:CH$11)>0,$E87*$I87,0)","v":0},null,{"$f":"IF(SUM(CJ$8:CJ$11)>0,$E87*$I87,0)","v":0},null,{"$f":"IF(SUM(CL$8:CL$11)>0,$E87*$I87,0)","v":0},null,{"$f":"IF(SUM(CN$8:CN$11)>0,$E87*$I87,0)","v":0},null,{"$f":"IF(SUM(CP$8:CP$11)>0,$E87*$I87,0)","v":0},null,{"$f":"IF(SUM(CR$8:CR$11)>0,$E87*$I87,0)","v":0},null,{"$f":"IF(SUM(CT$8:CT$11)>0,$E87*$I87,0)","v":0},null,{"$f":"IF(SUM(CV$8:CV$11)>0,$E87*$I87,0)","v":0},null,{"$f":"IF(SUM(CX$8:CX$11)>0,$E87*$I87,0)","v":0},null,{"$f":"IF(SUM(CZ$8:CZ$11)>0,$E87*$I87,0)","v":0},null,{"$f":"IF(SUM(DB$8:DB$11)>0,$E87*$I87,0)","v":0},null,{"$f":"IF(SUM(DD$8:DD$11)>0,$E87*$I87,0)","v":0},null,{"$f":"IF(SUM(DF$8:DF$11)>0,$E87*$I87,0)","v":0},null,{"$f":"IF(SUM(DH$8:DH$11)>0,$E87*$I87,0)","v":0},null,{"$f":"IF(SUM(DJ$8:DJ$11)>0,$E87*$I87,0)","v":0},null,{"$f":"IF(SUM(DL$8:DL$11)>0,$E87*$I87,0)","v":0},null,{"$f":"IF(SUM(DN$8:DN$11)>0,$E87*$I87,0)","v":0},null,{"$f":"IF(SUM(DP$8:DP$11)>0,$E87*$I87,0)","v":0},null,{"$f":"IF(SUM(DR$8:DR$11)>0,$E87*$I87,0)","v":0},null,{"$f":"IF(SUM(DT$8:DT$11)>0,$E87*$I87,0)","v":0},null,{"$f":"IF(SUM(DV$8:DV$11)>0,$E87*$I87,0)","v":0},null,{"$f":"IF(SUM(DX$8:DX$11)>0,$E87*$I87,0)","v":0},null,{"$f":"IF(SUM(DZ$8:DZ$11)>0,$E87*$I87,0)","v":0}]
[null,null,"MASCULINO","Calça com elástico e bolso laterais, na cor azul marinho, tecido brim 100% algodão",4,{"$f":"ROUNDUP(78/180,2)","v":0.44},{"$f":"SUM($I$80:$I$83)","v":180},{"$f":"ROUNDUP(E88*F88*G88,0)","v":317},59.85,null,null,null,{"$f":"IF(SUM(L$79:L$83)>0,$H88*$I88,0)/SUM($I$80:$I$83)","v":0},null,{"$f":"IF(SUM(N$79:N$83)>0,$H88*$I88,0)/SUM($I$80:$I$83)","v":0},null,{"$f":"IF(SUM(P$79:P$85)>0,$H88*$I88,0)/SUM($I$57:$I$59)","v":0},null,{"$f":"IF(SUM(R$79:R$85)>0,$H88*$I88,0)/SUM($I$57:$I$59)","v":0},null,{"$f":"IF(SUM(T$79:T$85)>0,$H88*$I88,0)/SUM($I$57:$I$59)","v":0},null,{"$f":"IF(SUM(V$79:V$83)>0,$H88*$I88,0)/SUM($I$80:$I$83)","v":105.4025},null,{"$f":"IF(SUM(X$79:X$83)>0,$H88*$I88,0)/SUM($I$80:$I$83)","v":105.4025},null,{"$f":"IF(SUM(Z$79:Z$83)>0,$H88*$I88,0)/SUM($I$80:$I$83)","v":105.4025},null,{"$f":"IF(SUM(AB$79:AB$83)>0,$H88*$I88,0)/SUM($I$80:$I$83)","v":105.4025},null,{"$f":"IF(SUM(AD$79:AD$83)>0,$H88*$I88,0)/SUM($I$80:$I$83)","v":0},null,{"$f":"IF(SUM(AF$79:AF$83)>0,$H88*$I88,0)/SUM($I$80:$I$83)","v":0},null,{"$f":"IF(SUM(AH$79:AH$83)>0,$H88*$I88,0)/SUM($I$80:$I$83)","v":0},null,{"$f":"IF(SUM(AJ$79:AJ$83)>0,$H88*$I88,0)/SUM($I$80:$I$83)","v":0},null,{"$f":"IF(SUM(AL$79:AL$83)>0,$H88*$I88,0)/SUM($I$80:$I$83)","v":0},null,{"$f":"IF(SUM(AN$79:AN$83)>0,$H88*$I88,0)/SUM($I$80:$I$83)","v":0},null,{"$f":"IF(SUM(AP$79:AP$83)>0,$H88*$I88,0)/SUM($I$80:$I$83)","v":0},null,{"$f":"IF(SUM(AR$79:AR$83)>0,$H88*$I88,0)/SUM($I$80:$I$83)","v":0},null,{"$f":"IF(SUM(AT$79:AT$83)>0,$H88*$I88,0)/SUM($I$80:$I$83)","v":0},null,{"$f":"IF(SUM(AV$79:AV$83)>0,$H88*$I88,0)/SUM($I$80:$I$83)","v":0},null,{"$f":"IF(SUM(AX$79:AX$83)>0,$H88*$I88,0)/SUM($I$80:$I$83)","v":0},null,{"$f":"IF(SUM(AZ$79:AZ$83)>0,$H88*$I88,0)/SUM($I$80:$I$83)","v":0},null,{"$f":"IF(SUM(BB$79:BB$83)>0,$H88*$I88,0)/SUM($I$80:$I$83)","v":0},null,{"$f":"IF(SUM(BD$79:BD$83)>0,$H88*$I88,0)/SUM($I$80:$I$83)","v":0},null,{"$f":"IF(SUM(BF$79:BF$83)>0,$H88*$I88,0)/SUM($I$80:$I$83)","v":0},null,{"$f":"IF(SUM(BH$79:BH$83)>0,$H88*$I88,0)/SUM($I$80:$I$83)","v":0},null,{"$f":"IF(SUM(BJ$79:BJ$83)>0,$H88*$I88,0)/SUM($I$80:$I$83)","v":0},null,{"$f":"IF(SUM(BL$79:BL$83)>0,$H88*$I88,0)/SUM($I$80:$I$83)","v":0},null,{"$f":"IF(SUM(BN$79:BN$83)>0,$H88*$I88,0)/SUM($I$80:$I$83)","v":0},null,{"$f":"IF(SUM(BP$79:BP$83)>0,$H88*$I88,0)/SUM($I$80:$I$83)","v":0},null,{"$f":"IF(SUM(BR$79:BR$83)>0,$H88*$I88,0)/SUM($I$80:$I$83)","v":0},null,{"$f":"IF(SUM(BT$79:BT$83)>0,$H88*$I88,0)/SUM($I$80:$I$83)","v":0},null,{"$f":"IF(SUM(BV$79:BV$83)>0,$H88*$I88,0)/SUM($I$80:$I$83)","v":0},null,{"$f":"IF(SUM(BX$79:BX$83)>0,$H88*$I88,0)/SUM($I$80:$I$83)","v":0},null,{"$f":"IF(SUM(BZ$79:BZ$83)>0,$H88*$I88,0)/SUM($I$80:$I$83)","v":0},null,{"$f":"IF(SUM(CB$79:CB$83)>0,$H88*$I88,0)/SUM($I$80:$I$83)","v":0},null,{"$f":"IF(SUM(CD$79:CD$83)>0,$H88*$I88,0)/SUM($I$80:$I$83)","v":0},null,{"$f":"IF(SUM(CF$79:CF$83)>0,$H88*$I88,0)/SUM($I$80:$I$83)","v":0},null,{"$f":"IF(SUM(CH$79:CH$83)>0,$H88*$I88,0)/SUM($I$80:$I$83)","v":0},null,{"$f":"IF(SUM(CJ$79:CJ$83)>0,$H88*$I88,0)/SUM($I$80:$I$83)","v":0},null,{"$f":"IF(SUM(CL$79:CL$83)>0,$H88*$I88,0)/SUM($I$80:$I$83)","v":0},null,{"$f":"IF(SUM(CN$79:CN$83)>0,$H88*$I88,0)/SUM($I$80:$I$83)","v":0},null,{"$f":"IF(SUM(CP$79:CP$83)>0,$H88*$I88,0)/SUM($I$80:$I$83)","v":0},null,{"$f":"IF(SUM(CR$79:CR$83)>0,$H88*$I88,0)/SUM($I$80:$I$83)","v":0},null,{"$f":"IF(SUM(CT$79:CT$83)>0,$H88*$I88,0)/SUM($I$80:$I$83)","v":0},null,{"$f":"IF(SUM(CV$79:CV$83)>0,$H88*$I88,0)/SUM($I$80:$I$83)","v":0},null,{"$f":"IF(SUM(CX$79:CX$83)>0,$H88*$I88,0)/SUM($I$80:$I$83)","v":0},null,{"$f":"IF(SUM(CZ$79:CZ$83)>0,$H88*$I88,0)/SUM($I$80:$I$83)","v":0},null,{"$f":"IF(SUM(DB$79:DB$83)>0,$H88*$I88,0)/SUM($I$80:$I$83)","v":0},null,{"$f":"IF(SUM(DD$79:DD$83)>0,$H88*$I88,0)/SUM($I$80:$I$83)","v":0},null,{"$f":"IF(SUM(DF$79:DF$83)>0,$H88*$I88,0)/SUM($I$80:$I$83)","v":0},null,{"$f":"IF(SUM(DH$79:DH$83)>0,$H88*$I88,0)/SUM($I$80:$I$83)","v":0},null,{"$f":"IF(SUM(DJ$79:DJ$83)>0,$H88*$I88,0)/SUM($I$80:$I$83)","v":0},null,{"$f":"IF(SUM(DL$79:DL$83)>0,$H88*$I88,0)/SUM($I$80:$I$83)","v":0},null,{"$f":"IF(SUM(DN$79:DN$83)>0,$H88*$I88,0)/SUM($I$80:$I$83)","v":0},null,{"$f":"IF(SUM(DP$79:DP$83)>0,$H88*$I88,0)/SUM($I$80:$I$83)","v":0},null,{"$f":"IF(SUM(DR$79:DR$83)>0,$H88*$I88,0)/SUM($I$80:$I$83)","v":0},null,{"$f":"IF(SUM(DT$79:DT$83)>0,$H88*$I88,0)/SUM($I$80:$I$83)","v":0},null,{"$f":"IF(SUM(DV$79:DV$83)>0,$H88*$I88,0)/SUM($I$80:$I$83)","v":0},null,{"$f":"IF(SUM(DX$79:DX$83)>0,$H88*$I88,0)/SUM($I$80:$I$83)","v":0},null,{"$f":"IF(SUM(DZ$79:DZ$83)>0,$H88*$I88,0)/SUM($I$80:$I$83)","v":0}]
[null,null,null,"Camisa nas cores cinza e azul marinho, tecido leve 100% algodão",4,{"$f":"F88","v":0.44},{"$f":"G88","v":180},{"$f":"ROUNDUP(E89*F89*G89,0)","v":317},31.45,null,null,null,{"$f":"IF(SUM(L$79:L$83)>0,$H89*$I89,0)/SUM($I$80:$I$83)","v":0},null,{"$f":"IF(SUM(N$79:N$83)>0,$H89*$I89,0)/SUM($I$80:$I$83)","v":0},null,{"$f":"IF(SUM(P$79:P$85)>0,$H89*$I89,0)/SUM($I$57:$I$59)","v":0},null,0,null,{"$f":"IF(SUM(T$79:T$85)>0,$H89*$I89,0)/SUM($I$57:$I$59)","v":0},null,{"$f":"IF(SUM(V$79:V$83)>0,$H89*$I89,0)/SUM($I$80:$I$83)","v":55.386944444444445},null,55.386944444444445,null,{"$f":"IF(SUM(Z$79:Z$83)>0,$H89*$I89,0)/SUM($I$80:$I$83)","v":55.386944444444445},null,{"$f":"IF(SUM(AB$79:AB$83)>0,$H89*$I89,0)/SUM($I$80:$I$83)","v":55.386944444444445},null,{"$f":"IF(SUM(AD$79:AD$83)>0,$H89*$I89,0)/SUM($I$80:$I$83)","v":0},null,{"$f":"IF(SUM(AF$79:AF$83)>0,$H89*$I89,0)/SUM($I$80:$I$83)","v":0},null,0,null,0,null,0,null,0,null,0,null,0,null,0,null,0,null,0,null,0,null,0,null,0,null,0,null,0,null,0,null,0,null,0,null,0,null,0,null,0,null,0,null,0,null,0,null,0,null,0,null,0,null,0,null,0,null,0,null,0,null,0,null,0,null,0,null,0,null,0,null,0,null,0,null,0,null,0,null,0,null,0,null,0,null,0,null,0,null,0,null,0,null,0,null,0,null,0]
[null,null,null,"Meia social na cor preta",4,{"$f":"F89","v":0.44},{"$f":"G89","v":180},317,{"$f":"I68","v":14.5},null,null,null,0,null,{"$f":"IF(SUM(N$79:N$83)>0,$H90*$I90,0)/SUM($I$80:$I$83)","v":0},null,0,null,0,null,{"$f":"IF(SUM(T$79:T$85)>0,$H90*$I90,0)/SUM($I$57:$I$59)","v":0},null,{"$f":"IF(SUM(V$79:V$83)>0,$H90*$I90,0)/SUM($I$80:$I$83)","v":25.536111111111111},null,25.536111111111111,null,{"$f":"IF(SUM(Z$79:Z$83)>0,$H90*$I90,0)/SUM($I$80:$I$83)","v":25.536111111111111},null,{"$f":"IF(SUM(AB$79:AB$83)>0,$H90*$I90,0)/SUM($I$80:$I$83)","v":25.536111111111111},null,{"$f":"IF(SUM(AD$79:AD$83)>0,$H90*$I90,0)/SUM($I$80:$I$83)","v":0},null,0,null,0,null,0,null,0,null,0,null,0,null,0,null,0,null,0,null,0,null,0,null,0,null,0,null,0,null,0,null,0,null,0,null,0,null,0,null,0,null,0,null,0,null,0,null,0,null,0,null,0,null,0,null,0,null,0,null,0,null,0,null,0,null,0,null,0,null,0,null,0,null,0,null,0,null,0,null,0,null,0,null,0,null,0,null,0,null,0,null,0,null,0,null,0,null,0,null,0]
[null,null,"FEMININO","Calça com elástico e bolso laterais, na cor azul marinho, tecido brim 100% algodão",{"$f":"E88","v":4},{"$f":"100%-F90","v":0.56000000000000005},180,404,59.9,null,null,null,0,null,{"$f":"IF(SUM(N$79:N$83)>0,$H91*$I91,0)/SUM($I$80:$I$83)","v":0},null,0,null,0,null,{"$f":"IF(SUM(T$79:T$85)>0,$H91*$I91,0)/SUM($I$57:$I$59)","v":0},null,{"$f":"IF(SUM(V$79:V$83)>0,$H91*$I91,0)/SUM($I$80:$I$83)","v":134.44222222222223},null,134.44222222222223,null,{"$f":"IF(SUM(Z$79:Z$83)>0,$H91*$I91,0)/SUM($I$80:$I$83)","v":134.44222222222223},null,{"$f":"IF(SUM(AB$79:AB$83)>0,$H91*$I91,0)/SUM($I$80:$I$83)","v":134.44222222222223},null,{"$f":"IF(SUM(AD$79:AD$83)>0,$H91*$I91,0)/SUM($I$80:$I$83)","v":0},null,0,null,0,null,0,null,0,null,0,null,0,null,0,null,0,null,0,null,0,null,0,null,0,null,0,null,0,null,0,null,0,null,0,null,0,null,0,null,0,null,0,null,0,null,0,null,0,null,0,null,0,null,0,null,0,null,0,null,0,null,0,null,0,null,0,null,0,null,0,null,0,null,0,null,0,null,0,null,0,null,0,null,0,null,0,null,0,null,0,null,0,null,0,null,0,null,0,null,0]
[null,null,null,"Blusa nas cores cinza e azul marinho, tecido leve 100% algodão",{"$f":"E89","v":4},{"$f":"F91","v":0.56000000000000005},180,404,62.5,null,null,null,{"$f":"IF(SUM(L$79:L$83)>0,$H92*$I92,0)/SUM($I$80:$I$83)","v":0},null,{"$f":"IF(SUM(N$79:N$83)>0,$H92*$I92,0)/SUM($I$80:$I$83)","v":0},null,0,null,0,null,{"$f":"IF(SUM(T$79:T$85)>0,$H92*$I92,0)/SUM($I$57:$I$59)","v":0},null,{"$f":"IF(SUM(V$79:V$83)>0,$H92*$I92,0)/SUM($I$80:$I$83)","v":140.27777777777777},null,{"$f":"IF(SUM(X$79:X$83)>0,$H92*$I92,0)/SUM($I$80:$I$83)","v":140.27777777777777},null,{"$f":"IF(SUM(Z$79:Z$83)>0,$H92*$I92,0)/SUM($I$80:$I$83)","v":140.27777777777777},null,{"$f":"IF(SUM(AB$79:AB$83)>0,$H92*$I92,0)/SUM($I$80:$I$83)","v":140.27777777777777},null,{"$f":"IF(SUM(AD$79:AD$83)>0,$H92*$I92,0)/SUM($I$80:$I$83)","v":0},null,{"$f":"IF(SUM(AF$79:AF$83)>0,$H92*$I92,0)/SUM($I$80:$I$83)","v":0},null,{"$f":"IF(SUM(AH$79:AH$83)>0,$H92*$I92,0)/SUM($I$80:$I$83)","v":0},null,{"$f":"IF(SUM(AJ$79:AJ$83)>0,$H92*$I92,0)/SUM($I$80:$I$83)","v":0},null,{"$f":"IF(SUM(AL$79:AL$83)>0,$H92*$I92,0)/SUM($I$80:$I$83)","v":0},null,{"$f":"IF(SUM(AN$79:AN$83)>0,$H92*$I92,0)/SUM($I$80:$I$83)","v":0},null,{"$f":"IF(SUM(AP$79:AP$83)>0,$H92*$I92,0)/SUM($I$80:$I$83)","v":0},null,{"$f":"IF(SUM(AR$79:AR$83)>0,$H92*$I92,0)/SUM($I$80:$I$83)","v":0},null,{"$f":"IF(SUM(AT$79:AT$83)>0,$H92*$I92,0)/SUM($I$80:$I$83)","v":0},null,{"$f":"IF(SUM(AV$79:AV$83)>0,$H92*$I92,0)/SUM($I$80:$I$83)","v":0},null,{"$f":"IF(SUM(AX$79:AX$83)>0,$H92*$I92,0)/SUM($I$80:$I$83)","v":0},null,{"$f":"IF(SUM(AZ$79:AZ$83)>0,$H92*$I92,0)/SUM($I$80:$I$83)","v":0},null,{"$f":"IF(SUM(BB$79:BB$83)>0,$H92*$I92,0)/SUM($I$80:$I$83)","v":0},null,{"$f":"IF(SUM(BD$79:BD$83)>0,$H92*$I92,0)/SUM($I$80:$I$83)","v":0},null,{"$f":"IF(SUM(BF$79:BF$83)>0,$H92*$I92,0)/SUM($I$80:$I$83)","v":0},null,{"$f":"IF(SUM(BH$79:BH$83)>0,$H92*$I92,0)/SUM($I$80:$I$83)","v":0},null,{"$f":"IF(SUM(BJ$79:BJ$83)>0,$H92*$I92,0)/SUM($I$80:$I$83)","v":0},null,{"$f":"IF(SUM(BL$79:BL$83)>0,$H92*$I92,0)/SUM($I$80:$I$83)","v":0},null,{"$f":"IF(SUM(BN$79:BN$83)>0,$H92*$I92,0)/SUM($I$80:$I$83)","v":0},null,{"$f":"IF(SUM(BP$79:BP$83)>0,$H92*$I92,0)/SUM($I$80:$I$83)","v":0},null,{"$f":"IF(SUM(BR$79:BR$83)>0,$H92*$I92,0)/SUM($I$80:$I$83)","v":0},null,{"$f":"IF(SUM(BT$79:BT$83)>0,$H92*$I92,0)/SUM($I$80:$I$83)","v":0},null,{"$f":"IF(SUM(BV$79:BV$83)>0,$H92*$I92,0)/SUM($I$80:$I$83)","v":0},null,{"$f":"IF(SUM(BX$79:BX$83)>0,$H92*$I92,0)/SUM($I$80:$I$83)","v":0},null,{"$f":"IF(SUM(BZ$79:BZ$83)>0,$H92*$I92,0)/SUM($I$80:$I$83)","v":0},null,{"$f":"IF(SUM(CB$79:CB$83)>0,$H92*$I92,0)/SUM($I$80:$I$83)","v":0},null,{"$f":"IF(SUM(CD$79:CD$83)>0,$H92*$I92,0)/SUM($I$80:$I$83)","v":0},null,{"$f":"IF(SUM(CF$79:CF$83)>0,$H92*$I92,0)/SUM($I$80:$I$83)","v":0},null,{"$f":"IF(SUM(CH$79:CH$83)>0,$H92*$I92,0)/SUM($I$80:$I$83)","v":0},null,{"$f":"IF(SUM(CJ$79:CJ$83)>0,$H92*$I92,0)/SUM($I$80:$I$83)","v":0},null,{"$f":"IF(SUM(CL$79:CL$83)>0,$H92*$I92,0)/SUM($I$80:$I$83)","v":0},null,{"$f":"IF(SUM(CN$79:CN$83)>0,$H92*$I92,0)/SUM($I$80:$I$83)","v":0},null,{"$f":"IF(SUM(CP$79:CP$83)>0,$H92*$I92,0)/SUM($I$80:$I$83)","v":0},null,{"$f":"IF(SUM(CR$79:CR$83)>0,$H92*$I92,0)/SUM($I$80:$I$83)","v":0},null,{"$f":"IF(SUM(CT$79:CT$83)>0,$H92*$I92,0)/SUM($I$80:$I$83)","v":0},null,{"$f":"IF(SUM(CV$79:CV$83)>0,$H92*$I92,0)/SUM($I$80:$I$83)","v":0},null,{"$f":"IF(SUM(CX$79:CX$83)>0,$H92*$I92,0)/SUM($I$80:$I$83)","v":0},null,{"$f":"IF(SUM(CZ$79:CZ$83)>0,$H92*$I92,0)/SUM($I$80:$I$83)","v":0},null,{"$f":"IF(SUM(DB$79:DB$83)>0,$H92*$I92,0)/SUM($I$80:$I$83)","v":0},null,{"$f":"IF(SUM(DD$79:DD$83)>0,$H92*$I92,0)/SUM($I$80:$I$83)","v":0},null,{"$f":"IF(SUM(DF$79:DF$83)>0,$H92*$I92,0)/SUM($I$80:$I$83)","v":0},null,{"$f":"IF(SUM(DH$79:DH$83)>0,$H92*$I92,0)/SUM($I$80:$I$83)","v":0},null,{"$f":"IF(SUM(DJ$79:DJ$83)>0,$H92*$I92,0)/SUM($I$80:$I$83)","v":0},null,{"$f":"IF(SUM(DL$79:DL$83)>0,$H92*$I92,0)/SUM($I$80:$I$83)","v":0},null,{"$f":"IF(SUM(DN$79:DN$83)>0,$H92*$I92,0)/SUM($I$80:$I$83)","v":0},null,{"$f":"IF(SUM(DP$79:DP$83)>0,$H92*$I92,0)/SUM($I$80:$I$83)","v":0},null,{"$f":"IF(SUM(DR$79:DR$83)>0,$H92*$I92,0)/SUM($I$80:$I$83)","v":0},null,{"$f":"IF(SUM(DT$79:DT$83)>0,$H92*$I92,0)/SUM($I$80:$I$83)","v":0},null,{"$f":"IF(SUM(DV$79:DV$83)>0,$H92*$I92,0)/SUM($I$80:$I$83)","v":0},null,{"$f":"IF(SUM(DX$79:DX$83)>0,$H92*$I92,0)/SUM($I$80:$I$83)","v":0},null,{"$f":"IF(SUM(DZ$79:DZ$83)>0,$H92*$I92,0)/SUM($I$80:$I$83)","v":0}]
[null,null,null,"Meia social na cor preta",4,{"$f":"F92","v":0.56000000000000005},180,404,{"$f":"I74","v":25.95},null,null,null,0,null,{"$f":"IF(SUM(N$79:N$83)>0,$H93*$I93,0)/SUM($I$80:$I$83)","v":0},null,0,null,0,null,{"$f":"IF(SUM(T$79:T$85)>0,$H93*$I93,0)/SUM($I$57:$I$59)","v":0},null,{"$f":"IF(SUM(V$79:V$83)>0,$H93*$I93,0)/SUM($I$80:$I$83)","v":58.243333333333332},null,58.243333333333332,null,{"$f":"IF(SUM(Z$79:Z$83)>0,$H93*$I93,0)/SUM($I$80:$I$83)","v":58.243333333333332},null,{"$f":"IF(SUM(AB$79:AB$83)>0,$H93*$I93,0)/SUM($I$80:$I$83)","v":58.243333333333332},null,{"$f":"IF(SUM(AD$79:AD$83)>0,$H93*$I93,0)/SUM($I$80:$I$83)","v":0},null,0,null,0,null,0,null,0,null,0,null,0,null,0,null,0,null,0,null,0,null,0,null,0,null,0,null,0,null,0,null,0,null,0,null,0,null,0,null,0,null,0,null,0,null,0,null,0,null,0,null,0,null,0,null,0,null,0,null,0,null,0,null,{"$f":"IF(SUM(CP$79:CP$83)>0,$H93*$I93,0)/SUM($I$80:$I$83)","v":0},null,0,null,0,null,0,null,0,null,0,null,0,null,0,null,0,null,0,null,0,null,0,null,0,null,0,null,0,null,0,null,0,null,0,null,0]
[null,null,null,null,null,null,null,null,null,null,null,null,{"$f":"IF(SUM(L$79:L$83)>0,$H94*$I94,0)/SUM($I86:$I89)","v":0},null,{"$f":"IF(SUM(N$79:N$83)>0,$H94*$I94,0)","v":0},null,0,null,0,null,{"$f":"IF(SUM(T$79:T$83)>0,$H94*$I94,0)","v":0},null,0,null,0,null,0,null,0,null,0,null,{"$f":"IF(SUM(AF$79:AF$83)>0,$H94*$I94,0)","v":0},null,{"$f":"IF(SUM(AH$79:AH$83)>0,$H94*$I94,0)","v":0},null,{"$f":"IF(SUM(AJ$79:AJ$83)>0,$H94*$I94,0)","v":0},null,{"$f":"IF(SUM(AL$79:AL$83)>0,$H94*$I94,0)","v":0},null,{"$f":"IF(SUM(AN$79:AN$83)>0,$H94*$I94,0)","v":0},null,{"$f":"IF(SUM(AP$79:AP$83)>0,$H94*$I94,0)","v":0},null,{"$f":"IF(SUM(AR$79:AR$83)>0,$H94*$I94,0)","v":0},null,{"$f":"IF(SUM(AT$79:AT$83)>0,$H94*$I94,0)","v":0},null,{"$f":"IF(SUM(AV$79:AV$83)>0,$H94*$I94,0)","v":0},null,{"$f":"IF(SUM(AX$79:AX$83)>0,$H94*$I94,0)","v":0},null,{"$f":"IF(SUM(AZ$79:AZ$83)>0,$H94*$I94,0)","v":0},null,{"$f":"IF(SUM(BB$79:BB$83)>0,$H94*$I94,0)","v":0},null,{"$f":"IF(SUM(BD$79:BD$83)>0,$H94*$I94,0)","v":0},null,{"$f":"IF(SUM(BF$79:BF$83)>0,$H94*$I94,0)","v":0},null,{"$f":"IF(SUM(BH$79:BH$83)>0,$H94*$I94,0)","v":0},null,{"$f":"IF(SUM(BJ$79:BJ$83)>0,$H94*$I94,0)","v":0},null,{"$f":"IF(SUM(BL$79:BL$83)>0,$H94*$I94,0)","v":0},null,{"$f":"IF(SUM(BN$79:BN$83)>0,$H94*$I94,0)","v":0},null,{"$f":"IF(SUM(BP$79:BP$83)>0,$H94*$I94,0)","v":0},null,{"$f":"IF(SUM(BR$79:BR$83)>0,$H94*$I94,0)","v":0},null,{"$f":"IF(SUM(BT$79:BT$83)>0,$H94*$I94,0)","v":0},null,{"$f":"IF(SUM(BV$79:BV$83)>0,$H94*$I94,0)","v":0},null,{"$f":"IF(SUM(BX$79:BX$83)>0,$H94*$I94,0)","v":0},null,{"$f":"IF(SUM(BZ$79:BZ$83)>0,$H94*$I94,0)","v":0},null,{"$f":"IF(SUM(CB$79:CB$83)>0,$H94*$I94,0)","v":0},null,{"$f":"IF(SUM(CD$79:CD$83)>0,$H94*$I94,0)","v":0},null,{"$f":"IF(SUM(CF$79:CF$83)>0,$H94*$I94,0)","v":0},null,{"$f":"IF(SUM(CH$79:CH$83)>0,$H94*$I94,0)","v":0},null,{"$f":"IF(SUM(CJ$79:CJ$83)>0,$H94*$I94,0)","v":0},null,{"$f":"IF(SUM(CL$79:CL$83)>0,$H94*$I94,0)","v":0},null,{"$f":"IF(SUM(CN$79:CN$83)>0,$H94*$I94,0)","v":0},null,{"$f":"IF(SUM(CP$79:CP$83)>0,$H94*$I94,0)","v":0},null,{"$f":"IF(SUM(CR$79:CR$83)>0,$H94*$I94,0)","v":0},null,{"$f":"IF(SUM(CT$79:CT$83)>0,$H94*$I94,0)","v":0},null,{"$f":"IF(SUM(CV$79:CV$83)>0,$H94*$I94,0)","v":0},null,{"$f":"IF(SUM(CX$79:CX$83)>0,$H94*$I94,0)","v":0},null,{"$f":"IF(SUM(CZ$79:CZ$83)>0,$H94*$I94,0)","v":0},null,{"$f":"IF(SUM(DB$79:DB$83)>0,$H94*$I94,0)","v":0},null,{"$f":"IF(SUM(DD$79:DD$83)>0,$H94*$I94,0)","v":0},null,{"$f":"IF(SUM(DF$79:DF$83)>0,$H94*$I94,0)","v":0},null,{"$f":"IF(SUM(DH$79:DH$83)>0,$H94*$I94,0)","v":0},null,{"$f":"IF(SUM(DJ$79:DJ$83)>0,$H94*$I94,0)","v":0},null,{"$f":"IF(SUM(DL$79:DL$83)>0,$H94*$I94,0)","v":0},null,{"$f":"IF(SUM(DN$79:DN$83)>0,$H94*$I94,0)","v":0},null,{"$f":"IF(SUM(DP$79:DP$83)>0,$H94*$I94,0)","v":0},null,{"$f":"IF(SUM(DR$79:DR$83)>0,$H94*$I94,0)","v":0},null,{"$f":"IF(SUM(DT$79:DT$83)>0,$H94*$I94,0)","v":0},null,{"$f":"IF(SUM(DV$79:DV$83)>0,$H94*$I94,0)","v":0},null,{"$f":"IF(SUM(DX$79:DX$83)>0,$H94*$I94,0)","v":0},null,{"$f":"IF(SUM(DZ$79:DZ$83)>0,$H94*$I94,0)","v":0}]

{"sheet":"EPI","index":17,"n_rows":70,"n_cols":129,"rows_kept":70,"cut":false,"hidden":false,"merged":[[2,1,2,3],[3,1,3,6]]}
[]
[]
[]
[null,"EQUIPAMENTOS DE PROTEÇÃO INDIVIDUAL - AQUISIÇÃO",null,null,null,null,null,null,null,1,null,{"$f":"J4+1","v":2},null,{"$f":"L4+1","v":3},null,{"$f":"N4+1","v":4},null,{"$f":"P4+1","v":5},null,{"$f":"R4+1","v":6},null,{"$f":"T4+1","v":7},null,{"$f":"V4+1","v":8},null,{"$f":"X4+1","v":9},null,{"$f":"Z4+1","v":10},null,{"$f":"AB4+1","v":11},null,{"$f":"AD4+1","v":12},null,{"$f":"AF4+1","v":13},null,{"$f":"AH4+1","v":14},null,{"$f":"AJ4+1","v":15},null,{"$f":"AL4+1","v":16},null,{"$f":"AN4+1","v":17},null,{"$f":"AP4+1","v":18},null,{"$f":"AR4+1","v":19},null,{"$f":"AT4+1","v":20},null,{"$f":"AV4+1","v":21},null,{"$f":"AX4+1","v":22},null,{"$f":"AZ4+1","v":23},null,{"$f":"BB4+1","v":24},null,{"$f":"BD4+1","v":25},null,{"$f":"BF4+1","v":26},null,{"$f":"BH4+1","v":27},null,{"$f":"BJ4+1","v":28},null,{"$f":"BL4+1","v":29},null,{"$f":"BN4+1","v":30},null,{"$f":"BP4+1","v":31},null,{"$f":"BR4+1","v":32},null,{"$f":"BT4+1","v":33},null,{"$f":"BV4+1","v":34},null,{"$f":"BX4+1","v":35},null,{"$f":"BZ4+1","v":36},null,{"$f":"CB4+1","v":37},null,{"$f":"CD4+1","v":38},null,{"$f":"CF4+1","v":39},null,{"$f":"CH4+1","v":40},null,{"$f":"CJ4+1","v":41},null,{"$f":"CL4+1","v":42},null,{"$f":"CN4+1","v":43},null,{"$f":"CP4+1","v":44},null,{"$f":"CR4+1","v":45},null,{"$f":"CT4+1","v":46},null,{"$f":"CV4+1","v":47},null,{"$f":"CX4+1","v":48},null,{"$f":"CZ4+1","v":49},null,{"$f":"DB4+1","v":50},null,{"$f":"DD4+1","v":51},null,{"$f":"DF4+1","v":52},null,{"$f":"DH4+1","v":53},null,{"$f":"DJ4+1","v":54},null,{"$f":"DL4+1","v":55},null,{"$f":"DN4+1","v":56},null,{"$f":"DP4+1","v":57},null,{"$f":"DR4+1","v":58},null,{"$f":"DT4+1","v":59},null,{"$f":"DV4+1","v":60}]
[]
[null,null,null,null,null,null,null,null,null,{"$f":"ROUND(SUM(K5:K107),2)","v":117.26},null,{"$f":"ROUND(SUM(M5:M107),2)","v":234.52},null,{"$f":"ROUND(SUM(O5:O107),2)","v":240},null,{"$f":"ROUND(SUM(Q5:Q107),2)","v":240},null,{"$f":"ROUND(SUM(S5:S107),2)","v":240},null,{"$f":"ROUND(SUM(U5:U107),2)","v":364.44},null,{"$f":"ROUND(SUM(W5:W107),2)","v":468.91},null,{"$f":"ROUND(SUM(Y5:Y107),2)","v":468.91},null,{"$f":"ROUND(SUM(AA5:AA107),2)","v":468.91},null,{"$f":"ROUND(SUM(AC5:AC107),2)","v":0},null,{"$f":"ROUND(SUM(AE5:AE107),2)","v":0},null,{"$f":"ROUND(SUM(AG5:AG107),2)","v":0},null,{"$f":"ROUND(SUM(AI5:AI107),2)","v":0},null,{"$f":"ROUND(SUM(AK5:AK107),2)","v":0},null,{"$f":"ROUND(SUM(AM5:AM107),2)","v":0},null,{"$f":"ROUND(SUM(AO5:AO107),2)","v":0},null,{"$f":"ROUND(SUM(AQ5:AQ107),2)","v":0},null,{"$f":"ROUND(SUM(AS5:AS107),2)","v":0},null,{"$f":"ROUND(SUM(AU5:AU107),2)","v":0},null,{"$f":"ROUND(SUM(AW5:AW107),2)","v":0},null,{"$f":"ROUND(SUM(AY5:AY107),2)","v":0},null,{"$f":"ROUND(SUM(BA5:BA107),2)","v":0},null,{"$f":"ROUND(SUM(BC5:BC107),2)","v":0},null,{"$f":"ROUND(SUM(BE5:BE107),2)","v":0},null,{"$f":"ROUND(SUM(BG5:BG107),2)","v":0},null,{"$f":"ROUND(SUM(BI5:BI107),2)","v":0},null,{"$f":"ROUND(SUM(BK5:BK107),2)","v":0},null,{"$f":"ROUND(SUM(BM5:BM107),2)","v":0},null,{"$f":"ROUND(SUM(BO5:BO107),2)","v":0},null,{"$f":"ROUND(SUM(BQ5:BQ107),2)","v":0},null,{"$f":"ROUND(SUM(BS5:BS107),2)","v":0},null,{"$f":"ROUND(SUM(BU5:BU107),2)","v":0},null,{"$f":"ROUND(SUM(BW5:BW107),2)","v":0},null,{"$f":"ROUND(SUM(BY5:BY107),2)","v":0},null,{"$f":"ROUND(SUM(CA5:CA107),2)","v":0},null,{"$f":"ROUND(SUM(CC5:CC107),2)","v":0},null,{"$f":"ROUND(SUM(CE5:CE107),2)","v":0},null,{"$f":"ROUND(SUM(CG5:CG107),2)","v":0},null,{"$f":"ROUND(SUM(CI5:CI107),2)","v":0},null,{"$f":"ROUND(SUM(CK5:CK107),2)","v":0},null,{"$f":"ROUND(SUM(CM5:CM107),2)","v":0},null,{"$f":"ROUND(SUM(CO5:CO107),2)","v":0},null,{"$f":"ROUND(SUM(CQ5:CQ107),2)","v":0},null,{"$f":"ROUND(SUM(CS5:CS107),2)","v":0},null,{"$f":"ROUND(SUM(CU5:CU107),2)","v":0},null,{"$f":"ROUND(SUM(CW5:CW107),2)","v":0},null,{"$f":"ROUND(SUM(CY5:CY107),2)","v":0},null,{"$f":"ROUND(SUM(DA5:DA107),2)","v":0},null,{"$f":"ROUND(SUM(DC5:DC107),2)","v":0},null,{"$f":"ROUND(SUM(DE5:DE107),2)","v":0},null,{"$f":"ROUND(SUM(DG5:DG107),2)","v":0},null,{"$f":"ROUND(SUM(DI5:DI107),2)","v":0},null,{"$f":"ROUND(SUM(DK5:DK107),2)","v":0},null,{"$f":"ROUND(SUM(DM5:DM107),2)","v":0},null,{"$f":"ROUND(SUM(DO5:DO107),2)","v":0},null,{"$f":"ROUND(SUM(DQ5:DQ107),2)","v":0},null,{"$f":"ROUND(SUM(DS5:DS107),2)","v":0},null,{"$f":"ROUND(SUM(DU5:DU107),2)","v":0},null,{"$f":"ROUND(SUM(DW5:DW107),2)","v":0},null,{"$f":"ROUND(SUM(DY5:DY107),2)","v":0}]
[null,null,"CATEGORIAS",null,null,null,"QUANTIDADE"]
[null,null,null,null,null,null,null,null,null,{"$f":"IF($C8=J$4,1,0)","v":0},null,{"$f":"IF($C8=L$4,1,0)","v":0},null,{"$f":"IF($C8=N$4,1,0)","v":0},null,{"$f":"IF($C8=P$4,1,0)","v":0},null,{"$f":"IF($C8=R$4,1,0)","v":0},null,{"$f":"IF($C8=T$4,1,0)","v":0},null,{"$f":"IF($C8=V$4,1,0)","v":0},null,{"$f":"IF($C8=X$4,1,0)","v":0},null,{"$f":"IF($C8=Z$4,1,0)","v":0},null,{"$f":"IF($C8=AB$4,1,0)","v":0},null,{"$f":"IF($C8=AD$4,1,0)","v":0},null,{"$f":"IF($C8=AF$4,1,0)","v":0},null,{"$f":"IF($C8=AH$4,1,0)","v":0},null,{"$f":"IF($C8=AJ$4,1,0)","v":0},null,{"$f":"IF($C8=AL$4,1,0)","v":0},null,{"$f":"IF($C8=AN$4,1,0)","v":0},null,{"$f":"IF($C8=AP$4,1,0)","v":0},null,{"$f":"IF($C8=AR$4,1,0)","v":0},null,{"$f":"IF($C8=AT$4,1,0)","v":0},null,{"$f":"IF($C8=AV$4,1,0)","v":0},null,{"$f":"IF($C8=AX$4,1,0)","v":0},null,{"$f":"IF($C8=AZ$4,1,0)","v":0},null,{"$f":"IF($C8=BB$4,1,0)","v":0},null,{"$f":"IF($C8=BD$4,1,0)","v":0},null,{"$f":"IF($C8=BF$4,1,0)","v":0},null,{"$f":"IF($C8=BH$4,1,0)","v":0},null,{"$f":"IF($C8=BJ$4,1,0)","v":0},null,{"$f":"IF($C8=BL$4,1,0)","v":0},null,{"$f":"IF($C8=BN$4,1,0)","v":0},null,{"$f":"IF($C8=BP$4,1,0)","v":0},null,{"$f":"IF($C8=BR$4,1,0)","v":0},null,{"$f":"IF($C8=BT$4,1,0)","v":0},null,{"$f":"IF($C8=BV$4,1,0)","v":0},null,{"$f":"IF($C8=BX$4,1,0)","v":0},null,{"$f":"IF($C8=BZ$4,1,0)","v":0},null,{"$f":"IF($C8=CB$4,1,0)","v":0},null,{"$f":"IF($C8=CD$4,1,0)","v":0},null,{"$f":"IF($C8=CF$4,1,0)","v":0},null,{"$f":"IF($C8=CH$4,1,0)","v":0},null,{"$f":"IF($C8=CJ$4,1,0)","v":0},null,{"$f":"IF($C8=CL$4,1,0)","v":0},null,{"$f":"IF($C8=CN$4,1,0)","v":0},null,{"$f":"IF($C8=CP$4,1,0)","v":0},null,{"$f":"IF($C8=CR$4,1,0)","v":0},null,{"$f":"IF($C8=CT$4,1,0)","v":0},null,{"$f":"IF($C8=CV$4,1,0)","v":0},null,{"$f":"IF($C8=CX$4,1,0)","v":0},null,{"$f":"IF($C8=CZ$4,1,0)","v":0},null,{"$f":"IF($C8=DB$4,1,0)","v":0},null,{"$f":"IF($C8=DD$4,1,0)","v":0},null,{"$f":"IF($C8=DF$4,1,0)","v":0},null,{"$f":"IF($C8=DH$4,1,0)","v":0},null,{"$f":"IF($C8=DJ$4,1,0)","v":0},null,{"$f":"IF($C8=DL$4,1,0)","v":0},null,{"$f":"IF($C8=DN$4,1,0)","v":0},null,{"$f":"IF($C8=DP$4,1,0)","v":0},null,{"$f":"IF($C8=DR$4,1,0)","v":0},null,{"$f":"IF($C8=DT$4,1,0)","v":0},null,{"$f":"IF($C8=DV$4,1,0)","v":0},null,{"$f":"IF($C8=DX$4,1,0)","v":0}]
[null,null,1,{"$f":"HLOOKUP($C9,'Dados Gerais'!$D$5:$BK$10,6)","v":"ENCARREGADO GERAL"},null,null,{"$f":"HLOOKUP($C9,'Dados Gerais'!$D$5:$BK$14,10)","v":1},null,null,{"$f":"IF($C9=J$4,1,0)","v":1},null,0,null,0,null,0,null,0,null,0,null,0,null,0,null,0,null,0,null,0,null,0,null,0,null,0,null,0,null,0,null,0,null,0,null,0,null,0,null,0,null,0,null,0,null,0,null,0,null,0,null,0,null,0,null,0,null,0,null,0,null,0,null,0,null,0,null,0,null,0,null,0,null,0,null,0,null,0,null,0,null,0,null,0,null,0,null,0,null,0,null,0,null,0,null,0,null,0,null,0,null,0,null,0,null,0,null,0,null,0,null,0,null,0,null,0,null,0]
[null,null,null,null,null,null,null,null,null,{"$f":"IF($C10=J$4,1,0)","v":0},null,0,null,0,null,0,null,0,null,0,null,0,null,0,null,0,null,0,null,0,null,0,null,0,null,0,null,0,null,0,null,0,null,0,null,0,null,0,null,0,null,0,null,0,null,0,null,0,null,0,null,0,null,0,null,0,null,0,null,0,null,0,null,0,null,0,null,0,null,0,null,0,null,0,null,0,null,0,null,0,null,0,null,0,null,0,null,0,null,0,null,0,null,0,null,0,null,0,null,0,null,0,null,0,null,0,null,0,null,0,null,0,null,0,null,0,null,0]
[]
[null,null,"ITEM","DESCRIÇÃO","QUANT ANUAL POR POSTO","UNIDADE","VALOR"]
[null,null,null,null,null,null,null,null,null,null,{"$f":"IF(SUM(J$8:J$10)>0,$E13*$G13,0)","v":0},null,{"$f":"IF(SUM(L$8:L$10)>0,$E13*$G13,0)","v":0},null,{"$f":"IF(SUM(N$8:N$10)>0,$E13*$G13,0)","v":0},null,{"$f":"IF(SUM(P$8:P$10)>0,$E13*$G13,0)","v":0},null,{"$f":"IF(SUM(R$8:R$10)>0,$E13*$G13,0)","v":0},null,{"$f":"IF(SUM(T$8:T$10)>0,$E13*$G13,0)","v":0},null,{"$f":"IF(SUM(V$8:V$10)>0,$E13*$G13,0)","v":0},null,{"$f":"IF(SUM(X$8:X$10)>0,$E13*$G13,0)","v":0},null,{"$f":"IF(SUM(Z$8:Z$10)>0,$E13*$G13,0)","v":0},null,{"$f":"IF(SUM(AB$8:AB$10)>0,$E13*$G13,0)","v":0},null,{"$f":"IF(SUM(AD$8:AD$10)>0,$E13*$G13,0)","v":0},null,{"$f":"IF(SUM(AF$8:AF$10)>0,$E13*$G13,0)","v":0},null,{"$f":"IF(SUM(AH$8:AH$10)>0,$E13*$G13,0)","v":0},null,{"$f":"IF(SUM(AJ$8:AJ$10)>0,$E13*$G13,0)","v":0},null,{"$f":"IF(SUM(AL$8:AL$10)>0,$E13*$G13,0)","v":0},null,{"$f":"IF(SUM(AN$8:AN$10)>0,$E13*$G13,0)","v":0},null,{"$f":"IF(SUM(AP$8:AP$10)>0,$E13*$G13,0)","v":0},null,{"$f":"IF(SUM(AR$8:AR$10)>0,$E13*$G13,0)","v":0},null,{"$f":"IF(SUM(AT$8:AT$10)>0,$E13*$G13,0)","v":0},null,{"$f":"IF(SUM(AV$8:AV$10)>0,$E13*$G13,0)","v":0},null,{"$f":"IF(SUM(AX$8:AX$10)>0,$E13*$G13,0)","v":0},null,{"$f":"IF(SUM(AZ$8:AZ$10)>0,$E13*$G13,0)","v":0},null,{"$f":"IF(SUM(BB$8:BB$10)>0,$E13*$G13,0)","v":0},null,{"$f":"IF(SUM(BD$8:BD$10)>0,$E13*$G13,0)","v":0},null,{"$f":"IF(SUM(BF$8:BF$10)>0,$E13*$G13,0)","v":0},null,{"$f":"IF(SUM(BH$8:BH$10)>0,$E13*$G13,0)","v":0},null,{"$f":"IF(SUM(BJ$8:BJ$10)>0,$E13*$G13,0)","v":0},null,{"$f":"IF(SUM(BL$8:BL$10)>0,$E13*$G13,0)","v":0},null,{"$f":"IF(SUM(BN$8:BN$10)>0,$E13*$G13,0)","v":0},null,{"$f":"IF(SUM(BP$8:BP$10)>0,$E13*$G13,0)","v":0},null,{"$f":"IF(SUM(BR$8:BR$10)>0,$E13*$G13,0)","v":0},null,{"$f":"IF(SUM(BT$8:BT$10)>0,$E13*$G13,0)","v":0},null,{"$f":"IF(SUM(BV$8:BV$10)>0,$E13*$G13,0)","v":0},null,{"$f":"IF(SUM(BX$8:BX$10)>0,$E13*$G13,0)","v":0},null,{"$f":"IF(SUM(BZ$8:BZ$10)>0,$E13*$G13,0)","v":0},null,{"$f":"IF(SUM(CB$8:CB$10)>0,$E13*$G13,0)","v":0},null,{"$f":"IF(SUM(CD$8:CD$10)>0,$E13*$G13,0)","v":0},null,{"$f":"IF(SUM(CF$8:CF$10)>0,$E13*$G13,0)","v":0},null,{"$f":"IF(SUM(CH$8:CH$10)>0,$E13*$G13,0)","v":0},null,{"$f":"IF(SUM(CJ$8:CJ$10)>0,$E13*$G13,0)","v":0},null,{"$f":"IF(SUM(CL$8:CL$10)>0,$E13*$G13,0)","v":0},null,{"$f":"IF(SUM(CN$8:CN$10)>0,$E13*$G13,0)","v":0},null,{"$f":"IF(SUM(CP$8:CP$10)>0,$E13*$G13,0)","v":0},null,{"$f":"IF(SUM(CR$8:CR$10)>0,$E13*$G13,0)","v":0},null,{"$f":"IF(SUM(CT$8:CT$10)>0,$E13*$G13,0)","v":0},null,{"$f":"IF(SUM(CV$8:CV$10)>0,$E13*$G13,0)","v":0},null,{"$f":"IF(SUM(CX$8:CX$10)>0,$E13*$G13,0)","v":0},null,{"$f":"IF(SUM(CZ$8:CZ$10)>0,$E13*$G13,0)","v":0},null,{"$f":"IF(SUM(DB$8:DB$10)>0,$E13*$G13,0)","v":0},null,{"$f":"IF(SUM(DD$8:DD$10)>0,$E13*$G13,0)","v":0},null,{"$f":"IF(SUM(DF$8:DF$10)>0,$E13*$G13,0)","v":0},null,{"$f":"IF(SUM(DH$8:DH$10)>0,$E13*$G13,0)","v":0},null,{"$f":"IF(SUM(DJ$8:DJ$10)>0,$E13*$G13,0)","v":0},null,{"$f":"IF(SUM(DL$8:DL$10)>0,$E13*$G13,0)","v":0},null,{"$f":"IF(SUM(DN$8:DN$10)>0,$E13*$G13,0)","v":0},null,{"$f":"IF(SUM(DP$8:DP$10)>0,$E13*$G13,0)","v":0},null,{"$f":"IF(SUM(DR$8:DR$10)>0,$E13*$G13,0)","v":0},null,{"$f":"IF(SUM(DT$8:DT$10)>0,$E13*$G13,0)","v":0},null,{"$f":"IF(SUM(DV$8:DV$10)>0,$E13*$G13,0)","v":0},null,{"$f":"IF(SUM(DX$8:DX$10)>0,$E13*$G13,0)","v":0}]
[null,null,1,"Calçado de segurança tipo sapato com resistência a objetos pontiagudos, fechamento em elástico, couro preto, forração em tecido, bico de composite, palmilha de montagem têxtil resistente à perfuração, solado de PU (poliuretano), bidensidade sem cadarço. Ref. MARLUVAS.",1,"PAR",117.26,null,null,null,{"$f":"IF(SUM(J$8:J$10)>0,$E14*$G14,0)","v":117.26},null,{"$f":"IF(SUM(L$8:L$10)>0,$E14*$G14,0)","v":0},null,{"$f":"IF(SUM(N$8:N$10)>0,$E14*$G14,0)","v":0},null,{"$f":"IF(SUM(P$8:P$10)>0,$E14*$G14,0)","v":0},null,{"$f":"IF(SUM(R$8:R$10)>0,$E14*$G14,0)","v":0},null,{"$f":"IF(SUM(T$8:T$10)>0,$E14*$G14,0)","v":0},null,{"$f":"IF(SUM(V$8:V$10)>0,$E14*$G14,0)","v":0},null,{"$f":"IF(SUM(X$8:X$10)>0,$E14*$G14,0)","v":0},null,{"$f":"IF(SUM(Z$8:Z$10)>0,$E14*$G14,0)","v":0},null,{"$f":"IF(SUM(AB$8:AB$10)>0,$E14*$G14,0)","v":0},null,{"$f":"IF(SUM(AD$8:AD$10)>0,$E14*$G14,0)","v":0},null,{"$f":"IF(SUM(AF$8:AF$10)>0,$E14*$G14,0)","v":0},null,{"$f":"IF(SUM(AH$8:AH$10)>0,$E14*$G14,0)","v":0},null,{"$f":"IF(SUM(AJ$8:AJ$10)>0,$E14*$G14,0)","v":0},null,{"$f":"IF(SUM(AL$8:AL$10)>0,$E14*$G14,0)","v":0},null,{"$f":"IF(SUM(AN$8:AN$10)>0,$E14*$G14,0)","v":0},null,{"$f":"IF(SUM(AP$8:AP$10)>0,$E14*$G14,0)","v":0},null,{"$f":"IF(SUM(AR$8:AR$10)>0,$E14*$G14,0)","v":0},null,{"$f":"IF(SUM(AT$8:AT$10)>0,$E14*$G14,0)","v":0},null,{"$f":"IF(SUM(AV$8:AV$10)>0,$E14*$G14,0)","v":0},null,{"$f":"IF(SUM(AX$8:AX$10)>0,$E14*$G14,0)","v":0},null,{"$f":"IF(SUM(AZ$8:AZ$10)>0,$E14*$G14,0)","v":0},null,{"$f":"IF(SUM(BB$8:BB$10)>0,$E14*$G14,0)","v":0},null,{"$f":"IF(SUM(BD$8:BD$10)>0,$E14*$G14,0)","v":0},null,{"$f":"IF(SUM(BF$8:BF$10)>0,$E14*$G14,0)","v":0},null,{"$f":"IF(SUM(BH$8:BH$10)>0,$E14*$G14,0)","v":0},null,{"$f":"IF(SUM(BJ$8:BJ$10)>0,$E14*$G14,0)","v":0},null,{"$f":"IF(SUM(BL$8:BL$10)>0,$E14*$G14,0)","v":0},null,{"$f":"IF(SUM(BN$8:BN$10)>0,$E14*$G14,0)","v":0},null,{"$f":"IF(SUM(BP$8:BP$10)>0,$E14*$G14,0)","v":0},null,{"$f":"IF(SUM(BR$8:BR$10)>0,$E14*$G14,0)","v":0},null,{"$f":"IF(SUM(BT$8:BT$10)>0,$E14*$G14,0)","v":0},null,{"$f":"IF(SUM(BV$8:BV$10)>0,$E14*$G14,0)","v":0},null,{"$f":"IF(SUM(BX$8:BX$10)>0,$E14*$G14,0)","v":0},null,{"$f":"IF(SUM(BZ$8:BZ$10)>0,$E14*$G14,0)","v":0},null,{"$f":"IF(SUM(CB$8:CB$10)>0,$E14*$G14,0)","v":0},null,{"$f":"IF(SUM(CD$8:CD$10)>0,$E14*$G14,0)","v":0},null,{"$f":"IF(SUM(CF$8:CF$10)>0,$E14*$G14,0)","v":0},null,{"$f":"IF(SUM(CH$8:CH$10)>0,$E14*$G14,0)","v":0},null,{"$f":"IF(SUM(CJ$8:CJ$10)>0,$E14*$G14,0)","v":0},null,{"$f":"IF(SUM(CL$8:CL$10)>0,$E14*$G14,0)","v":0},null,{"$f":"IF(SUM(CN$8:CN$10)>0,$E14*$G14,0)","v":0},null,{"$f":"IF(SUM(CP$8:CP$10)>0,$E14*$G14,0)","v":0},null,{"$f":"IF(SUM(CR$8:CR$10)>0,$E14*$G14,0)","v":0},null,{"$f":"IF(SUM(CT$8:CT$10)>0,$E14*$G14,0)","v":0},null,{"$f":"IF(SUM(CV$8:CV$10)>0,$E14*$G14,0)","v":0},null,{"$f":"IF(SUM(CX$8:CX$10)>0,$E14*$G14,0)","v":0},null,{"$f":"IF(SUM(CZ$8:CZ$10)>0,$E14*$G14,0)","v":0},null,{"$f":"IF(SUM(DB$8:DB$10)>0,$E14*$G14,0)","v":0},null,{"$f":"IF(SUM(DD$8:DD$10)>0,$E14*$G14,0)","v":0},null,{"$f":"IF(SUM(DF$8:DF$10)>0,$E14*$G14,0)","v":0},null,{"$f":"IF(SUM(DH$8:DH$10)>0,$E14*$G14,0)","v":0},null,{"$f":"IF(SUM(DJ$8:DJ$10)>0,$E14*$G14,0)","v":0},null,{"$f":"IF(SUM(DL$8:DL$10)>0,$E14*$G14,0)","v":0},null,{"$f":"IF(SUM(DN$8:DN$10)>0,$E14*$G14,0)","v":0},null,{"$f":"IF(SUM(DP$8:DP$10)>0,$E14*$G14,0)","v":0},null,{"$f":"IF(SUM(DR$8:DR$10)>0,$E14*$G14,0)","v":0},null,{"$f":"IF(SUM(DT$8:DT$10)>0,$E14*$G14,0)","v":0},null,{"$f":"IF(SUM(DV$8:DV$10)>0,$E14*$G14,0)","v":0},null,0]
[]
[null,null,"CATEGORIAS",null,null,null,"QUANTIDADE"]
[null,null,null,null,null,null,null,null,null,{"$f":"IF($C17=J$4,1,0)","v":0},null,{"$f":"IF($C17=L$4,1,0)","v":0},null,{"$f":"IF($C17=N$4,1,0)","v":0},null,{"$f":"IF($C17=P$4,1,0)","v":0},null,{"$f":"IF($C17=R$4,1,0)","v":0},null,{"$f":"IF($C17=T$4,1,0)","v":0},null,{"$f":"IF($C17=V$4,1,0)","v":0},null,{"$f":"IF($C17=X$4,1,0)","v":0},null,{"$f":"IF($C17=Z$4,1,0)","v":0},null,{"$f":"IF($C17=AB$4,1,0)","v":0},null,{"$f":"IF($C17=AD$4,1,0)","v":0},null,{"$f":"IF($C17=AF$4,1,0)","v":0},null,{"$f":"IF($C17=AH$4,1,0)","v":0},null,{"$f":"IF($C17=AJ$4,1,0)","v":0},null,{"$f":"IF($C17=AL$4,1,0)","v":0},null,{"$f":"IF($C17=AN$4,1,0)","v":0},null,{"$f":"IF($C17=AP$4,1,0)","v":0},null,{"$f":"IF($C17=AR$4,1,0)","v":0},null,{"$f":"IF($C17=AT$4,1,0)","v":0},null,{"$f":"IF($C17=AV$4,1,0)","v":0},null,{"$f":"IF($C17=AX$4,1,0)","v":0},null,{"$f":"IF($C17=AZ$4,1,0)","v":0},null,{"$f":"IF($C17=BB$4,1,0)","v":0},null,{"$f":"IF($C17=BD$4,1,0)","v":0},null,{"$f":"IF($C17=BF$4,1,0)","v":0},null,{"$f":"IF($C17=BH$4,1,0)","v":0},null,{"$f":"IF($C17=BJ$4,1,0)","v":0},null,{"$f":"IF($C17=BL$4,1,0)","v":0},null,{"$f":"IF($C17=BN$4,1,0)","v":0},null,{"$f":"IF($C17=BP$4,1,0)","v":0},null,{"$f":"IF($C17=BR$4,1,0)","v":0},null,{"$f":"IF($C17=BT$4,1,0)","v":0},null,{"$f":"IF($C17=BV$4,1,0)","v":0},null,{"$f":"IF($C17=BX$4,1,0)","v":0},null,{"$f":"IF($C17=BZ$4,1,0)","v":0},null,{"$f":"IF($C17=CB$4,1,0)","v":0},null,{"$f":"IF($C17=CD$4,1,0)","v":0},null,{"$f":"IF($C17=CF$4,1,0)","v":0},null,{"$f":"IF($C17=CH$4,1,0)","v":0},null,{"$f":"IF($C17=CJ$4,1,0)","v":0},null,{"$f":"IF($C17=CL$4,1,0)","v":0},null,{"$f":"IF($C17=CN$4,1,0)","v":0},null,{"$f":"IF($C17=CP$4,1,0)","v":0},null,{"$f":"IF($C17=CR$4,1,0)","v":0},null,{"$f":"IF($C17=CT$4,1,0)","v":0},null,{"$f":"IF($C17=CV$4,1,0)","v":0},null,{"$f":"IF($C17=CX$4,1,0)","v":0},null,{"$f":"IF($C17=CZ$4,1,0)","v":0},null,{"$f":"IF($C17=DB$4,1,0)","v":0},null,{"$f":"IF($C17=DD$4,1,0)","v":0},null,{"$f":"IF($C17=DF$4,1,0)","v":0},null,{"$f":"IF($C17=DH$4,1,0)","v":0},null,{"$f":"IF($C17=DJ$4,1,0)","v":0},null,{"$f":"IF($C17=DL$4,1,0)","v":0},null,{"$f":"IF($C17=DN$4,1,0)","v":0},null,{"$f":"IF($C17=DP$4,1,0)","v":0},null,{"$f":"IF($C17=DR$4,1,0)","v":0},null,{"$f":"IF($C17=DT$4,1,0)","v":0},null,{"$f":"IF($C17=DV$4,1,0)","v":0},null,{"$f":"IF($C17=DX$4,1,0)","v":0}]
[null,null,2,{"$f":"HLOOKUP($C18,'Dados Gerais'!$D$5:$BK$10,6)","v":"ENCARREGADO SETORIAL"},null,null,{"$f":"HLOOKUP($C18,'Dados Gerais'!$D$5:$BK$14,10)","v":1},null,null,{"$f":"IF($C18=J$4,1,0)","v":0},null,1,null,0,null,0,null,0,null,0,null,0,null,0,null,0,null,0,null,0,null,0,null,0,null,0,null,0,null,0,null,0,null,0,null,0,null,0,null,0,null,0,null,0,null,0,null,0,null,0,null,0,null,0,null,0,null,0,null,0,null,0,null,0,null,0,null,0,null,0,null,0,null,0,null,0,null,0,null,0,null,0,null,0,null,0,null,0,null,0,null,0,null,0,null,0,null,0,null,0,null,0,null,0,null,0,null,0,null,0,null,0,null,0,null,0,null,0]
[null,null,null,null,null,null,null,null,null,{"$f":"IF($C19=J$4,1,0)","v":0},null,0,null,0,null,0,null,0,null,0,null,0,null,0,null,0,null,0,null,0,null,0,null,0,null,0,null,0,null,0,null,0,null,0,null,0,null,0,null,0,null,0,null,0,null,0,null,0,null,0,null,0,null,0,null,0,null,0,null,0,null,0,null,0,null,0,null,0,null,0,null,0,null,0,null,0,null,0,null,0,null,0,null,0,null,0,null,0,null,0,null,0,null,0,null,0,null,0,null,0,null,0,null,0,null,0,null,0,null,0,null,0,null,0,null,0,null,0]
[]
[null,null,"ITEM","DESCRIÇÃO","QUANT ANUAL POR POSTO","UNIDADE","VALOR"]
[null,null,null,null,null,null,null,null,null,null,{"$f":"IF(SUM(J$8:J$10)>0,$E22*$G22,0)","v":0},null,{"$f":"IF(SUM(L$8:L$10)>0,$E22*$G22,0)","v":0},null,{"$f":"IF(SUM(N$8:N$10)>0,$E22*$G22,0)","v":0},null,{"$f":"IF(SUM(P$8:P$10)>0,$E22*$G22,0)","v":0},null,{"$f":"IF(SUM(R$8:R$10)>0,$E22*$G22,0)","v":0},null,{"$f":"IF(SUM(T$8:T$10)>0,$E22*$G22,0)","v":0},null,{"$f":"IF(SUM(V$8:V$10)>0,$E22*$G22,0)","v":0},null,{"$f":"IF(SUM(X$8:X$10)>0,$E22*$G22,0)","v":0},null,{"$f":"IF(SUM(Z$8:Z$10)>0,$E22*$G22,0)","v":0},null,{"$f":"IF(SUM(AB$8:AB$10)>0,$E22*$G22,0)","v":0},null,{"$f":"IF(SUM(AD$8:AD$10)>0,$E22*$G22,0)","v":0},null,{"$f":"IF(SUM(AF$8:AF$10)>0,$E22*$G22,0)","v":0},null,{"$f":"IF(SUM(AH$8:AH$10)>0,$E22*$G22,0)","v":0},null,{"$f":"IF(SUM(AJ$8:AJ$10)>0,$E22*$G22,0)","v":0},null,{"$f":"IF(SUM(AL$8:AL$10)>0,$E22*$G22,0)","v":0},null,{"$f":"IF(SUM(AN$8:AN$10)>0,$E22*$G22,0)","v":0},null,{"$f":"IF(SUM(AP$8:AP$10)>0,$E22*$G22,0)","v":0},null,{"$f":"IF(SUM(AR$8:AR$10)>0,$E22*$G22,0)","v":0},null,{"$f":"IF(SUM(AT$8:AT$10)>0,$E22*$G22,0)","v":0},null,{"$f":"IF(SUM(AV$8:AV$10)>0,$E22*$G22,0)","v":0},null,{"$f":"IF(SUM(AX$8:AX$10)>0,$E22*$G22,0)","v":0},null,{"$f":"IF(SUM(AZ$8:AZ$10)>0,$E22*$G22,0)","v":0},null,{"$f":"IF(SUM(BB$8:BB$10)>0,$E22*$G22,0)","v":0},null,{"$f":"IF(SUM(BD$8:BD$10)>0,$E22*$G22,0)","v":0},null,{"$f":"IF(SUM(BF$8:BF$10)>0,$E22*$G22,0)","v":0},null,{"$f":"IF(SUM(BH$8:BH$10)>0,$E22*$G22,0)","v":0},null,{"$f":"IF(SUM(BJ$8:BJ$10)>0,$E22*$G22,0)","v":0},null,{"$f":"IF(SUM(BL$8:BL$10)>0,$E22*$G22,0)","v":0},null,{"$f":"IF(SUM(BN$8:BN$10)>0,$E22*$G22,0)","v":0},null,{"$f":"IF(SUM(BP$8:BP$10)>0,$E22*$G22,0)","v":0},null,{"$f":"IF(SUM(BR$8:BR$10)>0,$E22*$G22,0)","v":0},null,{"$f":"IF(SUM(BT$8:BT$10)>0,$E22*$G22,0)","v":0},null,{"$f":"IF(SUM(BV$8:BV$10)>0,$E22*$G22,0)","v":0},null,{"$f":"IF(SUM(BX$8:BX$10)>0,$E22*$G22,0)","v":0},null,{"$f":"IF(SUM(BZ$8:BZ$10)>0,$E22*$G22,0)","v":0},null,{"$f":"IF(SUM(CB$8:CB$10)>0,$E22*$G22,0)","v":0},null,{"$f":"IF(SUM(CD$8:CD$10)>0,$E22*$G22,0)","v":0},null,{"$f":"IF(SUM(CF$8:CF$10)>0,$E22*$G22,0)","v":0},null,{"$f":"IF(SUM(CH$8:CH$10)>0,$E22*$G22,0)","v":0},null,{"$f":"IF(SUM(CJ$8:CJ$10)>0,$E22*$G22,0)","v":0},null,{"$f":"IF(SUM(CL$8:CL$10)>0,$E22*$G22,0)","v":0},null,{"$f":"IF(SUM(CN$8:CN$10)>0,$E22*$G22,0)","v":0},null,{"$f":"IF(SUM(CP$8:CP$10)>0,$E22*$G22,0)","v":0},null,{"$f":"IF(SUM(CR$8:CR$10)>0,$E22*$G22,0)","v":0},null,{"$f":"IF(SUM(CT$8:CT$10)>0,$E22*$G22,0)","v":0},null,{"$f":"IF(SUM(CV$8:CV$10)>0,$E22*$G22,0)","v":0},null,{"$f":"IF(SUM(CX$8:CX$10)>0,$E22*$G22,0)","v":0},null,{"$f":"IF(SUM(CZ$8:CZ$10)>0,$E22*$G22,0)","v":0},null,{"$f":"IF(SUM(DB$8:DB$10)>0,$E22*$G22,0)","v":0},null,{"$f":"IF(SUM(DD$8:DD$10)>0,$E22*$G22,0)","v":0},null,{"$f":"IF(SUM(DF$8:DF$10)>0,$E22*$G22,0)","v":0},null,{"$f":"IF(SUM(DH$8:DH$10)>0,$E22*$G22,0)","v":0},null,{"$f":"IF(SUM(DJ$8:DJ$10)>0,$E22*$G22,0)","v":0},null,{"$f":"IF(SUM(DL$8:DL$10)>0,$E22*$G22,0)","v":0},null,{"$f":"IF(SUM(DN$8:DN$10)>0,$E22*$G22,0)","v":0},null,{"$f":"IF(SUM(DP$8:DP$10)>0,$E22*$G22,0)","v":0},null,{"$f":"IF(SUM(DR$8:DR$10)>0,$E22*$G22,0)","v":0},null,{"$f":"IF(SUM(DT$8:DT$10)>0,$E22*$G22,0)","v":0},null,{"$f":"IF(SUM(DV$8:DV$10)>0,$E22*$G22,0)","v":0},null,{"$f":"IF(SUM(DX$8:DX$10)>0,$E22*$G22,0)","v":0}]
[null,null,1,"Calçado de segurança tipo sapato com resistência a objetos pontiagudos, fechamento em elástico, couro preto, forração em tecido, bico de composite, palmilha de montagem têxtil resistente à perfuração, solado de PU (poliuretano), bidensidade sem cadarço. Ref. MARLUVAS.",2,"PAR",{"$f":"G14","v":117.26},null,null,null,{"$f":"IF(SUM(J$17:J$19)>0,$E23*$G23,0)","v":0},null,{"$f":"IF(SUM(L$17:L$19)>0,$E23*$G23,0)","v":234.52},null,{"$f":"IF(SUM(N$17:N$19)>0,$E23*$G23,0)","v":0},null,{"$f":"IF(SUM(P$17:P$19)>0,$E23*$G23,0)","v":0},null,{"$f":"IF(SUM(R$17:R$19)>0,$E23*$G23,0)","v":0},null,{"$f":"IF(SUM(T$17:T$19)>0,$E23*$G23,0)","v":0},null,{"$f":"IF(SUM(V$17:V$19)>0,$E23*$G23,0)","v":0},null,{"$f":"IF(SUM(X$17:X$19)>0,$E23*$G23,0)","v":0},null,{"$f":"IF(SUM(Z$17:Z$19)>0,$E23*$G23,0)","v":0},null,{"$f":"IF(SUM(AB$17:AB$19)>0,$E23*$G23,0)","v":0},null,{"$f":"IF(SUM(AD$17:AD$19)>0,$E23*$G23,0)","v":0},null,{"$f":"IF(SUM(AF$17:AF$19)>0,$E23*$G23,0)","v":0},null,{"$f":"IF(SUM(AH$17:AH$19)>0,$E23*$G23,0)","v":0},null,{"$f":"IF(SUM(AJ$17:AJ$19)>0,$E23*$G23,0)","v":0},null,{"$f":"IF(SUM(AL$17:AL$19)>0,$E23*$G23,0)","v":0},null,{"$f":"IF(SUM(AN$17:AN$19)>0,$E23*$G23,0)","v":0},null,{"$f":"IF(SUM(AP$17:AP$19)>0,$E23*$G23,0)","v":0},null,{"$f":"IF(SUM(AR$17:AR$19)>0,$E23*$G23,0)","v":0},null,{"$f":"IF(SUM(AT$17:AT$19)>0,$E23*$G23,0)","v":0},null,{"$f":"IF(SUM(AV$17:AV$19)>0,$E23*$G23,0)","v":0},null,{"$f":"IF(SUM(AX$17:AX$19)>0,$E23*$G23,0)","v":0},null,{"$f":"IF(SUM(AZ$17:AZ$19)>0,$E23*$G23,0)","v":0},null,{"$f":"IF(SUM(BB$17:BB$19)>0,$E23*$G23,0)","v":0},null,{"$f":"IF(SUM(BD$17:BD$19)>0,$E23*$G23,0)","v":0},null,{"$f":"IF(SUM(BF$17:BF$19)>0,$E23*$G23,0)","v":0},null,{"$f":"IF(SUM(BH$17:BH$19)>0,$E23*$G23,0)","v":0},null,{"$f":"IF(SUM(BJ$17:BJ$19)>0,$E23*$G23,0)","v":0},null,{"$f":"IF(SUM(BL$17:BL$19)>0,$E23*$G23,0)","v":0},null,{"$f":"IF(SUM(BN$17:BN$19)>0,$E23*$G23,0)","v":0},null,{"$f":"IF(SUM(BP$17:BP$19)>0,$E23*$G23,0)","v":0},null,{"$f":"IF(SUM(BR$17:BR$19)>0,$E23*$G23,0)","v":0},null,{"$f":"IF(SUM(BT$17:BT$19)>0,$E23*$G23,0)","v":0},null,{"$f":"IF(SUM(BV$17:BV$19)>0,$E23*$G23,0)","v":0},null,{"$f":"IF(SUM(BX$17:BX$19)>0,$E23*$G23,0)","v":0},null,{"$f":"IF(SUM(BZ$17:BZ$19)>0,$E23*$G23,0)","v":0},null,{"$f":"IF(SUM(CB$17:CB$19)>0,$E23*$G23,0)","v":0},null,{"$f":"IF(SUM(CD$17:CD$19)>0,$E23*$G23,0)","v":0},null,{"$f":"IF(SUM(CF$17:CF$19)>0,$E23*$G23,0)","v":0},null,{"$f":"IF(SUM(CH$17:CH$19)>0,$E23*$G23,0)","v":0},null,{"$f":"IF(SUM(CJ$17:CJ$19)>0,$E23*$G23,0)","v":0},null,{"$f":"IF(SUM(CL$17:CL$19)>0,$E23*$G23,0)","v":0},null,{"$f":"IF(SUM(CN$17:CN$19)>0,$E23*$G23,0)","v":0},null,{"$f":"IF(SUM(CP$17:CP$19)>0,$E23*$G23,0)","v":0},null,{"$f":"IF(SUM(CR$17:CR$19)>0,$E23*$G23,0)","v":0},null,{"$f":"IF(SUM(CT$17:CT$19)>0,$E23*$G23,0)","v":0},null,{"$f":"IF(SUM(CV$17:CV$19)>0,$E23*$G23,0)","v":0},null,{"$f":"IF(SUM(CX$17:CX$19)>0,$E23*$G23,0)","v":0},null,{"$f":"IF(SUM(CZ$17:CZ$19)>0,$E23*$G23,0)","v":0},null,{"$f":"IF(SUM(DB$17:DB$19)>0,$E23*$G23,0)","v":0},null,{"$f":"IF(SUM(DD$17:DD$19)>0,$E23*$G23,0)","v":0},null,{"$f":"IF(SUM(DF$17:DF$19)>0,$E23*$G23,0)","v":0},null,{"$f":"IF(SUM(DH$17:DH$19)>0,$E23*$G23,0)","v":0},null,{"$f":"IF(SUM(DJ$17:DJ$19)>0,$E23*$G23,0)","v":0},null,{"$f":"IF(SUM(DL$17:DL$19)>0,$E23*$G23,0)","v":0},null,{"$f":"IF(SUM(DN$17:DN$19)>0,$E23*$G23,0)","v":0},null,{"$f":"IF(SUM(DP$17:DP$19)>0,$E23*$G23,0)","v":0},null,{"$f":"IF(SUM(DR$17:DR$19)>0,$E23*$G23,0)","v":0},null,{"$f":"IF(SUM(DT$17:DT$19)>0,$E23*$G23,0)","v":0},null,{"$f":"IF(SUM(DV$17:DV$19)>0,$E23*$G23,0)","v":0},null,{"$f":"IF(SUM(DX$17:DX$19)>0,$E23*$G23,0)","v":0}]
[null,null,null,null,null,null,null,null,null,null,{"$f":"IF(SUM(J$17:J$19)>0,$E24*$G24,0)","v":0},null,{"$f":"IF(SUM(L$17:L$19)>0,$E24*$G24,0)","v":0},null,{"$f":"IF(SUM(N$17:N$19)>0,$E24*$G24,0)","v":0},null,{"$f":"IF(SUM(P$17:P$19)>0,$E24*$G24,0)","v":0},null,{"$f":"IF(SUM(R$17:R$19)>0,$E24*$G24,0)","v":0},null,{"$f":"IF(SUM(T$17:T$19)>0,$E24*$G24,0)","v":0},null,{"$f":"IF(SUM(V$17:V$19)>0,$E24*$G24,0)","v":0},null,{"$f":"IF(SUM(X$17:X$19)>0,$E24*$G24,0)","v":0},null,{"$f":"IF(SUM(Z$17:Z$19)>0,$E24*$G24,0)","v":0},null,{"$f":"IF(SUM(AB$17:AB$19)>0,$E24*$G24,0)","v":0},null,{"$f":"IF(SUM(AD$17:AD$19)>0,$E24*$G24,0)","v":0},null,{"$f":"IF(SUM(AF$17:AF$19)>0,$E24*$G24,0)","v":0},null,{"$f":"IF(SUM(AH$17:AH$19)>0,$E24*$G24,0)","v":0},null,{"$f":"IF(SUM(AJ$17:AJ$19)>0,$E24*$G24,0)","v":0},null,{"$f":"IF(SUM(AL$17:AL$19)>0,$E24*$G24,0)","v":0},null,{"$f":"IF(SUM(AN$17:AN$19)>0,$E24*$G24,0)","v":0},null,{"$f":"IF(SUM(AP$17:AP$19)>0,$E24*$G24,0)","v":0},null,{"$f":"IF(SUM(AR$17:AR$19)>0,$E24*$G24,0)","v":0},null,{"$f":"IF(SUM(AT$17:AT$19)>0,$E24*$G24,0)","v":0},null,{"$f":"IF(SUM(AV$17:AV$19)>0,$E24*$G24,0)","v":0},null,{"$f":"IF(SUM(AX$17:AX$19)>0,$E24*$G24,0)","v":0},null,{"$f":"IF(SUM(AZ$17:AZ$19)>0,$E24*$G24,0)","v":0},null,{"$f":"IF(SUM(BB$17:BB$19)>0,$E24*$G24,0)","v":0},null,{"$f":"IF(SUM(BD$17:BD$19)>0,$E24*$G24,0)","v":0},null,{"$f":"IF(SUM(BF$17:BF$19)>0,$E24*$G24,0)","v":0},null,{"$f":"IF(SUM(BH$17:BH$19)>0,$E24*$G24,0)","v":0},null,{"$f":"IF(SUM(BJ$17:BJ$19)>0,$E24*$G24,0)","v":0},null,{"$f":"IF(SUM(BL$17:BL$19)>0,$E24*$G24,0)","v":0},null,{"$f":"IF(SUM(BN$17:BN$19)>0,$E24*$G24,0)","v":0},null,{"$f":"IF(SUM(BP$17:BP$19)>0,$E24*$G24,0)","v":0},null,{"$f":"IF(SUM(BR$17:BR$19)>0,$E24*$G24,0)","v":0},null,{"$f":"IF(SUM(BT$17:BT$19)>0,$E24*$G24,0)","v":0},null,{"$f":"IF(SUM(BV$17:BV$19)>0,$E24*$G24,0)","v":0},null,{"$f":"IF(SUM(BX$17:BX$19)>0,$E24*$G24,0)","v":0},null,{"$f":"IF(SUM(BZ$17:BZ$19)>0,$E24*$G24,0)","v":0},null,{"$f":"IF(SUM(CB$17:CB$19)>0,$E24*$G24,0)","v":0},null,{"$f":"IF(SUM(CD$17:CD$19)>0,$E24*$G24,0)","v":0},null,{"$f":"IF(SUM(CF$17:CF$19)>0,$E24*$G24,0)","v":0},null,{"$f":"IF(SUM(CH$17:CH$19)>0,$E24*$G24,0)","v":0},null,{"$f":"IF(SUM(CJ$17:CJ$19)>0,$E24*$G24,0)","v":0},null,{"$f":"IF(SUM(CL$17:CL$19)>0,$E24*$G24,0)","v":0},null,{"$f":"IF(SUM(CN$17:CN$19)>0,$E24*$G24,0)","v":0},null,{"$f":"IF(SUM(CP$17:CP$19)>0,$E24*$G24,0)","v":0},null,{"$f":"IF(SUM(CR$17:CR$19)>0,$E24*$G24,0)","v":0},null,{"$f":"IF(SUM(CT$17:CT$19)>0,$E24*$G24,0)","v":0},null,{"$f":"IF(SUM(CV$17:CV$19)>0,$E24*$G24,0)","v":0},null,{"$f":"IF(SUM(CX$17:CX$19)>0,$E24*$G24,0)","v":0},null,{"$f":"IF(SUM(CZ$17:CZ$19)>0,$E24*$G24,0)","v":0},null,{"$f":"IF(SUM(DB$17:DB$19)>0,$E24*$G24,0)","v":0},null,{"$f":"IF(SUM(DD$17:DD$19)>0,$E24*$G24,0)","v":0},null,{"$f":"IF(SUM(DF$17:DF$19)>0,$E24*$G24,0)","v":0},null,{"$f":"IF(SUM(DH$17:DH$19)>0,$E24*$G24,0)","v":0},null,{"$f":"IF(SUM(DJ$17:DJ$19)>0,$E24*$G24,0)","v":0},null,{"$f":"IF(SUM(DL$17:DL$19)>0,$E24*$G24,0)","v":0},null,{"$f":"IF(SUM(DN$17:DN$19)>0,$E24*$G24,0)","v":0},null,{"$f":"IF(SUM(DP$17:DP$19)>0,$E24*$G24,0)","v":0},null,{"$f":"IF(SUM(DR$17:DR$19)>0,$E24*$G24,0)","v":0},null,{"$f":"IF(SUM(DT$17:DT$19)>0,$E24*$G24,0)","v":0},null,{"$f":"IF(SUM(DV$17:DV$19)>0,$E24*$G24,0)","v":0},null,0]
[null,null,"CATEGORIAS",null,null,null,"QUANTIDADE"]
[null,null,null,null,null,null,null,null,null,{"$f":"IF($C26=J$4,1,0)","v":0},null,{"$f":"IF($C26=L$4,1,0)","v":0},null,{"$f":"IF($C26=N$4,1,0)","v":0},null,{"$f":"IF($C26=P$4,1,0)","v":0},null,{"$f":"IF($C26=R$4,1,0)","v":0},null,{"$f":"IF($C26=T$4,1,0)","v":0},null,{"$f":"IF($C26=V$4,1,0)","v":0},null,{"$f":"IF($C26=X$4,1,0)","v":0},null,{"$f":"IF($C26=Z$4,1,0)","v":0},null,{"$f":"IF($C26=AB$4,1,0)","v":0},null,{"$f":"IF($C26=AD$4,1,0)","v":0},null,{"$f":"IF($C26=AF$4,1,0)","v":0},null,{"$f":"IF($C26=AH$4,1,0)","v":0},null,{"$f":"IF($C26=AJ$4,1,0)","v":0},null,{"$f":"IF($C26=AL$4,1,0)","v":0},null,{"$f":"IF($C26=AN$4,1,0)","v":0},null,{"$f":"IF($C26=AP$4,1,0)","v":0},null,{"$f":"IF($C26=AR$4,1,0)","v":0},null,{"$f":"IF($C26=AT$4,1,0)","v":0},null,{"$f":"IF($C26=AV$4,1,0)","v":0},null,{"$f":"IF($C26=AX$4,1,0)","v":0},null,{"$f":"IF($C26=AZ$4,1,0)","v":0},null,{"$f":"IF($C26=BB$4,1,0)","v":0},null,{"$f":"IF($C26=BD$4,1,0)","v":0},null,{"$f":"IF($C26=BF$4,1,0)","v":0},null,{"$f":"IF($C26=BH$4,1,0)","v":0},null,{"$f":"IF($C26=BJ$4,1,0)","v":0},null,{"$f":"IF($C26=BL$4,1,0)","v":0},null,{"$f":"IF($C26=BN$4,1,0)","v":0},null,{"$f":"IF($C26=BP$4,1,0)","v":0},null,{"$f":"IF($C26=BR$4,1,0)","v":0},null,{"$f":"IF($C26=BT$4,1,0)","v":0},null,{"$f":"IF($C26=BV$4,1,0)","v":0},null,{"$f":"IF($C26=BX$4,1,0)","v":0},null,{"$f":"IF($C26=BZ$4,1,0)","v":0},null,{"$f":"IF($C26=CB$4,1,0)","v":0},null,{"$f":"IF($C26=CD$4,1,0)","v":0},null,{"$f":"IF($C26=CF$4,1,0)","v":0},null,{"$f":"IF($C26=CH$4,1,0)","v":0},null,{"$f":"IF($C26=CJ$4,1,0)","v":0},null,{"$f":"IF($C26=CL$4,1,0)","v":0},null,{"$f":"IF($C26=CN$4,1,0)","v":0},null,{"$f":"IF($C26=CP$4,1,0)","v":0},null,{"$f":"IF($C26=CR$4,1,0)","v":0},null,{"$f":"IF($C26=CT$4,1,0)","v":0},null,{"$f":"IF($C26=CV$4,1,0)","v":0},null,{"$f":"IF($C26=CX$4,1,0)","v":0},null,{"$f":"IF($C26=CZ$4,1,0)","v":0},null,{"$f":"IF($C26=DB$4,1,0)","v":0},null,{"$f":"IF($C26=DD$4,1,0)","v":0},null,{"$f":"IF($C26=DF$4,1,0)","v":0},null,{"$f":"IF($C26=DH$4,1,0)","v":0},null,{"$f":"IF($C26=DJ$4,1,0)","v":0},null,{"$f":"IF($C26=DL$4,1,0)","v":0},null,{"$f":"IF($C26=DN$4,1,0)","v":0},null,{"$f":"IF($C26=DP$4,1,0)","v":0},null,{"$f":"IF($C26=DR$4,1,0)","v":0},null,{"$f":"IF($C26=DT$4,1,0)","v":0},null,{"$f":"IF($C26=DV$4,1,0)","v":0},null,{"$f":"IF($C26=DX$4,1,0)","v":0}]
[null,null,3,{"$f":"HLOOKUP($C27,'Dados Gerais'!$D$5:$BK$10,6)","v":"ENCARREGADO DE SERVIÇO"},null,null,{"$f":"HLOOKUP($C27,'Dados Gerais'!$D$5:$BK$14,10)","v":13},null,null,{"$f":"IF($C27=J$4,1,0)","v":0},null,0,null,1,null,0,null,0,null,0,null,0,null,0,null,0,null,0,null,0,null,0,null,0,null,0,null,0,null,0,null,0,null,0,null,0,null,0,null,0,null,0,null,0,null,0,null,0,null,0,null,0,null,0,null,0,null,0,null,0,null,0,null,0,null,0,null,0,null,0,null,0,null,0,null,0,null,0,null,0,null,0,null,0,null,0,null,0,null,0,null,0,null,0,null,0,null,0,null,0,null,0,null,0,null,0,null,0,null,0,null,0,null,0,null,0,null,0]
[null,null,4,{"$f":"HLOOKUP($C28,'Dados Gerais'!$D$5:$BK$10,6)","v":"ENCARREGADO DE SERVIÇO COM ADICIONAL DE INSALUBRIDADE"},null,null,{"$f":"HLOOKUP($C28,'Dados Gerais'!$D$5:$BK$14,10)","v":2},null,null,{"$f":"IF($C28=J$4,1,0)","v":0},null,0,null,0,null,1,null,0,null,0,null,0,null,0,null,0,null,0,null,0,null,0,null,0,null,0,null,0,null,0,null,0,null,0,null,0,null,0,null,0,null,0,null,0,null,0,null,0,null,0,null,0,null,0,null,0,null,0,null,0,null,0,null,0,null,0,null,0,null,0,null,0,null,0,null,0,null,0,null,0,null,0,null,0,null,0,null,0,null,0,null,0,null,0,null,0,null,0,null,0,null,0,null,0,null,0,null,0,null,0,null,0,null,0,null,0,null,0]
[null,null,null,null,null,null,null,null,null,{"$f":"IF($C29=J$4,1,0)","v":0},null,0,null,0,null,0,null,0,null,0,null,0,null,0,null,0,null,0,null,0,null,0,null,0,null,0,null,0,null,0,null,0,null,0,null,0,null,0,null,0,null,0,null,0,null,0,null,0,null,0,null,0,null,0,null,0,null,0,null,0,null,0,null,0,null,0,null,0,null,0,null,0,null,0,null,0,null,0,null,0,null,0,null,0,null,0,null,0,null,0,null,0,null,0,null,0,null,0,null,0,null,0,null,0,null,0,null,0,null,0,null,0,null,0,null,0,null,0]
[]
[null,null,"ITEM","DESCRIÇÃO","QUANT ANUAL POR POSTO","UNIDADE","VALOR"]
[null,null,null,null,null,null,null,null,null,null,{"$f":"IF(SUM(J$8:J$10)>0,$E32*$G32,0)","v":0},null,{"$f":"IF(SUM(L$8:L$10)>0,$E32*$G32,0)","v":0},null,{"$f":"IF(SUM(N$8:N$10)>0,$E32*$G32,0)","v":0},null,{"$f":"IF(SUM(P$8:P$10)>0,$E32*$G32,0)","v":0},null,{"$f":"IF(SUM(R$8:R$10)>0,$E32*$G32,0)","v":0},null,{"$f":"IF(SUM(T$8:T$10)>0,$E32*$G32,0)","v":0},null,{"$f":"IF(SUM(V$8:V$10)>0,$E32*$G32,0)","v":0},null,{"$f":"IF(SUM(X$8:X$10)>0,$E32*$G32,0)","v":0},null,{"$f":"IF(SUM(Z$8:Z$10)>0,$E32*$G32,0)","v":0},null,{"$f":"IF(SUM(AB$8:AB$10)>0,$E32*$G32,0)","v":0},null,{"$f":"IF(SUM(AD$8:AD$10)>0,$E32*$G32,0)","v":0},null,{"$f":"IF(SUM(AF$8:AF$10)>0,$E32*$G32,0)","v":0},null,{"$f":"IF(SUM(AH$8:AH$10)>0,$E32*$G32,0)","v":0},null,{"$f":"IF(SUM(AJ$8:AJ$10)>0,$E32*$G32,0)","v":0},null,{"$f":"IF(SUM(AL$8:AL$10)>0,$E32*$G32,0)","v":0},null,{"$f":"IF(SUM(AN$8:AN$10)>0,$E32*$G32,0)","v":0},null,{"$f":"IF(SUM(AP$8:AP$10)>0,$E32*$G32,0)","v":0},null,{"$f":"IF(SUM(AR$8:AR$10)>0,$E32*$G32,0)","v":0},null,{"$f":"IF(SUM(AT$8:AT$10)>0,$E32*$G32,0)","v":0},null,{"$f":"IF(SUM(AV$8:AV$10)>0,$E32*$G32,0)","v":0},null,{"$f":"IF(SUM(AX$8:AX$10)>0,$E32*$G32,0)","v":0},null,{"$f":"IF(SUM(AZ$8:AZ$10)>0,$E32*$G32,0)","v":0},null,{"$f":"IF(SUM(BB$8:BB$10)>0,$E32*$G32,0)","v":0},null,{"$f":"IF(SUM(BD$8:BD$10)>0,$E32*$G32,0)","v":0},null,{"$f":"IF(SUM(BF$8:BF$10)>0,$E32*$G32,0)","v":0},null,{"$f":"IF(SUM(BH$8:BH$10)>0,$E32*$G32,0)","v":0},null,{"$f":"IF(SUM(BJ$8:BJ$10)>0,$E32*$G32,0)","v":0},null,{"$f":"IF(SUM(BL$8:BL$10)>0,$E32*$G32,0)","v":0},null,{"$f":"IF(SUM(BN$8:BN$10)>0,$E32*$G32,0)","v":0},null,{"$f":"IF(SUM(BP$8:BP$10)>0,$E32*$G32,0)","v":0},null,{"$f":"IF(SUM(BR$8:BR$10)>0,$E32*$G32,0)","v":0},null,{"$f":"IF(SUM(BT$8:BT$10)>0,$E32*$G32,0)","v":0},null,{"$f":"IF(SUM(BV$8:BV$10)>0,$E32*$G32,0)","v":0},null,{"$f":"IF(SUM(BX$8:BX$10)>0,$E32*$G32,0)","v":0},null,{"$f":"IF(SUM(BZ$8:BZ$10)>0,$E32*$G32,0)","v":0},null,{"$f":"IF(SUM(CB$8:CB$10)>0,$E32*$G32,0)","v":0},null,{"$f":"IF(SUM(CD$8:CD$10)>0,$E32*$G32,0)","v":0},null,{"$f":"IF(SUM(CF$8:CF$10)>0,$E32*$G32,0)","v":0},null,{"$f":"IF(SUM(CH$8:CH$10)>0,$E32*$G32,0)","v":0},null,{"$f":"IF(SUM(CJ$8:CJ$10)>0,$E32*$G32,0)","v":0},null,{"$f":"IF(SUM(CL$8:CL$10)>0,$E32*$G32,0)","v":0},null,{"$f":"IF(SUM(CN$8:CN$10)>0,$E32*$G32,0)","v":0},null,{"$f":"IF(SUM(CP$8:CP$10)>0,$E32*$G32,0)","v":0},null,{"$f":"IF(SUM(CR$8:CR$10)>0,$E32*$G32,0)","v":0},null,{"$f":"IF(SUM(CT$8:CT$10)>0,$E32*$G32,0)","v":0},null,{"$f":"IF(SUM(CV$8:CV$10)>0,$E32*$G32,0)","v":0},null,{"$f":"IF(SUM(CX$8:CX$10)>0,$E32*$G32,0)","v":0},null,{"$f":"IF(SUM(CZ$8:CZ$10)>0,$E32*$G32,0)","v":0},null,{"$f":"IF(SUM(DB$8:DB$10)>0,$E32*$G32,0)","v":0},null,{"$f":"IF(SUM(DD$8:DD$10)>0,$E32*$G32,0)","v":0},null,{"$f":"IF(SUM(DF$8:DF$10)>0,$E32*$G32,0)","v":0},null,{"$f":"IF(SUM(DH$8:DH$10)>0,$E32*$G32,0)","v":0},null,{"$f":"IF(SUM(DJ$8:DJ$10)>0,$E32*$G32,0)","v":0},null,{"$f":"IF(SUM(DL$8:DL$10)>0,$E32*$G32,0)","v":0},null,{"$f":"IF(SUM(DN$8:DN$10)>0,$E32*$G32,0)","v":0},null,{"$f":"IF(SUM(DP$8:DP$10)>0,$E32*$G32,0)","v":0},null,{"$f":"IF(SUM(DR$8:DR$10)>0,$E32*$G32,0)","v":0},null,{"$f":"IF(SUM(DT$8:DT$10)>0,$E32*$G32,0)","v":0},null,{"$f":"IF(SUM(DV$8:DV$10)>0,$E32*$G32,0)","v":0},null,{"$f":"IF(SUM(DX$8:DX$10)>0,$E32*$G32,0)","v":0}]
[null,null,1,"Calçado de segurança tipo sapato com resistência a objetos pontiagudos, fechamento em elástico, couro preto, forração em tecido, bico de composite, palmilha de montagem têxtil resistente à perfuração, solado de PU (poliuretano), bidensidade sem cadarço. Ref. MARLUVAS.",2,"PAR",{"$f":"G23","v":117.26},null,null,null,{"$f":"IF(SUM(J$26:J$29)>0,$E33*$G33,0)","v":0},null,{"$f":"IF(SUM(L$26:L$29)>0,$E33*$G33,0)","v":0},null,{"$f":"IF(SUM(N$26:N$29)>0,$E33*$G33,0)","v":234.52},null,{"$f":"IF(SUM(P$26:P$29)>0,$E33*$G33,0)","v":234.52},null,{"$f":"IF(SUM(R$26:R$29)>0,$E33*$G33,0)","v":0},null,{"$f":"IF(SUM(T$26:T$29)>0,$E33*$G33,0)","v":0},null,{"$f":"IF(SUM(V$26:V$29)>0,$E33*$G33,0)","v":0},null,{"$f":"IF(SUM(X$26:X$29)>0,$E33*$G33,0)","v":0},null,{"$f":"IF(SUM(Z$26:Z$29)>0,$E33*$G33,0)","v":0},null,{"$f":"IF(SUM(AB$26:AB$29)>0,$E33*$G33,0)","v":0},null,{"$f":"IF(SUM(AD$26:AD$29)>0,$E33*$G33,0)","v":0},null,{"$f":"IF(SUM(AF$26:AF$29)>0,$E33*$G33,0)","v":0},null,{"$f":"IF(SUM(AH$26:AH$29)>0,$E33*$G33,0)","v":0},null,{"$f":"IF(SUM(AJ$26:AJ$29)>0,$E33*$G33,0)","v":0},null,{"$f":"IF(SUM(AL$26:AL$29)>0,$E33*$G33,0)","v":0},null,{"$f":"IF(SUM(AN$26:AN$29)>0,$E33*$G33,0)","v":0},null,{"$f":"IF(SUM(AP$26:AP$29)>0,$E33*$G33,0)","v":0},null,{"$f":"IF(SUM(AR$26:AR$29)>0,$E33*$G33,0)","v":0},null,{"$f":"IF(SUM(AT$26:AT$29)>0,$E33*$G33,0)","v":0},null,{"$f":"IF(SUM(AV$26:AV$29)>0,$E33*$G33,0)","v":0},null,{"$f":"IF(SUM(AX$26:AX$29)>0,$E33*$G33,0)","v":0},null,{"$f":"IF(SUM(AZ$26:AZ$29)>0,$E33*$G33,0)","v":0},null,{"$f":"IF(SUM(BB$26:BB$29)>0,$E33*$G33,0)","v":0},null,{"$f":"IF(SUM(BD$26:BD$29)>0,$E33*$G33,0)","v":0},null,{"$f":"IF(SUM(BF$26:BF$29)>0,$E33*$G33,0)","v":0},null,{"$f":"IF(SUM(BH$26:BH$29)>0,$E33*$G33,0)","v":0},null,{"$f":"IF(SUM(BJ$26:BJ$29)>0,$E33*$G33,0)","v":0},null,{"$f":"IF(SUM(BL$26:BL$29)>0,$E33*$G33,0)","v":0},null,{"$f":"IF(SUM(BN$26:BN$29)>0,$E33*$G33,0)","v":0},null,{"$f":"IF(SUM(BP$26:BP$29)>0,$E33*$G33,0)","v":0},null,{"$f":"IF(SUM(BR$26:BR$29)>0,$E33*$G33,0)","v":0},null,{"$f":"IF(SUM(BT$26:BT$29)>0,$E33*$G33,0)","v":0},null,{"$f":"IF(SUM(BV$26:BV$29)>0,$E33*$G33,0)","v":0},null,{"$f":"IF(SUM(BX$26:BX$29)>0,$E33*$G33,0)","v":0},null,{"$f":"IF(SUM(BZ$26:BZ$29)>0,$E33*$G33,0)","v":0},null,{"$f":"IF(SUM(CB$26:CB$29)>0,$E33*$G33,0)","v":0},null,{"$f":"IF(SUM(CD$26:CD$29)>0,$E33*$G33,0)","v":0},null,{"$f":"IF(SUM(CF$26:CF$29)>0,$E33*$G33,0)","v":0},null,{"$f":"IF(SUM(CH$26:CH$29)>0,$E33*$G33,0)","v":0},null,{"$f":"IF(SUM(CJ$26:CJ$29)>0,$E33*$G33,0)","v":0},null,{"$f":"IF(SUM(CL$26:CL$29)>0,$E33*$G33,0)","v":0},null,{"$f":"IF(SUM(CN$26:CN$29)>0,$E33*$G33,0)","v":0},null,{"$f":"IF(SUM(CP$26:CP$29)>0,$E33*$G33,0)","v":0},null,{"$f":"IF(SUM(CR$26:CR$29)>0,$E33*$G33,0)","v":0},null,{"$f":"IF(SUM(CT$26:CT$29)>0,$E33*$G33,0)","v":0},null,{"$f":"IF(SUM(CV$26:CV$29)>0,$E33*$G33,0)","v":0},null,{"$f":"IF(SUM(CX$26:CX$29)>0,$E33*$G33,0)","v":0},null,{"$f":"IF(SUM(CZ$26:CZ$29)>0,$E33*$G33,0)","v":0},null,{"$f":"IF(SUM(DB$26:DB$29)>0,$E33*$G33,0)","v":0},null,{"$f":"IF(SUM(DD$26:DD$29)>0,$E33*$G33,0)","v":0},null,{"$f":"IF(SUM(DF$26:DF$29)>0,$E33*$G33,0)","v":0},null,{"$f":"IF(SUM(DH$26:DH$29)>0,$E33*$G33,0)","v":0},null,{"$f":"IF(SUM(DJ$26:DJ$29)>0,$E33*$G33,0)","v":0},null,{"$f":"IF(SUM(DL$26:DL$29)>0,$E33*$G33,0)","v":0},null,{"$f":"IF(SUM(DN$26:DN$29)>0,$E33*$G33,0)","v":0},null,{"$f":"IF(SUM(DP$26:DP$29)>0,$E33*$G33,0)","v":0},null,{"$f":"IF(SUM(DR$26:DR$29)>0,$E33*$G33,0)","v":0},null,{"$f":"IF(SUM(DT$26:DT$29)>0,$E33*$G33,0)","v":0},null,{"$f":"IF(SUM(DV$26:DV$29)>0,$E33*$G33,0)","v":0},null,{"$f":"IF(SUM(DX$26:DX$29)>0,$E33*$G33,0)","v":0}]
[null,null,2,"Respirador purificador de ar tipo, peça semifacial filtrante para partículas (PFF2), com formato dobrável, solda ultra-sônica em todo o seu perímetro. Fita elástica branca fixada nas laterais externas do respirador, perfazendo uma alça na para fixação na parte superior da cabeça e a outra na parte inferior, para fixação na altura da nuca do usuário. A parte superior externa da peça possui tira de material metálico moldável, utilizada para ajuste no septo nasal. Com válvula de exalação. DEVERÁ APRESENTAR O SELO DE APROVAÇÃO DO INMETRO. Ref. 3M ",2,"UND",2.74,null,null,null,{"$f":"IF(SUM(J$26:J$29)>0,$E34*$G34,0)","v":0},null,{"$f":"IF(SUM(L$26:L$29)>0,$E34*$G34,0)","v":0},null,{"$f":"IF(SUM(N$26:N$29)>0,$E34*$G34,0)","v":5.48},null,{"$f":"IF(SUM(P$26:P$29)>0,$E34*$G34,0)","v":5.48},null,{"$f":"IF(SUM(R$26:R$29)>0,$E34*$G34,0)","v":0},null,{"$f":"IF(SUM(T$26:T$29)>0,$E34*$G34,0)","v":0},null,{"$f":"IF(SUM(V$26:V$29)>0,$E34*$G34,0)","v":0},null,{"$f":"IF(SUM(X$26:X$29)>0,$E34*$G34,0)","v":0},null,{"$f":"IF(SUM(Z$26:Z$29)>0,$E34*$G34,0)","v":0},null,{"$f":"IF(SUM(AB$26:AB$29)>0,$E34*$G34,0)","v":0},null,{"$f":"IF(SUM(AD$26:AD$29)>0,$E34*$G34,0)","v":0},null,{"$f":"IF(SUM(AF$26:AF$29)>0,$E34*$G34,0)","v":0},null,{"$f":"IF(SUM(AH$26:AH$29)>0,$E34*$G34,0)","v":0},null,{"$f":"IF(SUM(AJ$26:AJ$29)>0,$E34*$G34,0)","v":0},null,{"$f":"IF(SUM(AL$26:AL$29)>0,$E34*$G34,0)","v":0},null,{"$f":"IF(SUM(AN$26:AN$29)>0,$E34*$G34,0)","v":0},null,{"$f":"IF(SUM(AP$26:AP$29)>0,$E34*$G34,0)","v":0},null,{"$f":"IF(SUM(AR$26:AR$29)>0,$E34*$G34,0)","v":0},null,{"$f":"IF(SUM(AT$26:AT$29)>0,$E34*$G34,0)","v":0},null,{"$f":"IF(SUM(AV$26:AV$29)>0,$E34*$G34,0)","v":0},null,{"$f":"IF(SUM(AX$26:AX$29)>0,$E34*$G34,0)","v":0},null,{"$f":"IF(SUM(AZ$26:AZ$29)>0,$E34*$G34,0)","v":0},null,{"$f":"IF(SUM(BB$26:BB$29)>0,$E34*$G34,0)","v":0},null,{"$f":"IF(SUM(BD$26:BD$29)>0,$E34*$G34,0)","v":0},null,{"$f":"IF(SUM(BF$26:BF$29)>0,$E34*$G34,0)","v":0},null,{"$f":"IF(SUM(BH$26:BH$29)>0,$E34*$G34,0)","v":0},null,{"$f":"IF(SUM(BJ$26:BJ$29)>0,$E34*$G34,0)","v":0},null,{"$f":"IF(SUM(BL$26:BL$29)>0,$E34*$G34,0)","v":0},null,{"$f":"IF(SUM(BN$26:BN$29)>0,$E34*$G34,0)","v":0},null,{"$f":"IF(SUM(BP$26:BP$29)>0,$E34*$G34,0)","v":0},null,{"$f":"IF(SUM(BR$26:BR$29)>0,$E34*$G34,0)","v":0},null,{"$f":"IF(SUM(BT$26:BT$29)>0,$E34*$G34,0)","v":0},null,{"$f":"IF(SUM(BV$26:BV$29)>0,$E34*$G34,0)","v":0},null,{"$f":"IF(SUM(BX$26:BX$29)>0,$E34*$G34,0)","v":0},null,{"$f":"IF(SUM(BZ$26:BZ$29)>0,$E34*$G34,0)","v":0},null,{"$f":"IF(SUM(CB$26:CB$29)>0,$E34*$G34,0)","v":0},null,{"$f":"IF(SUM(CD$26:CD$29)>0,$E34*$G34,0)","v":0},null,{"$f":"IF(SUM(CF$26:CF$29)>0,$E34*$G34,0)","v":0},null,{"$f":"IF(SUM(CH$26:CH$29)>0,$E34*$G34,0)","v":0},null,{"$f":"IF(SUM(CJ$26:CJ$29)>0,$E34*$G34,0)","v":0},null,{"$f":"IF(SUM(CL$26:CL$29)>0,$E34*$G34,0)","v":0},null,{"$f":"IF(SUM(CN$26:CN$29)>0,$E34*$G34,0)","v":0},null,{"$f":"IF(SUM(CP$26:CP$29)>0,$E34*$G34,0)","v":0},null,{"$f":"IF(SUM(CR$26:CR$29)>0,$E34*$G34,0)","v":0},null,{"$f":"IF(SUM(CT$26:CT$29)>0,$E34*$G34,0)","v":0},null,{"$f":"IF(SUM(CV$26:CV$29)>0,$E34*$G34,0)","v":0},null,{"$f":"IF(SUM(CX$26:CX$29)>0,$E34*$G34,0)","v":0},null,{"$f":"IF(SUM(CZ$26:CZ$29)>0,$E34*$G34,0)","v":0},null,{"$f":"IF(SUM(DB$26:DB$29)>0,$E34*$G34,0)","v":0},null,{"$f":"IF(SUM(DD$26:DD$29)>0,$E34*$G34,0)","v":0},null,{"$f":"IF(SUM(DF$26:DF$29)>0,$E34*$G34,0)","v":0},null,{"$f":"IF(SUM(DH$26:DH$29)>0,$E34*$G34,0)","v":0},null,{"$f":"IF(SUM(DJ$26:DJ$29)>0,$E34*$G34,0)","v":0},null,{"$f":"IF(SUM(DL$26:DL$29)>0,$E34*$G34,0)","v":0},null,{"$f":"IF(SUM(DN$26:DN$29)>0,$E34*$G34,0)","v":0},null,{"$f":"IF(SUM(DP$26:DP$29)>0,$E34*$G34,0)","v":0},null,{"$f":"IF(SUM(DR$26:DR$29)>0,$E34*$G34,0)","v":0},null,{"$f":"IF(SUM(DT$26:DT$29)>0,$E34*$G34,0)","v":0},null,{"$f":"IF(SUM(DV$26:DV$29)>0,$E34*$G34,0)","v":0},null,0]
[]
[null,null,"CATEGORIAS",null,null,null,"QUANTIDADE"]
[null,null,null,null,null,null,null,null,null,{"$f":"IF($C37=J$4,1,0)","v":0},null,{"$f":"IF($C37=L$4,1,0)","v":0},null,{"$f":"IF($C37=N$4,1,0)","v":0},null,{"$f":"IF($C37=P$4,1,0)","v":0},null,{"$f":"IF($C37=R$4,1,0)","v":0},null,{"$f":"IF($C37=T$4,1,0)","v":0},null,{"$f":"IF($C37=V$4,1,0)","v":0},null,{"$f":"IF($C37=X$4,1,0)","v":0},null,{"$f":"IF($C37=Z$4,1,0)","v":0},null,{"$f":"IF($C37=AB$4,1,0)","v":0},null,{"$f":"IF($C37=AD$4,1,0)","v":0},null,{"$f":"IF($C37=AF$4,1,0)","v":0},null,{"$f":"IF($C37=AH$4,1,0)","v":0},null,{"$f":"IF($C37=AJ$4,1,0)","v":0},null,{"$f":"IF($C37=AL$4,1,0)","v":0},null,{"$f":"IF($C37=AN$4,1,0)","v":0},null,{"$f":"IF($C37=AP$4,1,0)","v":0},null,{"$f":"IF($C37=AR$4,1,0)","v":0},null,{"$f":"IF($C37=AT$4,1,0)","v":0},null,{"$f":"IF($C37=AV$4,1,0)","v":0},null,{"$f":"IF($C37=AX$4,1,0)","v":0},null,{"$f":"IF($C37=AZ$4,1,0)","v":0},null,{"$f":"IF($C37=BB$4,1,0)","v":0},null,{"$f":"IF($C37=BD$4,1,0)","v":0},null,{"$f":"IF($C37=BF$4,1,0)","v":0},null,{"$f":"IF($C37=BH$4,1,0)","v":0},null,{"$f":"IF($C37=BJ$4,1,0)","v":0},null,{"$f":"IF($C37=BL$4,1,0)","v":0},null,{"$f":"IF($C37=BN$4,1,0)","v":0},null,{"$f":"IF($C37=BP$4,1,0)","v":0},null,{"$f":"IF($C37=BR$4,1,0)","v":0},null,{"$f":"IF($C37=BT$4,1,0)","v":0},null,{"$f":"IF($C37=BV$4,1,0)","v":0},null,{"$f":"IF($C37=BX$4,1,0)","v":0},null,{"$f":"IF($C37=BZ$4,1,0)","v":0},null,{"$f":"IF($C37=CB$4,1,0)","v":0},null,{"$f":"IF($C37=CD$4,1,0)","v":0},null,{"$f":"IF($C37=CF$4,1,0)","v":0},null,{"$f":"IF($C37=CH$4,1,0)","v":0},null,{"$f":"IF($C37=CJ$4,1,0)","v":0},null,{"$f":"IF($C37=CL$4,1,0)","v":0},null,{"$f":"IF($C37=CN$4,1,0)","v":0},null,{"$f":"IF($C37=CP$4,1,0)","v":0},null,{"$f":"IF($C37=CR$4,1,0)","v":0},null,{"$f":"IF($C37=CT$4,1,0)","v":0},null,{"$f":"IF($C37=CV$4,1,0)","v":0},null,{"$f":"IF($C37=CX$4,1,0)","v":0},null,{"$f":"IF($C37=CZ$4,1,0)","v":0},null,{"$f":"IF($C37=DB$4,1,0)","v":0},null,{"$f":"IF($C37=DD$4,1,0)","v":0},null,{"$f":"IF($C37=DF$4,1,0)","v":0},null,{"$f":"IF($C37=DH$4,1,0)","v":0},null,{"$f":"IF($C37=DJ$4,1,0)","v":0},null,{"$f":"IF($C37=DL$4,1,0)","v":0},null,{"$f":"IF($C37=DN$4,1,0)","v":0},null,{"$f":"IF($C37=DP$4,1,0)","v":0},null,{"$f":"IF($C37=DR$4,1,0)","v":0},null,{"$f":"IF($C37=DT$4,1,0)","v":0},null,{"$f":"IF($C37=DV$4,1,0)","v":0},null,{"$f":"IF($C37=DX$4,1,0)","v":0}]
[null,null,5,{"$f":"HLOOKUP($C38,'Dados Gerais'!$D$5:$BK$10,6)","v":"AUXILIAR DE ENCARREGADO"},null,null,{"$f":"HLOOKUP($C38,'Dados Gerais'!$D$5:$BK$14,10)","v":1},null,null,{"$f":"IF($C38=J$4,1,0)","v":0},null,0,null,0,null,0,null,1,null,0,null,0,null,0,null,0,null,0,null,0,null,0,null,0,null,0,null,0,null,0,null,0,null,0,null,0,null,0,null,0,null,0,null,0,null,0,null,0,null,0,null,0,null,0,null,0,null,0,null,0,null,0,null,0,null,0,null,0,null,0,null,0,null,0,null,0,null,0,null,0,null,0,null,0,null,0,null,0,null,0,null,0,null,0,null,0,null,0,null,0,null,0,null,0,null,0,null,0,null,0,null,0,null,0,null,0,null,0]
[null,null,null,null,null,null,null,null,null,{"$f":"IF($C39=J$4,1,0)","v":0},null,0,null,0,null,0,null,0,null,0,null,0,null,0,null,0,null,0,null,0,null,0,null,0,null,0,null,0,null,0,null,0,null,0,null,0,null,0,null,0,null,0,null,0,null,0,null,0,null,0,null,0,null,0,null,0,null,0,null,0,null,0,null,0,null,0,null,0,null,0,null,0,null,0,null,0,null,0,null,0,null,0,null,0,null,0,null,0,null,0,null,0,null,0,null,0,null,0,null,0,null,0,null,0,null,0,null,0,null,0,null,0,null,0,null,0,null,0]
[]
[null,null,"ITEM","DESCRIÇÃO","QUANT ANUAL POR POSTO","UNIDADE","VALOR"]
[null,null,null,null,null,null,null,null,null,null,{"$f":"IF(SUM(J$8:J$10)>0,$E42*$G42,0)","v":0},null,{"$f":"IF(SUM(L$8:L$10)>0,$E42*$G42,0)","v":0},null,{"$f":"IF(SUM(N$8:N$10)>0,$E42*$G42,0)","v":0},null,{"$f":"IF(SUM(P$8:P$10)>0,$E42*$G42,0)","v":0},null,{"$f":"IF(SUM(R$8:R$10)>0,$E42*$G42,0)","v":0},null,{"$f":"IF(SUM(T$8:T$10)>0,$E42*$G42,0)","v":0},null,{"$f":"IF(SUM(V$8:V$10)>0,$E42*$G42,0)","v":0},null,{"$f":"IF(SUM(X$8:X$10)>0,$E42*$G42,0)","v":0},null,{"$f":"IF(SUM(Z$8:Z$10)>0,$E42*$G42,0)","v":0},null,{"$f":"IF(SUM(AB$8:AB$10)>0,$E42*$G42,0)","v":0},null,{"$f":"IF(SUM(AD$8:AD$10)>0,$E42*$G42,0)","v":0},null,{"$f":"IF(SUM(AF$8:AF$10)>0,$E42*$G42,0)","v":0},null,{"$f":"IF(SUM(AH$8:AH$10)>0,$E42*$G42,0)","v":0},null,{"$f":"IF(SUM(AJ$8:AJ$10)>0,$E42*$G42,0)","v":0},null,{"$f":"IF(SUM(AL$8:AL$10)>0,$E42*$G42,0)","v":0},null,{"$f":"IF(SUM(AN$8:AN$10)>0,$E42*$G42,0)","v":0},null,{"$f":"IF(SUM(AP$8:AP$10)>0,$E42*$G42,0)","v":0},null,{"$f":"IF(SUM(AR$8:AR$10)>0,$E42*$G42,0)","v":0},null,{"$f":"IF(SUM(AT$8:AT$10)>0,$E42*$G42,0)","v":0},null,{"$f":"IF(SUM(AV$8:AV$10)>0,$E42*$G42,0)","v":0},null,{"$f":"IF(SUM(AX$8:AX$10)>0,$E42*$G42,0)","v":0},null,{"$f":"IF(SUM(AZ$8:AZ$10)>0,$E42*$G42,0)","v":0},null,{"$f":"IF(SUM(BB$8:BB$10)>0,$E42*$G42,0)","v":0},null,{"$f":"IF(SUM(BD$8:BD$10)>0,$E42*$G42,0)","v":0},null,{"$f":"IF(SUM(BF$8:BF$10)>0,$E42*$G42,0)","v":0},null,{"$f":"IF(SUM(BH$8:BH$10)>0,$E42*$G42,0)","v":0},null,{"$f":"IF(SUM(BJ$8:BJ$10)>0,$E42*$G42,0)","v":0},null,{"$f":"IF(SUM(BL$8:BL$10)>0,$E42*$G42,0)","v":0},null,{"$f":"IF(SUM(BN$8:BN$10)>0,$E42*$G42,0)","v":0},null,{"$f":"IF(SUM(BP$8:BP$10)>0,$E42*$G42,0)","v":0},null,{"$f":"IF(SUM(BR$8:BR$10)>0,$E42*$G42,0)","v":0},null,{"$f":"IF(SUM(BT$8:BT$10)>0,$E42*$G42,0)","v":0},null,{"$f":"IF(SUM(BV$8:BV$10)>0,$E42*$G42,0)","v":0},null,{"$f":"IF(SUM(BX$8:BX$10)>0,$E42*$G42,0)","v":0},null,{"$f":"IF(SUM(BZ$8:BZ$10)>0,$E42*$G42,0)","v":0},null,{"$f":"IF(SUM(CB$8:CB$10)>0,$E42*$G42,0)","v":0},null,{"$f":"IF(SUM(CD$8:CD$10)>0,$E42*$G42,0)","v":0},null,{"$f":"IF(SUM(CF$8:CF$10)>0,$E42*$G42,0)","v":0},null,{"$f":"IF(SUM(CH$8:CH$10)>0,$E42*$G42,0)","v":0},null,{"$f":"IF(SUM(CJ$8:CJ$10)>0,$E42*$G42,0)","v":0},null,{"$f":"IF(SUM(CL$8:CL$10)>0,$E42*$G42,0)","v":0},null,{"$f":"IF(SUM(CN$8:CN$10)>0,$E42*$G42,0)","v":0},null,{"$f":"IF(SUM(CP$8:CP$10)>0,$E42*$G42,0)","v":0},null,{"$f":"IF(SUM(CR$8:CR$10)>0,$E42*$G42,0)","v":0},null,{"$f":"IF(SUM(CT$8:CT$10)>0,$E42*$G42,0)","v":0},null,{"$f":"IF(SUM(CV$8:CV$10)>0,$E42*$G42,0)","v":0},null,{"$f":"IF(SUM(CX$8:CX$10)>0,$E42*$G42,0)","v":0},null,{"$f":"IF(SUM(CZ$8:CZ$10)>0,$E42*$G42,0)","v":0},null,{"$f":"IF(SUM(DB$8:DB$10)>0,$E42*$G42,0)","v":0},null,{"$f":"IF(SUM(DD$8:DD$10)>0,$E42*$G42,0)","v":0},null,{"$f":"IF(SUM(DF$8:DF$10)>0,$E42*$G42,0)","v":0},null,{"$f":"IF(SUM(DH$8:DH$10)>0,$E42*$G42,0)","v":0},null,{"$f":"IF(SUM(DJ$8:DJ$10)>0,$E42*$G42,0)","v":0},null,{"$f":"IF(SUM(DL$8:DL$10)>0,$E42*$G42,0)","v":0},null,{"$f":"IF(SUM(DN$8:DN$10)>0,$E42*$G42,0)","v":0},null,{"$f":"IF(SUM(DP$8:DP$10)>0,$E42*$G42,0)","v":0},null,{"$f":"IF(SUM(DR$8:DR$10)>0,$E42*$G42,0)","v":0},null,{"$f":"IF(SUM(DT$8:DT$10)>0,$E42*$G42,0)","v":0},null,{"$f":"IF(SUM(DV$8:DV$10)>0,$E42*$G42,0)","v":0},null,{"$f":"IF(SUM(DX$8:DX$10)>0,$E42*$G42,0)","v":0}]
[null,null,1,"Calçado de segurança tipo sapato com resistência a objetos pontiagudos, fechamento em elástico, couro preto, forração em tecido, bico de composite, palmilha de montagem têxtil resistente à perfuração, solado de PU (poliuretano), bidensidade sem cadarço. Ref. MARLUVAS.",2,"PAR",{"$f":"G33","v":117.26},null,null,null,{"$f":"IF(SUM(J$37:J$39)>0,$E43*$G43,0)","v":0},null,{"$f":"IF(SUM(L$37:L$39)>0,$E43*$G43,0)","v":0},null,{"$f":"IF(SUM(N$37:N$39)>0,$E43*$G43,0)","v":0},null,{"$f":"IF(SUM(P$37:P$39)>0,$E43*$G43,0)","v":0},null,{"$f":"IF(SUM(R$37:R$39)>0,$E43*$G43,0)","v":234.52},null,{"$f":"IF(SUM(T$37:T$39)>0,$E43*$G43,0)","v":0},null,{"$f":"IF(SUM(V$37:V$39)>0,$E43*$G43,0)","v":0},null,{"$f":"IF(SUM(X$37:X$39)>0,$E43*$G43,0)","v":0},null,{"$f":"IF(SUM(Z$37:Z$39)>0,$E43*$G43,0)","v":0},null,{"$f":"IF(SUM(AB$37:AB$39)>0,$E43*$G43,0)","v":0},null,{"$f":"IF(SUM(AD$37:AD$39)>0,$E43*$G43,0)","v":0},null,{"$f":"IF(SUM(AF$37:AF$39)>0,$E43*$G43,0)","v":0},null,{"$f":"IF(SUM(AH$37:AH$39)>0,$E43*$G43,0)","v":0},null,{"$f":"IF(SUM(AJ$37:AJ$39)>0,$E43*$G43,0)","v":0},null,{"$f":"IF(SUM(AL$37:AL$39)>0,$E43*$G43,0)","v":0},null,{"$f":"IF(SUM(AN$37:AN$39)>0,$E43*$G43,0)","v":0},null,{"$f":"IF(SUM(AP$37:AP$39)>0,$E43*$G43,0)","v":0},null,{"$f":"IF(SUM(AR$37:AR$39)>0,$E43*$G43,0)","v":0},null,{"$f":"IF(SUM(AT$37:AT$39)>0,$E43*$G43,0)","v":0},null,{"$f":"IF(SUM(AV$37:AV$39)>0,$E43*$G43,0)","v":0},null,{"$f":"IF(SUM(AX$37:AX$39)>0,$E43*$G43,0)","v":0},null,{"$f":"IF(SUM(AZ$37:AZ$39)>0,$E43*$G43,0)","v":0},null,{"$f":"IF(SUM(BB$37:BB$39)>0,$E43*$G43,0)","v":0},null,{"$f":"IF(SUM(BD$37:BD$39)>0,$E43*$G43,0)","v":0},null,{"$f":"IF(SUM(BF$37:BF$39)>0,$E43*$G43,0)","v":0},null,{"$f":"IF(SUM(BH$37:BH$39)>0,$E43*$G43,0)","v":0},null,{"$f":"IF(SUM(BJ$37:BJ$39)>0,$E43*$G43,0)","v":0},null,{"$f":"IF(SUM(BL$37:BL$39)>0,$E43*$G43,0)","v":0},null,{"$f":"IF(SUM(BN$37:BN$39)>0,$E43*$G43,0)","v":0},null,{"$f":"IF(SUM(BP$37:BP$39)>0,$E43*$G43,0)","v":0},null,{"$f":"IF(SUM(BR$37:BR$39)>0,$E43*$G43,0)","v":0},null,{"$f":"IF(SUM(BT$37:BT$39)>0,$E43*$G43,0)","v":0},null,{"$f":"IF(SUM(BV$37:BV$39)>0,$E43*$G43,0)","v":0},null,{"$f":"IF(SUM(BX$37:BX$39)>0,$E43*$G43,0)","v":0},null,{"$f":"IF(SUM(BZ$37:BZ$39)>0,$E43*$G43,0)","v":0},null,{"$f":"IF(SUM(CB$37:CB$39)>0,$E43*$G43,0)","v":0},null,{"$f":"IF(SUM(CD$37:CD$39)>0,$E43*$G43,0)","v":0},null,{"$f":"IF(SUM(CF$37:CF$39)>0,$E43*$G43,0)","v":0},null,{"$f":"IF(SUM(CH$37:CH$39)>0,$E43*$G43,0)","v":0},null,{"$f":"IF(SUM(CJ$37:CJ$39)>0,$E43*$G43,0)","v":0},null,{"$f":"IF(SUM(CL$37:CL$39)>0,$E43*$G43,0)","v":0},null,{"$f":"IF(SUM(CN$37:CN$39)>0,$E43*$G43,0)","v":0},null,{"$f":"IF(SUM(CP$37:CP$39)>0,$E43*$G43,0)","v":0},null,{"$f":"IF(SUM(CR$37:CR$39)>0,$E43*$G43,0)","v":0},null,{"$f":"IF(SUM(CT$37:CT$39)>0,$E43*$G43,0)","v":0},null,{"$f":"IF(SUM(CV$37:CV$39)>0,$E43*$G43,0)","v":0},null,{"$f":"IF(SUM(CX$37:CX$39)>0,$E43*$G43,0)","v":0},null,{"$f":"IF(SUM(CZ$37:CZ$39)>0,$E43*$G43,0)","v":0},null,{"$f":"IF(SUM(DB$37:DB$39)>0,$E43*$G43,0)","v":0},null,{"$f":"IF(SUM(DD$37:DD$39)>0,$E43*$G43,0)","v":0},null,{"$f":"IF(SUM(DF$37:DF$39)>0,$E43*$G43,0)","v":0},null,{"$f":"IF(SUM(DH$37:DH$39)>0,$E43*$G43,0)","v":0},null,{"$f":"IF(SUM(DJ$37:DJ$39)>0,$E43*$G43,0)","v":0},null,{"$f":"IF(SUM(DL$37:DL$39)>0,$E43*$G43,0)","v":0},null,{"$f":"IF(SUM(DN$37:DN$39)>0,$E43*$G43,0)","v":0},null,{"$f":"IF(SUM(DP$37:DP$39)>0,$E43*$G43,0)","v":0},null,{"$f":"IF(SUM(DR$37:DR$39)>0,$E43*$G43,0)","v":0},null,{"$f":"IF(SUM(DT$37:DT$39)>0,$E43*$G43,0)","v":0},null,{"$f":"IF(SUM(DV$37:DV$39)>0,$E43*$G43,0)","v":0},null,{"$f":"IF(SUM(DX$37:DX$39)>0,$E43*$G43,0)","v":0}]
[null,null,2,"Respirador purificador de ar tipo, peça semifacial filtrante para partículas (PFF2), com formato dobrável, solda ultra-sônica em todo o seu perímetro. Fita elástica branca fixada nas laterais externas do respirador, perfazendo uma alça na para fixação na parte superior da cabeça e a outra na parte inferior, para fixação na altura da nuca do usuário. A parte superior externa da peça possui tira de material metálico moldável, utilizada para ajuste no septo nasal. Com válvula de exalação. DEVERÁ APRESENTAR O SELO DE APROVAÇÃO DO INMETRO. Ref. 3M ",2,"UND",{"$f":"G34","v":2.74},null,null,null,{"$f":"IF(SUM(J$37:J$39)>0,$E44*$G44,0)","v":0},null,{"$f":"IF(SUM(L$37:L$39)>0,$E44*$G44,0)","v":0},null,{"$f":"IF(SUM(N$37:N$39)>0,$E44*$G44,0)","v":0},null,{"$f":"IF(SUM(P$37:P$39)>0,$E44*$G44,0)","v":0},null,{"$f":"IF(SUM(R$37:R$39)>0,$E44*$G44,0)","v":5.48},null,{"$f":"IF(SUM(T$37:T$39)>0,$E44*$G44,0)","v":0},null,{"$f":"IF(SUM(V$37:V$39)>0,$E44*$G44,0)","v":0},null,{"$f":"IF(SUM(X$37:X$39)>0,$E44*$G44,0)","v":0},null,{"$f":"IF(SUM(Z$37:Z$39)>0,$E44*$G44,0)","v":0},null,{"$f":"IF(SUM(AB$37:AB$39)>0,$E44*$G44,0)","v":0},null,{"$f":"IF(SUM(AD$37:AD$39)>0,$E44*$G44,0)","v":0},null,{"$f":"IF(SUM(AF$37:AF$39)>0,$E44*$G44,0)","v":0},null,{"$f":"IF(SUM(AH$37:AH$39)>0,$E44*$G44,0)","v":0},null,{"$f":"IF(SUM(AJ$37:AJ$39)>0,$E44*$G44,0)","v":0},null,{"$f":"IF(SUM(AL$37:AL$39)>0,$E44*$G44,0)","v":0},null,{"$f":"IF(SUM(AN$37:AN$39)>0,$E44*$G44,0)","v":0},null,{"$f":"IF(SUM(AP$37:AP$39)>0,$E44*$G44,0)","v":0},null,{"$f":"IF(SUM(AR$37:AR$39)>0,$E44*$G44,0)","v":0},null,{"$f":"IF(SUM(AT$37:AT$39)>0,$E44*$G44,0)","v":0},null,{"$f":"IF(SUM(AV$37:AV$39)>0,$E44*$G44,0)","v":0},null,{"$f":"IF(SUM(AX$37:AX$39)>0,$E44*$G44,0)","v":0},null,{"$f":"IF(SUM(AZ$37:AZ$39)>0,$E44*$G44,0)","v":0},null,{"$f":"IF(SUM(BB$37:BB$39)>0,$E44*$G44,0)","v":0},null,{"$f":"IF(SUM(BD$37:BD$39)>0,$E44*$G44,0)","v":0},null,{"$f":"IF(SUM(BF$37:BF$39)>0,$E44*$G44,0)","v":0},null,{"$f":"IF(SUM(BH$37:BH$39)>0,$E44*$G44,0)","v":0},null,{"$f":"IF(SUM(BJ$37:BJ$39)>0,$E44*$G44,0)","v":0},null,{"$f":"IF(SUM(BL$37:BL$39)>0,$E44*$G44,0)","v":0},null,{"$f":"IF(SUM(BN$37:BN$39)>0,$E44*$G44,0)","v":0},null,{"$f":"IF(SUM(BP$37:BP$39)>0,$E44*$G44,0)","v":0},null,{"$f":"IF(SUM(BR$37:BR$39)>0,$E44*$G44,0)","v":0},null,{"$f":"IF(SUM(BT$37:BT$39)>0,$E44*$G44,0)","v":0},null,{"$f":"IF(SUM(BV$37:BV$39)>0,$E44*$G44,0)","v":0},null,{"$f":"IF(SUM(BX$37:BX$39)>0,$E44*$G44,0)","v":0},null,{"$f":"IF(SUM(BZ$37:BZ$39)>0,$E44*$G44,0)","v":0},null,{"$f":"IF(SUM(CB$37:CB$39)>0,$E44*$G44,0)","v":0},null,{"$f":"IF(SUM(CD$37:CD$39)>0,$E44*$G44,0)","v":0},null,{"$f":"IF(SUM(CF$37:CF$39)>0,$E44*$G44,0)","v":0},null,{"$f":"IF(SUM(CH$37:CH$39)>0,$E44*$G44,0)","v":0},null,{"$f":"IF(SUM(CJ$37:CJ$39)>0,$E44*$G44,0)","v":0},null,{"$f":"IF(SUM(CL$37:CL$39)>0,$E44*$G44,0)","v":0},null,{"$f":"IF(SUM(CN$37:CN$39)>0,$E44*$G44,0)","v":0},null,{"$f":"IF(SUM(CP$37:CP$39)>0,$E44*$G44,0)","v":0},null,{"$f":"IF(SUM(CR$37:CR$39)>0,$E44*$G44,0)","v":0},null,{"$f":"IF(SUM(CT$37:CT$39)>0,$E44*$G44,0)","v":0},null,{"$f":"IF(SUM(CV$37:CV$39)>0,$E44*$G44,0)","v":0},null,{"$f":"IF(SUM(CX$37:CX$39)>0,$E44*$G44,0)","v":0},null,{"$f":"IF(SUM(CZ$37:CZ$39)>0,$E44*$G44,0)","v":0},null,{"$f":"IF(SUM(DB$37:DB$39)>0,$E44*$G44,0)","v":0},null,{"$f":"IF(SUM(DD$37:DD$39)>0,$E44*$G44,0)","v":0},null,{"$f":"IF(SUM(DF$37:DF$39)>0,$E44*$G44,0)","v":0},null,{"$f":"IF(SUM(DH$37:DH$39)>0,$E44*$G44,0)","v":0},null,{"$f":"IF(SUM(DJ$37:DJ$39)>0,$E44*$G44,0)","v":0},null,{"$f":"IF(SUM(DL$37:DL$39)>0,$E44*$G44,0)","v":0},null,{"$f":"IF(SUM(DN$37:DN$39)>0,$E44*$G44,0)","v":0},null,{"$f":"IF(SUM(DP$37:DP$39)>0,$E44*$G44,0)","v":0},null,{"$f":"IF(SUM(DR$37:DR$39)>0,$E44*$G44,0)","v":0},null,{"$f":"IF(SUM(DT$37:DT$39)>0,$E44*$G44,0)","v":0},null,{"$f":"IF(SUM(DV$37:DV$39)>0,$E44*$G44,0)","v":0},null,0]
[]
[null,null,"CATEGORIAS",null,null,null,"QUANTIDADE"]
[null,null,null,null,null,null,null,null,null,{"$f":"IF($C47=J$4,1,0)","v":0},null,{"$f":"IF($C47=L$4,1,0)","v":0},null,{"$f":"IF($C47=N$4,1,0)","v":0},null,{"$f":"IF($C47=P$4,1,0)","v":0},null,{"$f":"IF($C47=R$4,1,0)","v":0},null,{"$f":"IF($C47=T$4,1,0)","v":0},null,{"$f":"IF($C47=V$4,1,0)","v":0},null,{"$f":"IF($C47=X$4,1,0)","v":0},null,{"$f":"IF($C47=Z$4,1,0)","v":0},null,{"$f":"IF($C47=AB$4,1,0)","v":0},null,{"$f":"IF($C47=AD$4,1,0)","v":0},null,{"$f":"IF($C47=AF$4,1,0)","v":0},null,{"$f":"IF($C47=AH$4,1,0)","v":0},null,{"$f":"IF($C47=AJ$4,1,0)","v":0},null,{"$f":"IF($C47=AL$4,1,0)","v":0},null,{"$f":"IF($C47=AN$4,1,0)","v":0},null,{"$f":"IF($C47=AP$4,1,0)","v":0},null,{"$f":"IF($C47=AR$4,1,0)","v":0},null,{"$f":"IF($C47=AT$4,1,0)","v":0},null,{"$f":"IF($C47=AV$4,1,0)","v":0},null,{"$f":"IF($C47=AX$4,1,0)","v":0},null,{"$f":"IF($C47=AZ$4,1,0)","v":0},null,{"$f":"IF($C47=BB$4,1,0)","v":0},null,{"$f":"IF($C47=BD$4,1,0)","v":0},null,{"$f":"IF($C47=BF$4,1,0)","v":0},null,{"$f":"IF($C47=BH$4,1,0)","v":0},null,{"$f":"IF($C47=BJ$4,1,0)","v":0},null,{"$f":"IF($C47=BL$4,1,0)","v":0},null,{"$f":"IF($C47=BN$4,1,0)","v":0},null,{"$f":"IF($C47=BP$4,1,0)","v":0},null,{"$f":"IF($C47=BR$4,1,0)","v":0},null,{"$f":"IF($C47=BT$4,1,0)","v":0},null,{"$f":"IF($C47=BV$4,1,0)","v":0},null,{"$f":"IF($C47=BX$4,1,0)","v":0},null,{"$f":"IF($C47=BZ$4,1,0)","v":0},null,{"$f":"IF($C47=CB$4,1,0)","v":0},null,{"$f":"IF($C47=CD$4,1,0)","v":0},null,{"$f":"IF($C47=CF$4,1,0)","v":0},null,{"$f":"IF($C47=CH$4,1,0)","v":0},null,{"$f":"IF($C47=CJ$4,1,0)","v":0},null,{"$f":"IF($C47=CL$4,1,0)","v":0},null,{"$f":"IF($C47=CN$4,1,0)","v":0},null,{"$f":"IF($C47=CP$4,1,0)","v":0},null,{"$f":"IF($C47=CR$4,1,0)","v":0},null,{"$f":"IF($C47=CT$4,1,0)","v":0},null,{"$f":"IF($C47=CV$4,1,0)","v":0},null,{"$f":"IF($C47=CX$4,1,0)","v":0},null,{"$f":"IF($C47=CZ$4,1,0)","v":0},null,{"$f":"IF($C47=DB$4,1,0)","v":0},null,{"$f":"IF($C47=DD$4,1,0)","v":0},null,{"$f":"IF($C47=DF$4,1,0)","v":0},null,{"$f":"IF($C47=DH$4,1,0)","v":0},null,{"$f":"IF($C47=DJ$4,1,0)","v":0},null,{"$f":"IF($C47=DL$4,1,0)","v":0},null,{"$f":"IF($C47=DN$4,1,0)","v":0},null,{"$f":"IF($C47=DP$4,1,0)","v":0},null,{"$f":"IF($C47=DR$4,1,0)","v":0},null,{"$f":"IF($C47=DT$4,1,0)","v":0},null,{"$f":"IF($C47=DV$4,1,0)","v":0},null,{"$f":"IF($C47=DX$4,1,0)","v":0}]
[null,null,6,{"$f":"HLOOKUP($C48,'Dados Gerais'!$D$5:$BK$10,6)","v":"ALMOXARIFE"},null,null,{"$f":"HLOOKUP($C48,'Dados Gerais'!$D$5:$BK$14,10)","v":2},null,null,{"$f":"IF($C48=J$4,1,0)","v":0},null,0,null,0,null,0,null,0,null,1,null,0,null,0,null,0,null,0,null,0,null,0,null,0,null,0,null,0,null,0,null,0,null,0,null,0,null,0,null,0,null,0,null,0,null,0,null,0,null,0,null,0,null,0,null,0,null,0,null,0,null,0,null,0,null,0,null,0,null,0,null,0,null,0,null,0,null,0,null,0,null,0,null,0,null,0,null,0,null,0,null,0,null,0,null,0,null,0,null,0,null,0,null,0,null,0,null,0,null,0,null,0,null,0,null,0,null,0]
[null,null,null,null,null,null,null,null,null,{"$f":"IF($C49=J$4,1,0)","v":0},null,0,null,0,null,0,null,0,null,0,null,0,null,0,null,0,null,0,null,0,null,0,null,0,null,0,null,0,null,0,null,0,null,0,null,0,null,0,null,0,null,0,null,0,null,0,null,0,null,0,null,0,null,0,null,0,null,0,null,0,null,0,null,0,null,0,null,0,null,0,null,0,null,0,null,0,null,0,null,0,null,0,null,0,null,0,null,0,null,0,null,0,null,0,null,0,null,0,null,0,null,0,null,0,null,0,null,0,null,0,null,0,null,0,null,0,null,0]
[]
[null,null,"ITEM","DESCRIÇÃO","QUANT ANUAL POR POSTO","UNIDADE","VALOR"]
[null,null,null,null,null,null,null,null,null,null,{"$f":"IF(SUM(J$8:J$10)>0,$E52*$G52,0)","v":0},null,{"$f":"IF(SUM(L$8:L$10)>0,$E52*$G52,0)","v":0},null,{"$f":"IF(SUM(N$8:N$10)>0,$E52*$G52,0)","v":0},null,{"$f":"IF(SUM(P$8:P$10)>0,$E52*$G52,0)","v":0},null,{"$f":"IF(SUM(R$8:R$10)>0,$E52*$G52,0)","v":0},null,{"$f":"IF(SUM(T$8:T$10)>0,$E52*$G52,0)","v":0},null,{"$f":"IF(SUM(V$8:V$10)>0,$E52*$G52,0)","v":0},null,{"$f":"IF(SUM(X$8:X$10)>0,$E52*$G52,0)","v":0},null,{"$f":"IF(SUM(Z$8:Z$10)>0,$E52*$G52,0)","v":0},null,{"$f":"IF(SUM(AB$8:AB$10)>0,$E52*$G52,0)","v":0},null,{"$f":"IF(SUM(AD$8:AD$10)>0,$E52*$G52,0)","v":0},null,{"$f":"IF(SUM(AF$8:AF$10)>0,$E52*$G52,0)","v":0},null,{"$f":"IF(SUM(AH$8:AH$10)>0,$E52*$G52,0)","v":0},null,{"$f":"IF(SUM(AJ$8:AJ$10)>0,$E52*$G52,0)","v":0},null,{"$f":"IF(SUM(AL$8:AL$10)>0,$E52*$G52,0)","v":0},null,{"$f":"IF(SUM(AN$8:AN$10)>0,$E52*$G52,0)","v":0},null,{"$f":"IF(SUM(AP$8:AP$10)>0,$E52*$G52,0)","v":0},null,{"$f":"IF(SUM(AR$8:AR$10)>0,$E52*$G52,0)","v":0},null,{"$f":"IF(SUM(AT$8:AT$10)>0,$E52*$G52,0)","v":0},null,{"$f":"IF(SUM(AV$8:AV$10)>0,$E52*$G52,0)","v":0},null,{"$f":"IF(SUM(AX$8:AX$10)>0,$E52*$G52,0)","v":0},null,{"$f":"IF(SUM(AZ$8:AZ$10)>0,$E52*$G52,0)","v":0},null,{"$f":"IF(SUM(BB$8:BB$10)>0,$E52*$G52,0)","v":0},null,{"$f":"IF(SUM(BD$8:BD$10)>0,$E52*$G52,0)","v":0},null,{"$f":"IF(SUM(BF$8:BF$10)>0,$E52*$G52,0)","v":0},null,{"$f":"IF(SUM(BH$8:BH$10)>0,$E52*$G52,0)","v":0},null,{"$f":"IF(SUM(BJ$8:BJ$10)>0,$E52*$G52,0)","v":0},null,{"$f":"IF(SUM(BL$8:BL$10)>0,$E52*$G52,0)","v":0},null,{"$f":"IF(SUM(BN$8:BN$10)>0,$E52*$G52,0)","v":0},null,{"$f":"IF(SUM(BP$8:BP$10)>0,$E52*$G52,0)","v":0},null,{"$f":"IF(SUM(BR$8:BR$10)>0,$E52*$G52,0)","v":0},null,{"$f":"IF(SUM(BT$8:BT$10)>0,$E52*$G52,0)","v":0},null,{"$f":"IF(SUM(BV$8:BV$10)>0,$E52*$G52,0)","v":0},null,{"$f":"IF(SUM(BX$8:BX$10)>0,$E52*$G52,0)","v":0},null,{"$f":"IF(SUM(BZ$8:BZ$10)>0,$E52*$G52,0)","v":0},null,{"$f":"IF(SUM(CB$8:CB$10)>0,$E52*$G52,0)","v":0},null,{"$f":"IF(SUM(CD$8:CD$10)>0,$E52*$G52,0)","v":0},null,{"$f":"IF(SUM(CF$8:CF$10)>0,$E52*$G52,0)","v":0},null,{"$f":"IF(SUM(CH$8:CH$10)>0,$E52*$G52,0)","v":0},null,{"$f":"IF(SUM(CJ$8:CJ$10)>0,$E52*$G52,0)","v":0},null,{"$f":"IF(SUM(CL$8:CL$10)>0,$E52*$G52,0)","v":0},null,{"$f":"IF(SUM(CN$8:CN$10)>0,$E52*$G52,0)","v":0},null,{"$f":"IF(SUM(CP$8:CP$10)>0,$E52*$G52,0)","v":0},null,{"$f":"IF(SUM(CR$8:CR$10)>0,$E52*$G52,0)","v":0},null,{"$f":"IF(SUM(CT$8:CT$10)>0,$E52*$G52,0)","v":0},null,{"$f":"IF(SUM(CV$8:CV$10)>0,$E52*$G52,0)","v":0},null,{"$f":"IF(SUM(CX$8:CX$10)>0,$E52*$G52,0)","v":0},null,{"$f":"IF(SUM(CZ$8:CZ$10)>0,$E52*$G52,0)","v":0},null,{"$f":"IF(SUM(DB$8:DB$10)>0,$E52*$G52,0)","v":0},null,{"$f":"IF(SUM(DD$8:DD$10)>0,$E52*$G52,0)","v":0},null,{"$f":"IF(SUM(DF$8:DF$10)>0,$E52*$G52,0)","v":0},null,{"$f":"IF(SUM(DH$8:DH$10)>0,$E52*$G52,0)","v":0},null,{"$f":"IF(SUM(DJ$8:DJ$10)>0,$E52*$G52,0)","v":0},null,{"$f":"IF(SUM(DL$8:DL$10)>0,$E52*$G52,0)","v":0},null,{"$f":"IF(SUM(DN$8:DN$10)>0,$E52*$G52,0)","v":0},null,{"$f":"IF(SUM(DP$8:DP$10)>0,$E52*$G52,0)","v":0},null,{"$f":"IF(SUM(DR$8:DR$10)>0,$E52*$G52,0)","v":0},null,{"$f":"IF(SUM(DT$8:DT$10)>0,$E52*$G52,0)","v":0},null,{"$f":"IF(SUM(DV$8:DV$10)>0,$E52*$G52,0)","v":0},null,{"$f":"IF(SUM(DX$8:DX$10)>0,$E52*$G52,0)","v":0}]
[null,null,1,"Calçado de segurança tipo sapato com resistência a objetos pontiagudos, fechamento em elástico, couro preto, forração em tecido, bico de composite, palmilha de montagem têxtil resistente à perfuração, solado de PU (poliuretano), bidensidade sem cadarço. Ref. MARLUVAS.",2,"PAR",{"$f":"G43","v":117.26},null,null,null,{"$f":"IF(SUM(J$47:J$49)>0,$E53*$G53,0)","v":0},null,{"$f":"IF(SUM(L$47:L$49)>0,$E53*$G53,0)","v":0},null,{"$f":"IF(SUM(N$47:N$49)>0,$E53*$G53,0)","v":0},null,{"$f":"IF(SUM(P$47:P$49)>0,$E53*$G53,0)","v":0},null,{"$f":"IF(SUM(R$47:R$49)>0,$E53*$G53,0)","v":0},null,{"$f":"IF(SUM(T$47:T$49)>0,$E53*$G53,0)","v":234.52},null,{"$f":"IF(SUM(V$47:V$49)>0,$E53*$G53,0)","v":0},null,{"$f":"IF(SUM(X$47:X$49)>0,$E53*$G53,0)","v":0},null,{"$f":"IF(SUM(Z$47:Z$49)>0,$E53*$G53,0)","v":0},null,{"$f":"IF(SUM(AB$47:AB$49)>0,$E53*$G53,0)","v":0},null,{"$f":"IF(SUM(AD$47:AD$49)>0,$E53*$G53,0)","v":0},null,{"$f":"IF(SUM(AF$47:AF$49)>0,$E53*$G53,0)","v":0},null,{"$f":"IF(SUM(AH$47:AH$49)>0,$E53*$G53,0)","v":0},null,{"$f":"IF(SUM(AJ$47:AJ$49)>0,$E53*$G53,0)","v":0},null,{"$f":"IF(SUM(AL$47:AL$49)>0,$E53*$G53,0)","v":0},null,{"$f":"IF(SUM(AN$47:AN$49)>0,$E53*$G53,0)","v":0},null,{"$f":"IF(SUM(AP$47:AP$49)>0,$E53*$G53,0)","v":0},null,{"$f":"IF(SUM(AR$47:AR$49)>0,$E53*$G53,0)","v":0},null,{"$f":"IF(SUM(AT$47:AT$49)>0,$E53*$G53,0)","v":0},null,{"$f":"IF(SUM(AV$47:AV$49)>0,$E53*$G53,0)","v":0},null,{"$f":"IF(SUM(AX$47:AX$49)>0,$E53*$G53,0)","v":0},null,{"$f":"IF(SUM(AZ$47:AZ$49)>0,$E53*$G53,0)","v":0},null,{"$f":"IF(SUM(BB$47:BB$49)>0,$E53*$G53,0)","v":0},null,{"$f":"IF(SUM(BD$47:BD$49)>0,$E53*$G53,0)","v":0},null,{"$f":"IF(SUM(BF$47:BF$49)>0,$E53*$G53,0)","v":0},null,{"$f":"IF(SUM(BH$47:BH$49)>0,$E53*$G53,0)","v":0},null,{"$f":"IF(SUM(BJ$47:BJ$49)>0,$E53*$G53,0)","v":0},null,{"$f":"IF(SUM(BL$47:BL$49)>0,$E53*$G53,0)","v":0},null,{"$f":"IF(SUM(BN$47:BN$49)>0,$E53*$G53,0)","v":0},null,{"$f":"IF(SUM(BP$47:BP$49)>0,$E53*$G53,0)","v":0},null,{"$f":"IF(SUM(BR$47:BR$49)>0,$E53*$G53,0)","v":0},null,{"$f":"IF(SUM(BT$47:BT$49)>0,$E53*$G53,0)","v":0},null,{"$f":"IF(SUM(BV$47:BV$49)>0,$E53*$G53,0)","v":0},null,{"$f":"IF(SUM(BX$47:BX$49)>0,$E53*$G53,0)","v":0},null,{"$f":"IF(SUM(BZ$47:BZ$49)>0,$E53*$G53,0)","v":0},null,{"$f":"IF(SUM(CB$47:CB$49)>0,$E53*$G53,0)","v":0},null,{"$f":"IF(SUM(CD$47:CD$49)>0,$E53*$G53,0)","v":0},null,{"$f":"IF(SUM(CF$47:CF$49)>0,$E53*$G53,0)","v":0},null,{"$f":"IF(SUM(CH$47:CH$49)>0,$E53*$G53,0)","v":0},null,{"$f":"IF(SUM(CJ$47:CJ$49)>0,$E53*$G53,0)","v":0},null,{"$f":"IF(SUM(CL$47:CL$49)>0,$E53*$G53,0)","v":0},null,{"$f":"IF(SUM(CN$47:CN$49)>0,$E53*$G53,0)","v":0},null,{"$f":"IF(SUM(CP$47:CP$49)>0,$E53*$G53,0)","v":0},null,{"$f":"IF(SUM(CR$47:CR$49)>0,$E53*$G53,0)","v":0},null,{"$f":"IF(SUM(CT$47:CT$49)>0,$E53*$G53,0)","v":0},null,{"$f":"IF(SUM(CV$47:CV$49)>0,$E53*$G53,0)","v":0},null,{"$f":"IF(SUM(CX$47:CX$49)>0,$E53*$G53,0)","v":0},null,{"$f":"IF(SUM(CZ$47:CZ$49)>0,$E53*$G53,0)","v":0},null,{"$f":"IF(SUM(DB$47:DB$49)>0,$E53*$G53,0)","v":0},null,{"$f":"IF(SUM(DD$47:DD$49)>0,$E53*$G53,0)","v":0},null,{"$f":"IF(SUM(DF$47:DF$49)>0,$E53*$G53,0)","v":0},null,{"$f":"IF(SUM(DH$47:DH$49)>0,$E53*$G53,0)","v":0},null,{"$f":"IF(SUM(DJ$47:DJ$49)>0,$E53*$G53,0)","v":0},null,{"$f":"IF(SUM(DL$47:DL$49)>0,$E53*$G53,0)","v":0},null,{"$f":"IF(SUM(DN$47:DN$49)>0,$E53*$G53,0)","v":0},null,{"$f":"IF(SUM(DP$47:DP$49)>0,$E53*$G53,0)","v":0},null,{"$f":"IF(SUM(DR$47:DR$49)>0,$E53*$G53,0)","v":0},null,{"$f":"IF(SUM(DT$47:DT$49)>0,$E53*$G53,0)","v":0},null,{"$f":"IF(SUM(DV$47:DV$49)>0,$E53*$G53,0)","v":0},null,{"$f":"IF(SUM(DX$47:DX$49)>0,$E53*$G53,0)","v":0}]
[null,null,2,"Respirador purificador de ar tipo, peça semifacial filtrante para partículas (PFF2), com formato dobrável, solda ultra-sônica em todo o seu perímetro. Fita elástica branca fixada nas laterais externas do respirador, perfazendo uma alça na para fixação na parte superior da cabeça e a outra na parte inferior, para fixação na altura da nuca do usuário. A parte superior externa da peça possui tira de material metálico moldável, utilizada para ajuste no septo nasal. Com válvula de exalação. DEVERÁ APRESENTAR O SELO DE APROVAÇÃO DO INMETRO. Ref. 3M ",2,"UND",{"$f":"G44","v":2.74},null,null,null,{"$f":"IF(SUM(J$47:J$49)>0,$E54*$G54,0)","v":0},null,0,null,0,null,0,null,0,null,5.48,null,0,null,0,null,0,null,0,null,0,null,0,null,0,null,0,null,0,null,0,null,0,null,0,null,0,null,0,null,0,null,0,null,0,null,0,null,0,null,0,null,0,null,0,null,0,null,0,null,0,null,0,null,0,null,0,null,0,null,0,null,0,null,0,null,0,null,0,null,0,null,0,null,0,null,0,null,0,null,0,null,0,null,0,null,0,null,0,null,0,null,0,null,0,null,0,null,0,null,0,null,0,null,0,null,0,null,0]
[null,null,3,"Luva de Segurança confeccionada em LÁTEX natural anatômica (esp. mínima 0,60mm), acabamento forrado em algodão flocado, antiderrapante na palma e dedos. Ref.: Mucambo",6,"PAR",10.15,null,null,null,0,null,{"$f":"IF(SUM(L$47:L$49)>0,$E55*$G55,0)","v":0},null,0,null,0,null,0,null,60.900000000000006,null,0,null,0,null,0,null,0,null,0,null,0,null,0,null,0,null,0,null,0,null,0,null,0,null,0,null,0,null,0,null,0,null,0,null,0,null,0,null,0,null,0,null,0,null,0,null,0,null,0,null,0,null,0,null,0,null,0,null,0,null,0,null,0,null,0,null,0,null,0,null,0,null,0,null,0,null,0,null,0,null,0,null,0,null,0,null,0,null,0,null,0,null,0,null,0,null,0,null,0,null,0,null,0,null,0,null,0]
[null,null,4,"Óculos de segurança constituídos de armação e visor confeccionados em uma única peça de policarbonato INCOLOR, anti-risco, apoio nasal de plástico maleável. Hastes emborrachadas. Ref.: 3M Virtua V4",6,"UND",10.59,null,null,null,0,null,0,null,0,null,0,null,0,null,63.54,null,0,null,0,null,0,null,0,null,0,null,0,null,0,null,0,null,0,null,0,null,0,null,0,null,0,null,0,null,0,null,0,null,0,null,0,null,0,null,0,null,0,null,0,null,0,null,0,null,0,null,0,null,0,null,0,null,0,null,0,null,0,null,0,null,0,null,0,null,0,null,0,null,0,null,0,null,0,null,0,null,0,null,0,null,0,null,0,null,0,null,0,null,0,null,0,null,0,null,0,null,0,null,0,null,0,null,0]
[]
[]
[null,null,"CATEGORIAS",null,null,null,"QUANTIDADE"]
[null,null,null,null,null,null,null,null,null,{"$f":"IF($C60=J$4,1,0)","v":0},null,{"$f":"IF($C60=L$4,1,0)","v":0},null,{"$f":"IF($C60=N$4,1,0)","v":0},null,{"$f":"IF($C60=P$4,1,0)","v":0},null,{"$f":"IF($C60=R$4,1,0)","v":0},null,{"$f":"IF($C60=T$4,1,0)","v":0},null,{"$f":"IF($C60=V$4,1,0)","v":0},null,{"$f":"IF($C60=X$4,1,0)","v":0},null,{"$f":"IF($C60=Z$4,1,0)","v":0},null,{"$f":"IF($C60=AB$4,1,0)","v":0},null,{"$f":"IF($C60=AD$4,1,0)","v":0},null,{"$f":"IF($C60=AF$4,1,0)","v":0},null,{"$f":"IF($C60=AH$4,1,0)","v":0},null,{"$f":"IF($C60=AJ$4,1,0)","v":0},null,{"$f":"IF($C60=AL$4,1,0)","v":0},null,{"$f":"IF($C60=AN$4,1,0)","v":0},null,{"$f":"IF($C60=AP$4,1,0)","v":0},null,{"$f":"IF($C60=AR$4,1,0)","v":0},null,{"$f":"IF($C60=AT$4,1,0)","v":0},null,{"$f":"IF($C60=AV$4,1,0)","v":0},null,{"$f":"IF($C60=AX$4,1,0)","v":0},null,{"$f":"IF($C60=AZ$4,1,0)","v":0},null,{"$f":"IF($C60=BB$4,1,0)","v":0},null,{"$f":"IF($C60=BD$4,1,0)","v":0},null,{"$f":"IF($C60=BF$4,1,0)","v":0},null,{"$f":"IF($C60=BH$4,1,0)","v":0},null,{"$f":"IF($C60=BJ$4,1,0)","v":0},null,{"$f":"IF($C60=BL$4,1,0)","v":0},null,{"$f":"IF($C60=BN$4,1,0)","v":0},null,{"$f":"IF($C60=BP$4,1,0)","v":0},null,{"$f":"IF($C60=BR$4,1,0)","v":0},null,{"$f":"IF($C60=BT$4,1,0)","v":0},null,{"$f":"IF($C60=BV$4,1,0)","v":0},null,{"$f":"IF($C60=BX$4,1,0)","v":0},null,{"$f":"IF($C60=BZ$4,1,0)","v":0},null,{"$f":"IF($C60=CB$4,1,0)","v":0},null,{"$f":"IF($C60=CD$4,1,0)","v":0},null,{"$f":"IF($C60=CF$4,1,0)","v":0},null,{"$f":"IF($C60=CH$4,1,0)","v":0},null,{"$f":"IF($C60=CJ$4,1,0)","v":0},null,{"$f":"IF($C60=CL$4,1,0)","v":0},null,{"$f":"IF($C60=CN$4,1,0)","v":0},null,{"$f":"IF($C60=CP$4,1,0)","v":0},null,{"$f":"IF($C60=CR$4,1,0)","v":0},null,{"$f":"IF($C60=CT$4,1,0)","v":0},null,{"$f":"IF($C60=CV$4,1,0)","v":0},null,{"$f":"IF($C60=CX$4,1,0)","v":0},null,{"$f":"IF($C60=CZ$4,1,0)","v":0},null,{"$f":"IF($C60=DB$4,1,0)","v":0},null,{"$f":"IF($C60=DD$4,1,0)","v":0},null,{"$f":"IF($C60=DF$4,1,0)","v":0},null,{"$f":"IF($C60=DH$4,1,0)","v":0},null,{"$f":"IF($C60=DJ$4,1,0)","v":0},null,{"$f":"IF($C60=DL$4,1,0)","v":0},null,{"$f":"IF($C60=DN$4,1,0)","v":0},null,{"$f":"IF($C60=DP$4,1,0)","v":0},null,{"$f":"IF($C60=DR$4,1,0)","v":0},null,{"$f":"IF($C60=DT$4,1,0)","v":0},null,{"$f":"IF($C60=DV$4,1,0)","v":0},null,{"$f":"IF($C60=DX$4,1,0)","v":0}]
[null,null,7,{"$f":"HLOOKUP($C61,'Dados Gerais'!$D$5:$BK$10,6)","v":"SERVENTE"},null,null,{"$f":"HLOOKUP($C61,'Dados Gerais'!$D$5:$BK$14,10)","v":151},null,null,{"$f":"IF($C61=J$4,1,0)","v":0},null,0,null,0,null,0,null,0,null,0,null,1,null,0,null,0,null,0,null,0,null,0,null,0,null,0,null,0,null,0,null,0,null,0,null,0,null,0,null,0,null,0,null,0,null,0,null,0,null,0,null,0,null,0,null,0,null,0,null,0,null,0,null,0,null,0,null,0,null,0,null,0,null,0,null,0,null,0,null,0,null,0,null,0,null,0,null,0,null,0,null,0,null,0,null,0,null,0,null,0,null,0,null,0,null,0,null,0,null,0,null,0,null,0,null,0,null,0]
[null,null,8,{"$f":"HLOOKUP($C62,'Dados Gerais'!$D$5:$BK$10,6)","v":"SERVENTE COM ADICIONAL DE INSALUBRIDADE"},null,null,{"$f":"HLOOKUP($C62,'Dados Gerais'!$D$5:$BK$14,10)","v":25},null,null,{"$f":"IF($C62=J$4,1,0)","v":0},null,0,null,0,null,0,null,0,null,0,null,0,null,1,null,0,null,0,null,0,null,0,null,0,null,0,null,0,null,0,null,0,null,0,null,0,null,0,null,0,null,0,null,0,null,0,null,0,null,0,null,0,null,0,null,0,null,0,null,0,null,0,null,0,null,0,null,0,null,0,null,0,null,0,null,0,null,0,null,0,null,0,null,0,null,0,null,0,null,0,null,0,null,0,null,0,null,0,null,0,null,0,null,0,null,0,null,0,null,0,null,0,null,0,null,0,null,0]
[null,null,9,{"$f":"HLOOKUP($C63,'Dados Gerais'!$D$5:$BK$10,6)","v":"SERVENTE COM ADICIONAL DE INSALUBRIDADE E ADICIONAL NOTURNO"},null,null,{"$f":"HLOOKUP($C63,'Dados Gerais'!$D$5:$BK$14,10)","v":2},null,null,{"$f":"IF($C63=J$4,1,0)","v":0},null,0,null,0,null,0,null,0,null,0,null,0,null,0,null,1,null,0,null,0,null,0,null,0,null,0,null,0,null,0,null,0,null,0,null,0,null,0,null,0,null,0,null,0,null,0,null,0,null,0,null,0,null,0,null,0,null,0,null,0,null,0,null,0,null,0,null,0,null,0,null,0,null,0,null,0,null,0,null,0,null,0,null,0,null,0,null,0,null,0,null,0,null,0,null,0,null,0,null,0,null,0,null,0,null,0,null,0,null,0,null,0,null,0,null,0,null,0]
[null,null,null,null,null,null,null,null,null,{"$f":"IF($C64=J$4,1,0)","v":0},null,0,null,0,null,0,null,0,null,0,null,0,null,0,null,0,null,0,null,0,null,0,null,0,null,0,null,0,null,0,null,0,null,0,null,0,null,0,null,0,null,0,null,0,null,0,null,0,null,0,null,0,null,0,null,0,null,0,null,0,null,0,null,0,null,0,null,0,null,0,null,0,null,0,null,0,null,0,null,0,null,0,null,0,null,0,null,0,null,0,null,0,null,0,null,0,null,0,null,0,null,0,null,0,null,0,null,0,null,0,null,0,null,0,null,0,null,0]
[]
[null,null,"ITEM","DESCRIÇÃO","QUANT ANUAL POR POSTO","UNIDADE","VALOR"]
[null,null,null,null,null,null,null,null,null,null,{"$f":"IF(SUM(J$8:J$10)>0,$E67*$G67,0)","v":0},null,{"$f":"IF(SUM(L$8:L$10)>0,$E67*$G67,0)","v":0},null,{"$f":"IF(SUM(N$8:N$10)>0,$E67*$G67,0)","v":0},null,{"$f":"IF(SUM(P$8:P$10)>0,$E67*$G67,0)","v":0},null,{"$f":"IF(SUM(R$8:R$10)>0,$E67*$G67,0)","v":0},null,{"$f":"IF(SUM(T$8:T$10)>0,$E67*$G67,0)","v":0},null,{"$f":"IF(SUM(V$8:V$10)>0,$E67*$G67,0)","v":0},null,{"$f":"IF(SUM(X$8:X$10)>0,$E67*$G67,0)","v":0},null,{"$f":"IF(SUM(Z$8:Z$10)>0,$E67*$G67,0)","v":0},null,{"$f":"IF(SUM(AB$8:AB$10)>0,$E67*$G67,0)","v":0},null,{"$f":"IF(SUM(AD$8:AD$10)>0,$E67*$G67,0)","v":0},null,{"$f":"IF(SUM(AF$8:AF$10)>0,$E67*$G67,0)","v":0},null,{"$f":"IF(SUM(AH$8:AH$10)>0,$E67*$G67,0)","v":0},null,{"$f":"IF(SUM(AJ$8:AJ$10)>0,$E67*$G67,0)","v":0},null,{"$f":"IF(SUM(AL$8:AL$10)>0,$E67*$G67,0)","v":0},null,{"$f":"IF(SUM(AN$8:AN$10)>0,$E67*$G67,0)","v":0},null,{"$f":"IF(SUM(AP$8:AP$10)>0,$E67*$G67,0)","v":0},null,{"$f":"IF(SUM(AR$8:AR$10)>0,$E67*$G67,0)","v":0},null,{"$f":"IF(SUM(AT$8:AT$10)>0,$E67*$G67,0)","v":0},null,{"$f":"IF(SUM(AV$8:AV$10)>0,$E67*$G67,0)","v":0},null,{"$f":"IF(SUM(AX$8:AX$10)>0,$E67*$G67,0)","v":0},null,{"$f":"IF(SUM(AZ$8:AZ$10)>0,$E67*$G67,0)","v":0},null,{"$f":"IF(SUM(BB$8:BB$10)>0,$E67*$G67,0)","v":0},null,{"$f":"IF(SUM(BD$8:BD$10)>0,$E67*$G67,0)","v":0},null,{"$f":"IF(SUM(BF$8:BF$10)>0,$E67*$G67,0)","v":0},null,{"$f":"IF(SUM(BH$8:BH$10)>0,$E67*$G67,0)","v":0},null,{"$f":"IF(SUM(BJ$8:BJ$10)>0,$E67*$G67,0)","v":0},null,{"$f":"IF(SUM(BL$8:BL$10)>0,$E67*$G67,0)","v":0},null,{"$f":"IF(SUM(BN$8:BN$10)>0,$E67*$G67,0)","v":0},null,{"$f":"IF(SUM(BP$8:BP$10)>0,$E67*$G67,0)","v":0},null,{"$f":"IF(SUM(BR$8:BR$10)>0,$E67*$G67,0)","v":0},null,{"$f":"IF(SUM(BT$8:BT$10)>0,$E67*$G67,0)","v":0},null,{"$f":"IF(SUM(BV$8:BV$10)>0,$E67*$G67,0)","v":0},null,{"$f":"IF(SUM(BX$8:BX$10)>0,$E67*$G67,0)","v":0},null,{"$f":"IF(SUM(BZ$8:BZ$10)>0,$E67*$G67,0)","v":0},null,{"$f":"IF(SUM(CB$8:CB$10)>0,$E67*$G67,0)","v":0},null,{"$f":"IF(SUM(CD$8:CD$10)>0,$E67*$G67,0)","v":0},null,{"$f":"IF(SUM(CF$8:CF$10)>0,$E67*$G67,0)","v":0},null,{"$f":"IF(SUM(CH$8:CH$10)>0,$E67*$G67,0)","v":0},null,{"$f":"IF(SUM(CJ$8:CJ$10)>0,$E67*$G67,0)","v":0},null,{"$f":"IF(SUM(CL$8:CL$10)>0,$E67*$G67,0)","v":0},null,{"$f":"IF(SUM(CN$8:CN$10)>0,$E67*$G67,0)","v":0},null,{"$f":"IF(SUM(CP$8:CP$10)>0,$E67*$G67,0)","v":0},null,{"$f":"IF(SUM(CR$8:CR$10)>0,$E67*$G67,0)","v":0},null,{"$f":"IF(SUM(CT$8:CT$10)>0,$E67*$G67,0)","v":0},null,{"$f":"IF(SUM(CV$8:CV$10)>0,$E67*$G67,0)","v":0},null,{"$f":"IF(SUM(CX$8:CX$10)>0,$E67*$G67,0)","v":0},null,{"$f":"IF(SUM(CZ$8:CZ$10)>0,$E67*$G67,0)","v":0},null,{"$f":"IF(SUM(DB$8:DB$10)>0,$E67*$G67,0)","v":0},null,{"$f":"IF(SUM(DD$8:DD$10)>0,$E67*$G67,0)","v":0},null,{"$f":"IF(SUM(DF$8:DF$10)>0,$E67*$G67,0)","v":0},null,{"$f":"IF(SUM(DH$8:DH$10)>0,$E67*$G67,0)","v":0},null,{"$f":"IF(SUM(DJ$8:DJ$10)>0,$E67*$G67,0)","v":0},null,{"$f":"IF(SUM(DL$8:DL$10)>0,$E67*$G67,0)","v":0},null,{"$f":"IF(SUM(DN$8:DN$10)>0,$E67*$G67,0)","v":0},null,{"$f":"IF(SUM(DP$8:DP$10)>0,$E67*$G67,0)","v":0},null,{"$f":"IF(SUM(DR$8:DR$10)>0,$E67*$G67,0)","v":0},null,{"$f":"IF(SUM(DT$8:DT$10)>0,$E67*$G67,0)","v":0},null,{"$f":"IF(SUM(DV$8:DV$10)>0,$E67*$G67,0)","v":0},null,{"$f":"IF(SUM(DX$8:DX$10)>0,$E67*$G67,0)","v":0}]
[null,null,1,"Calçado de segurança tipo sapato com resistência a objetos pontiagudos, fechamento em elástico, couro preto, forração em tecido, bico de composite, palmilha de montagem têxtil resistente à perfuração, solado de PU (poliuretano), bidensidade sem cadarço. Ref. MARLUVAS.",3,"PAR",{"$f":"G53","v":117.26},null,null,null,{"$f":"IF(SUM(J$61:J$63)>0,$E68*$G68,0)","v":0},null,{"$f":"IF(SUM(L$61:L$63)>0,$E68*$G68,0)","v":0},null,{"$f":"IF(SUM($J$61:$J$63)>0,$E68*$G68,0)","v":0},null,{"$f":"IF(SUM($J$61:$J$63)>0,$E68*$G68,0)","v":0},null,{"$f":"IF(SUM($J$61:$J$63)>0,$E68*$G68,0)","v":0},null,{"$f":"IF(SUM($J$61:$J$63)>0,$E68*$G68,0)","v":0},null,{"$f":"IF(SUM(V$61:V$63)>0,$E68*$G68,0)","v":351.78000000000003},null,{"$f":"IF(SUM(X$61:X$63)>0,$E68*$G68,0)","v":351.78000000000003},null,{"$f":"IF(SUM(Z$61:Z$63)>0,$E68*$G68,0)","v":351.78000000000003},null,{"$f":"IF(SUM($J$61:$J$63)>0,$E68*$G68,0)","v":0},null,{"$f":"IF(SUM($J$61:$J$63)>0,$E68*$G68,0)","v":0},null,{"$f":"IF(SUM($J$61:$J$63)>0,$E68*$G68,0)","v":0},null,{"$f":"IF(SUM($J$61:$J$63)>0,$E68*$G68,0)","v":0},null,{"$f":"IF(SUM($J$61:$J$63)>0,$E68*$G68,0)","v":0},null,{"$f":"IF(SUM($J$61:$J$63)>0,$E68*$G68,0)","v":0},null,{"$f":"IF(SUM($J$61:$J$63)>0,$E68*$G68,0)","v":0},null,{"$f":"IF(SUM($J$61:$J$63)>0,$E68*$G68,0)","v":0},null,{"$f":"IF(SUM($J$61:$J$63)>0,$E68*$G68,0)","v":0},null,{"$f":"IF(SUM($J$61:$J$63)>0,$E68*$G68,0)","v":0},null,{"$f":"IF(SUM($J$61:$J$63)>0,$E68*$G68,0)","v":0},null,{"$f":"IF(SUM($J$61:$J$63)>0,$E68*$G68,0)","v":0},null,{"$f":"IF(SUM($J$61:$J$63)>0,$E68*$G68,0)","v":0},null,{"$f":"IF(SUM($J$61:$J$63)>0,$E68*$G68,0)","v":0},null,{"$f":"IF(SUM($J$61:$J$63)>0,$E68*$G68,0)","v":0},null,{"$f":"IF(SUM($J$61:$J$63)>0,$E68*$G68,0)","v":0},null,{"$f":"IF(SUM($J$61:$J$63)>0,$E68*$G68,0)","v":0},null,{"$f":"IF(SUM($J$61:$J$63)>0,$E68*$G68,0)","v":0},null,{"$f":"IF(SUM($J$61:$J$63)>0,$E68*$G68,0)","v":0},null,{"$f":"IF(SUM($J$61:$J$63)>0,$E68*$G68,0)","v":0},null,{"$f":"IF(SUM($J$61:$J$63)>0,$E68*$G68,0)","v":0},null,{"$f":"IF(SUM($J$61:$J$63)>0,$E68*$G68,0)","v":0},null,{"$f":"IF(SUM($J$61:$J$63)>0,$E68*$G68,0)","v":0},null,{"$f":"IF(SUM($J$61:$J$63)>0,$E68*$G68,0)","v":0},null,{"$f":"IF(SUM($J$61:$J$63)>0,$E68*$G68,0)","v":0},null,{"$f":"IF(SUM($J$61:$J$63)>0,$E68*$G68,0)","v":0},null,{"$f":"IF(SUM($J$61:$J$63)>0,$E68*$G68,0)","v":0},null,{"$f":"IF(SUM($J$61:$J$63)>0,$E68*$G68,0)","v":0},null,{"$f":"IF(SUM($J$61:$J$63)>0,$E68*$G68,0)","v":0},null,{"$f":"IF(SUM($J$61:$J$63)>0,$E68*$G68,0)","v":0},null,{"$f":"IF(SUM($J$61:$J$63)>0,$E68*$G68,0)","v":0},null,{"$f":"IF(SUM($J$61:$J$63)>0,$E68*$G68,0)","v":0},null,{"$f":"IF(SUM($J$61:$J$63)>0,$E68*$G68,0)","v":0},null,{"$f":"IF(SUM($J$61:$J$63)>0,$E68*$G68,0)","v":0},null,{"$f":"IF(SUM($J$61:$J$63)>0,$E68*$G68,0)","v":0},null,{"$f":"IF(SUM($J$61:$J$63)>0,$E68*$G68,0)","v":0},null,{"$f":"IF(SUM($J$61:$J$63)>0,$E68*$G68,0)","v":0},null,{"$f":"IF(SUM($J$61:$J$63)>0,$E68*$G68,0)","v":0},null,{"$f":"IF(SUM($J$61:$J$63)>0,$E68*$G68,0)","v":0},null,{"$f":"IF(SUM($J$61:$J$63)>0,$E68*$G68,0)","v":0},null,{"$f":"IF(SUM($J$61:$J$63)>0,$E68*$G68,0)","v":0},null,{"$f":"IF(SUM($J$61:$J$63)>0,$E68*$G68,0)","v":0},null,{"$f":"IF(SUM($J$61:$J$63)>0,$E68*$G68,0)","v":0},null,{"$f":"IF(SUM($J$61:$J$63)>0,$E68*$G68,0)","v":0},null,{"$f":"IF(SUM($J$61:$J$63)>0,$E68*$G68,0)","v":0},null,{"$f":"IF(SUM($J$61:$J$63)>0,$E68*$G68,0)","v":0},null,{"$f":"IF(SUM($J$61:$J$63)>0,$E68*$G68,0)","v":0},null,{"$f":"IF(SUM($J$61:$J$63)>0,$E68*$G68,0)","v":0},null,{"$f":"IF(SUM($J$61:$J$63)>0,$E68*$G68,0)","v":0},null,{"$f":"IF(SUM($J$61:$J$63)>0,$E68*$G68,0)","v":0},null,{"$f":"IF(SUM($J$61:$J$63)>0,$E68*$G68,0)","v":0}]
[null,null,2,"Luva de Segurança confeccionada em LÁTEX natural anatômica (esp. mínima 0,60mm), acabamento forrado em algodão flocado, antiderrapante na palma e dedos. Ref.: Mucambo",11,"PAR",{"$f":"G55","v":10.15},null,null,null,{"$f":"IF(SUM(J$61:J$63)>0,$E69*$G69,0)","v":0},null,0,null,{"$f":"IF(SUM($J$61:$J$63)>0,$E69*$G69,0)","v":0},null,0,null,0,null,0,null,{"$f":"IF(SUM(V$61:V$63)>0,$E69*$G69,0)","v":111.65},null,111.65,null,{"$f":"IF(SUM(Z$61:Z$63)>0,$E69*$G69,0)","v":111.65},null,{"$f":"IF(SUM($J$61:$J$63)>0,$E69*$G69,0)","v":0},null,0,null,0,null,0,null,0,null,0,null,0,null,0,null,0,null,0,null,0,null,0,null,0,null,0,null,0,null,0,null,0,null,0,null,0,null,0,null,0,null,0,null,0,null,0,null,0,null,0,null,0,null,0,null,0,null,0,null,0,null,0,null,0,null,0,null,0,null,0,null,0,null,0,null,0,null,0,null,0,null,0,null,0,null,0,null,0,null,0,null,0,null,0,null,0,null,0,null,0]
[null,null,3,"Respirador purificador de ar tipo, peça semifacial filtrante para partículas (PFF2), com formato dobrável, solda ultra-sônica em todo o seu perímetro. Fita elástica branca fixada nas laterais externas do respirador, perfazendo uma alça na para fixação na parte superior da cabeça e a outra na parte inferior, para fixação na altura da nuca do usuário. A parte superior externa da peça possui tira de material metálico moldável, utilizada para ajuste no septo nasal. Com válvula de exalação. DEVERÁ APRESENTAR O SELO DE APROVAÇÃO DO INMETRO. Ref. 3M ",2,"UND",{"$f":"G54","v":2.74},null,null,null,0,null,0,null,{"$f":"IF(SUM($J$61:$J$63)>0,$E70*$G70,0)","v":0},null,0,null,0,null,0,null,5.48,null,5.48,null,{"$f":"IF(SUM(Z$61:Z$63)>0,$E70*$G70,0)","v":5.48},null,0,null,0,null,0,null,0,null,0,null,0,null,0,null,0,null,0,null,0,null,0,null,0,null,0,null,0,null,0,null,0,null,0,null,0,null,0,null,0,null,0,null,0,null,0,null,0,null,0,null,0,null,0,null,0,null,0,null,0,null,0,null,0,null,0,null,0,null,0,null,0,null,0,null,0,null,0,null,0,null,0,null,0,null,0,null,0,null,0,null,0,null,0,null,0,null,0,null,0,null,0]

{"sheet":"SREP","index":18,"n_rows":75,"n_cols":15,"rows_kept":75,"cut":false,"hidden":false,"merged":[[2,1,2,3],[3,1,3,14]]}
[]
[]
[]
[null,"SISTEMA DE REGISTRO ELETRÔNICO DE PRESENÇA - SREP"]
[]
[]
[null,null,"PAGAMENTO DA DEPRECIAÇÃO"]
[null,null,"ITEM","DESCRIÇÃO","QUANT ANUAL","CONTA SIAFI","VALOR DE AQ.","% RESIDUAL","VIDA ÚTIL","DEP. MENSAL","CUSTO TOTAL","BDI (%)","PREÇO TOTAL","FONTE","REFERÊNCIA"]
[]
[null,null,1,"Equipamento de Registro Eletrônico de Ponto, de parede, com teclado externo e leitor biométrico, em conformidade com a Portaria 1.510/2009 do MT",6,"12311.01.24\n(máquinas e equip\neletrônicos)",1277.48,0.1,10,{"$f":"G10*(1-H10)/(I10*12)","v":9.5810999999999993},{"$f":"J10*E10","v":57.486599999999996},{"$f":"BDI!E26","v":0.21840000000000001},{"$f":"ROUND(K10*(1+L10),2)","v":70.040000000000006},"COTAÇÃO"]
[]
[]
[null,null,"PAGAMENTO DA MANUTENÇÃO"]
[null,null,"ITEM","DESCRIÇÃO",null,null,null,"K (calculado)","MENSAL DEPR.","% MAN X DEP","MENSAL MAN.","BDI (%)","PREÇO TOTAL"]
[]
[null,null,2,"Todos os itens",null,null,null,{"$f":"H23","v":1.9000396799999999},{"$f":"K10","v":57.486599999999996},{"$f":"H16","v":1.9000396799999999},{"$f":"I16*H16","v":109.22682106828799},{"$f":"L10","v":0.21840000000000001},{"$f":"ROUND(K16*(1+L16),2)","v":133.08000000000001}]
[]
[null,null,null,null,"K1","K2","K3","K4"]
[null,null,null,null,0.85,1,0.8,1.4]
[null,null,null,null,"K5","K6","K7","K8"]
[null,null,null,null,1,0.6,1.6,1.1000000000000001]
[null,null,null,null,"K9","K10","K11","RESULTADO"]
[null,null,null,"* a descrição de cada coeficiente segue abaixo",1.5,0.9,1.4,{"$f":"E19*F19*G19*H19*E21*F21*G21*H21*E23*F23*G23","v":1.9000396799999999}]
[]
[]
[null,null,"PAGAMENTO DO SOFTWARE"]
[null,null,"ITEM","DESCRIÇÃO",null,null,null,null,"QUANTIDADE","UNIDADE","UNIT. MENSAL","BDI (%)","PREÇO TOTAL"]
[]
[null,null,3,"Software Ponto Secullum 4 - manutenção e suporte técnico com backup - Web Nuvem - Mensalidade até 200 usuários",null,null,null,null,6,"Licença/mês",115.79,{"$f":"L35","v":0.21840000000000001},{"$f":"ROUND(K29*(1+L29),2)","v":141.08000000000001},"COTAÇÃO"]
[]
[]
[null,null,"MATERIAL DE CONSUMO ASSOCIADO"]
[null,null,"ITEM","DESCRIÇÃO",null,null,null,"QUANTID/ANO","UNIDADE","VALOR DE AQ.","MENSAL MAT","BDI (%)","PREÇO TOTAL"]
[]
[null,null,4,"Bobina térmica específica para o registrador eletrônico de ponto, com papel termossensível, superfície de impressão externa ao rolo, durabilidade de impressão mínima de 5 anos e comprimento mínimo de 300m","* estimado um gasto anual de 35 bobinas por equipamento",null,null,{"$f":"ROUNDUP(SUM(Remunerações!E15)*4*22*12*0.05/300,0)","v":35},"Bobina",32.85,{"$f":"J35*H35/12","v":95.8125},{"$f":"L16","v":0.21840000000000001},{"$f":"ROUND(K35*(1+L35),2)","v":116.74},"COTAÇÃO"]
[]
[]
[null,null,"MATERIAL DE CONSUMO ASSOCIADO"]
[null,null,"ITEM","DESCRIÇÃO",null,null,null,null,null,null,null,null,"PREÇO TOTAL"]
[]
[null,null,1,"Componente DEPRECIAÇÃO",null,null,null,null,null,null,null,null,{"$f":"M10","v":70.040000000000006}]
[null,null,2,"Componente MANUTENÇÃO",null,null,null,null,null,null,null,null,{"$f":"M16","v":133.08000000000001}]
[null,null,3,"Componente SOFTWARE",null,null,null,null,null,null,null,null,{"$f":"M29","v":141.08000000000001}]
[null,null,4,"Componente MATERIAL DE CONSUMO ASSOCIADO",null,null,null,null,null,null,null,null,{"$f":"M35","v":116.74}]
[]
[null,null,null,null,null,null,null,null,null,null,null,"SOMATÓRIO TOTAL MENSAL",{"$f":"SUM(M40:M45)","v":460.94000000000005}]
[null,null,null,null,null,null,null,null,null,null,null,"SOMATÓRIO TOTAL ANUAL",{"$f":"M46*12","v":5531.2800000000007}]
[]
[]
[null,null,"MATERIAL DE CONSUMO ASSOCIADO"]
[null,null,"MEMÓRIA DE CÁLCULO DO COEFICIENTE DE CORRELAÇÃO MANUTENÇÃO X DEPRECIAÇÃO (K)"]
[]
[null,null,"JUSTIFICATIVAS",null,"TIPO","K1",null,"Condições de Trab","K4",null,"Tempo Vida (anos)","K6",null,"Temperatura","K8"]
[null,null,null,null,"Guindaste",0.5,null,"Em espera",0.4,null,1,0.6,null,"Muito quente (> 40º C)",1.3]
[null,null,"K1","Considerado o valor médio de 0,85","Caminhão-comum",0.8,null,"Leves",0.8,null,2,0.7,null,"Quente (30º a 40º C)",1.1000000000000001]
[null,null,"K2","Considerado o operador médio","Fora-de-estrada",1,null,"Médias",1,null,3,0.8,null,"Médio (10º a 30º C)",1]
[null,null,"K3","Consideradas ferramentas de primeira qualidade","Carregadeira",1,null,"Pesadas",1.4,null,4,0.9,null,"Frio (< 10º C)",1.2]
[null,null,"K4","Há todo o tipo de trabalho, foi considerado condições pesadas","Escavadeira",1.4,null,"Severas",2,null,5,1]
[null,null,"K5","Considerando manutenção normal","Motoescrêiper",1.1000000000000001,null,null,null,null,6,1,null,"Ritmo de Trabalho","K9"]
[null,null,"K6","Equipamentos novos","Trator de esteira",1.2,null,"Manutenção","K5",null,7,1,null,"Folgado",0.9]
[null,null,"K7","44h por dia, 252 dias por ano",null,null,null,"Excelente",0.6,null,8,1.2,null,"Médio ",1]
[null,null,"K8","Clima quente, acima de 30º C","Qualid do Operador","K2",null,"Boa",0.8,null,9,1.3,null,"Com pressa",1.5]
[null,null,"K9","Ritmo de trabalho usualmente com pressa","Excelente",0.8,null,"Média",1,null,10,1.4]
[null,null,"K10","Considerado o operador médio","Boa",0.9,null,"Ruim ",1.5,null,11,2,null,"Conh do Serviço","K10"]
[null,null,"K11","Foi considerada a opção de aluguel a terceiros, ainda que a simulação seja dos custos do contratado, contudo a execução dos serviços é em local de terceiros","Média",1,null,"Inexistente",3,null,15,2,null,"Grande ",0.8]
[null,null,null,null,"Ruim",1.2,null,null,null,null,null,null,null,"Médio     ",0.9]
[null,null,null,null,"Péssima",2,null,"Horas de Uso ","K7",6000,1,null,null,"Pouco ",1]
[null,null,null,null,null,null,null,1000,0.5,8000,1.3]
[null,null,null,null,"Qualidade do Equip","K3",null,2000,0.5,10000,1.6,null,null,"Tipo do Serviço","K11"]
[null,null,null,null,"De primeira",0.8,null,3000,0.6,12000,1.9,null,null,"Mina ou Pedreira",0.8]
[null,null,null,null,"Média",1,null,4000,0.7,15000,2.2999999999999998,null,null,"Construção Geral",1]
[null,null,null,null,"Ruim",1.5,null,5000,0.9,20000,3,null,null,"Aluguel a Terceiros",1.4]
[]
[null,null,null,null,"Fonte: "]
[null,null,null,null,"MATTOS, Aldo Dórea. Como preparar orçamentos de obras. São Paulo: Pini, 2006. 281 p., il"]

{"sheet":"Não Rel - EPI","index":19,"n_rows":35,"n_cols":15,"rows_kept":35,"cut":false,"hidden":false,"merged":[[2,1,2,4],[3,1,3,11]]}
[]
[]
[]
[null,"EPIS NÃO RELACIONADOS DIRETAMENTE A UM POSTO DE TRABALHO - AQUISIÇÃO"]
[]
[]
[null,null,null,"ITEM","DESCRIÇÃO","QUANT ANUAL","UNIDADE","CUSTO UNITÁRIO","CUSTO ANUAL","BDI (%)","PREÇO TOTAL","FONTE"]
[]
[null,null,null,1,"Avental em PVC (forrado), 70 X 120CM de largura e comprimento (aproximadamente), corpo inteiro na frente, contendo tiras fixadas no avental, que deverão ser amarradas no pescoço e na cintura. REF.: MAICOL",36,"UNID",18.670000000000002,{"$f":"H9*F9","v":672.12000000000012},{"$f":"BDI!E26","v":0.21840000000000001},{"$f":"ROUND(I9*(1+J9),2)","v":818.91},"COTAÇÃO"]
[null,null,null,2,"Avental em PVC, com forro de poliéster, tipo barbeiro, manga longa, fechamento nas costas na altura dos ombros através de botões de pressão plásticos, duas tiras na cintura soldadas eletronicamente com fechamento através de fivela plástica tipo engate rápido, acabamento em solda eletrônica. Ref.: MAICOL",12,"UNID",23.11,{"$f":"H10*F10","v":277.32},{"$f":"J9","v":0.21840000000000001},{"$f":"ROUND(I10*(1+J10),2)","v":337.89},"COTAÇÃO"]
[null,null,null,3,"Bloqueador solar com fator de proteção solar no mínimo de 30 (UV FPS 30) com propriedade repelente a insetos. Inodoro. Bombonas (4 Litros). REF.: LUVEX.",2,"UNID",363.86,{"$f":"H11*F11","v":727.72},{"$f":"J10","v":0.21840000000000001},{"$f":"ROUND(I11*(1+J11),2)","v":886.65},"COTAÇÃO"]
[null,null,null,4,"Boné tipo Árabe confeccionado em helanca com viés na aba, elástico interno traseiro para ajuste de tamanho, fechamento da saia em velcro. REF.: Nexus",24,"UNID",13,312,0.21840000000000001,380.14,"COTAÇÃO"]
[null,null,null,5,"Bota em PVC, impermeável, forrada internamente, cano médio, resistência ao escorregamento do solado SRC. Ref. MARLUVAS",45,"PARES",45.26,2036.6999999999998,0.21840000000000001,2481.52,"COTAÇÃO"]
[null,null,null,6,"Capacete de segurança em polietileno de alta densidade, na cor CINZA, com aba frontal, casco com nervuras, com Faixa anti-suor, regulagem de tamanho com ajuste simples, com jugular. Ref.: MSA",6,"UNID",31.09,186.54,0.21840000000000001,227.28,"COTAÇÃO"]
[null,null,null,7,"Cartucho químico para Vapores orgânicos e gases ácidos compatível com os respiradores (meia peça facial e peça facial completa). Ref. 3M Série 6000",12,"PARES",111.1,1333.1999999999998,0.21840000000000001,1624.37,"COTAÇÃO"]
[null,null,null,8,"Cinto de segurança, tipo paraquedista, com talabarte duplo (comprimento aprox 1,50m) e absorvedor de energia, produzido em material sintético, com 2 pontos de ancoragem - Frontal e dorsal - ajuste nas pernas e cintura. Ref.: Gulin",6,"CONJ",426.58,2559.48,0.21840000000000001,3118.47,"COTAÇÃO"]
[null,null,null,9,"Corda de segurança semi-estática 12mm na cor branca, carga de ruptura 20kN. Trançado triplo e alma central. Trançado externo em multi filamento de poliamida, trançado intermediário e alerta visual em multi filamento de polipropileno, trançado interno em multi filamento de poliamida e alma central torcida em multi filamento de poliamida. Possui fita de identificação interna. Ref. 3M ALTISEG",30,"METROS",6.19,185.70000000000002,0.21840000000000001,226.26,"COTAÇÃO"]
[null,null,null,10,"Fita de sinalização (zebrada), com listas laranja e preta intercaladas-rolo 180 m x 65 mm. Rolo de 200 Metros. Ref.: 3M",20,"UNID",8.5299999999999994,170.6,0.21840000000000001,207.86,"COTAÇÃO"]
[null,null,null,11,"Jardineira impermeável, com peito alto, tiras fixas, reguláveis por argolas e com botas de PVC acoplados, tamanhos – botas 42,44. Deverá possuir Certificado de Aprovação aprovado pelo Ministério do Trabalho e Emprego e vigente. Ref.: Prot-cap. ",4,"UNID",178.465,713.86,0.21840000000000001,869.77,"COTAÇÃO"]
[null,null,null,12,"Luva de segurança confeccionada em para-aramida e algodão tipo Jersey (felpudo), totalmente revestida na face palmar, pontas dos dedos e dorso em nitrílico, punho de segurança revestido em nitrílico. Para proteção das mãos do usuário contra agentes abrasivos, escoriantes, cortantes e perfurantes. Ref.: Volk, modelo Attack.",8,"PARES",42.33,338.64,0.21840000000000001,412.6,"COTAÇÃO"]
[null,null,null,13,"Luva de segurança em borracha nitrílica, na cor verde, sem forro. Superfície externa antiderrapante. Cano longo (46cm) e espessura mínima de 0,55mm. Ref.: Danny Nitriflex",48,"PAR",9.3949999999999996,450.96,0.21840000000000001,549.45000000000005,"COTAÇÃO"]
[null,null,null,14,"Luva de segurança confeccionada em fios de algodão vulcanizado de látex reforçado na palma e nos dedos. Reforço entre o polegar e o indicador. Sem costura interna. Ref.:  Danny, modelo Gladiador",6,"PAR",9.76,58.56,0.21840000000000001,71.349999999999994,"COTAÇÃO"]
[null,null,null,15,"Óculos de segurança constituídos de armação e visor confeccionados em uma única peça de policarbonato CINZA, anti-risco, apoio nasal de plástico maleável. Hastes emborrachadas. Ref.: 3M Virtua V4",40,"UNID",24.145,965.8,0.21840000000000001,1176.73,"COTAÇÃO"]
[null,null,null,16,"Óculos de segurança constituídos de armação e visor confeccionados em uma única peça de policarbonato INCOLOR, anti-risco, apoio nasal de plástico maleável. Hastes emborrachadas. Ref.: 3M Virtua V4",50,"UNID",10.59,529.5,0.21840000000000001,645.14,"COTAÇÃO"]
[null,null,null,17,"Óculos de sobreposição INCOLOR, constituído de armação e visor confeccionados em uma única peça de policarbonato com apoio (do nariz) anatômico. Permite a sobreposição em óculos de grau. Hastes do tipo espátula confeccionadas do mesmo material da armação. Possui fendas para ventilação fixadas à armação e orifícios para cordão. REF. CARBOGRAFITE Mod. Provision.",10,"UNID",11.5,115,0.21840000000000001,140.12,"COTAÇÃO"]
[null,null,null,18,"Protetor auditivo, do tipo inserção pré-moldado, de silicone, lavável, com cordão e tamanho único,  com proteção mínima de 18 Db(A) de atenuação pelo método NRRsf. Ref: 3M",90,"UNID",3.9299999999999997,{"$f":"H26*F26","v":353.7},{"$f":"J22","v":0.21840000000000001},{"$f":"ROUND(I26*(1+J26),2)","v":430.95},"COTAÇÃO"]
[null,null,null,19,"Respirador de meia peça facial, com duplo filtro Ref.: 3M, modelo 6200",6,"UNID",171.745,1030.47,0.21840000000000001,1255.52,"COTAÇÃO"]
[null,null,null,20,"Respirador peça facial completa, com duplo filtro Ref.: 3M, modelo 6800",4,"UNID",1430.88,5723.52,{"$f":"J26","v":0.21840000000000001},6973.54,"COTAÇÃO"]
[null,null,null,21,"Respirador purificador de ar tipo, peça semifacial filtrante para partículas (PFF2), com formato dobrável, solda ultra-sônica em todo o seu perímetro. Fita elástica branca fixada nas laterais externas do respirador, perfazendo uma alça na para fixação na parte superior da cabeça e a outra na parte inferior, para fixação na altura da nuca do usuário. A parte superior externa da peça possui tira de material metálico moldável, utilizada para ajuste no septo nasal. Com válvula de exalação. DEVERÁ APRESENTAR O SELO DE APROVAÇÃO DO INMETRO. Ref. 3M ",8,"UNID",2.7350000000000003,21.880000000000003,{"$f":"J25","v":0.21840000000000001},26.66,"COTAÇÃO"]
[null,null,null,22,"Avental descartável em TNT (tipo capote), fechamento posterior com tiras, manga longa, elástico no punho, cor branca, gramatura mínima 20. Ref.: Amédica Descartáveis",1260,"UNID",3.694,4654.4399999999996,0.21840000000000001,5670.97,"COTAÇÃO"]
[null,null,null,23,"Touca Sanfonada em TNT, descartável, cor branca, gramatura mínima 20. Ref.: Amédica Descartáveis",1260,"UNID",0.26500000000000001,333.90000000000003,{"$f":"J29","v":0.21840000000000001},406.82,"COTAÇÃO"]
[null,null,null,24,"Vestimenta tipo capa (para chuva), confeccionada em PVC forrada em poliéster, fechamento frontal com botões plásticos de pressão, costuras através de solda eletrônica, com mangas e capuz, comprimento mínimo 1,15m. ref. CARBOGRAFITE",12,"UNID",21.954999999999998,263.45999999999998,{"$f":"J30","v":0.21840000000000001},321,"COTAÇÃO"]
[]
[null,null,null,null,null,null,null,null,null,"SOMATÓRIO TOTAL MENSAL",{"$f":"K35/12","v":2438.3308333333339}]
[null,null,null,null,null,null,null,null,null,"SOMATÓRIO TOTAL ANUAL",{"$f":"SUM(K8:K33)","v":29259.970000000005},null,null,{"$f":"SUM($I$9:$I$32)","v":24015.07},"por ano sem bdi"]

{"sheet":"Equip Rel","index":20,"n_rows":80,"n_cols":136,"rows_kept":80,"cut":false,"hidden":true,"merged":[[9,1,9,3],[10,1,10,14]]}
[null,null,"CÂMARA DOS DEPUTADOS"]
[null,null,"DEPARTAMENTO TÉCNICO"]
[null,null,"Coordenação de Planejamento e Gestão"]
[]
[null,null,"Data:",{"$f":"'Dados Gerais'!#REF!","v":{"$error":"#REF!"}}]
[null,null,"Processo:",{"$f":"'Dados Gerais'!#REF!","v":{"$error":"#REF!"}}]
[null,null,"Objeto:",{"$f":"'Dados Gerais'!#REF!","v":{"$error":"#REF!"}}]
[]
[]
[]
[null,"EQUIPAMENTOS RELACIONADOS AO POSTO - PAGAMENTO DA DEPRECIAÇÃO / MANUTENÇÃO",null,null,null,null,null,null,null,null,null,null,null,null,null,null,1,null,{"$f":"Q11+1","v":2},null,{"$f":"S11+1","v":3},null,{"$f":"U11+1","v":4},null,{"$f":"W11+1","v":5},null,{"$f":"Y11+1","v":6},null,{"$f":"AA11+1","v":7},null,{"$f":"AC11+1","v":8},null,{"$f":"AE11+1","v":9},null,{"$f":"AG11+1","v":10},null,{"$f":"AI11+1","v":11},null,{"$f":"AK11+1","v":12},null,{"$f":"AM11+1","v":13},null,{"$f":"AO11+1","v":14},null,{"$f":"AQ11+1","v":15},null,{"$f":"AS11+1","v":16},null,{"$f":"AU11+1","v":17},null,{"$f":"AW11+1","v":18},null,{"$f":"AY11+1","v":19},null,{"$f":"BA11+1","v":20},null,{"$f":"BC11+1","v":21},null,{"$f":"BE11+1","v":22},null,{"$f":"BG11+1","v":23},null,{"$f":"BI11+1","v":24},null,{"$f":"BK11+1","v":25},null,{"$f":"BM11+1","v":26},null,{"$f":"BO11+1","v":27},null,{"$f":"BQ11+1","v":28},null,{"$f":"BS11+1","v":29},null,{"$f":"BU11+1","v":30},null,{"$f":"BW11+1","v":31},null,{"$f":"BY11+1","v":32},null,{"$f":"CA11+1","v":33},null,{"$f":"CC11+1","v":34},null,{"$f":"CE11+1","v":35},null,{"$f":"CG11+1","v":36},null,{"$f":"CI11+1","v":37},null,{"$f":"CK11+1","v":38},null,{"$f":"CM11+1","v":39},null,{"$f":"CO11+1","v":40},null,{"$f":"CQ11+1","v":41},null,{"$f":"CS11+1","v":42},null,{"$f":"CU11+1","v":43},null,{"$f":"CW11+1","v":44},null,{"$f":"CY11+1","v":45},null,{"$f":"DA11+1","v":46},null,{"$f":"DC11+1","v":47},null,{"$f":"DE11+1","v":48},null,{"$f":"DG11+1","v":49},null,{"$f":"DI11+1","v":50},null,{"$f":"DK11+1","v":51},null,{"$f":"DM11+1","v":52},null,{"$f":"DO11+1","v":53},null,{"$f":"DQ11+1","v":54},null,{"$f":"DS11+1","v":55},null,{"$f":"DU11+1","v":56},null,{"$f":"DW11+1","v":57},null,{"$f":"DY11+1","v":58},null,{"$f":"EA11+1","v":59},null,{"$f":"EC11+1","v":60}]
[]
[null,null,null,null,null,null,null,null,null,null,null,null,null,null,null,null,{"$f":"SUM(R12:R61)","v":0},null,{"$f":"SUM(T12:T61)","v":0},null,{"$f":"SUM(V12:V61)","v":0},null,{"$f":"SUM(X12:X61)","v":0},null,{"$f":"SUM(Z12:Z61)","v":0},null,{"$f":"SUM(AB12:AB61)","v":0},null,{"$f":"SUM(AD12:AD61)","v":0},null,{"$f":"SUM(AF12:AF61)","v":0},null,{"$f":"SUM(AH12:AH61)","v":0},null,{"$f":"SUM(AJ12:AJ61)","v":0},null,{"$f":"SUM(AL12:AL61)","v":0},null,{"$f":"SUM(AN12:AN61)","v":0},null,{"$f":"SUM(AP12:AP61)","v":0},null,{"$f":"SUM(AR12:AR61)","v":0},null,{"$f":"SUM(AT12:AT61)","v":0},null,{"$f":"SUM(AV12:AV61)","v":0},null,{"$f":"SUM(AX12:AX61)","v":0},null,{"$f":"SUM(AZ12:AZ61)","v":0},null,{"$f":"SUM(BB12:BB61)","v":0},null,{"$f":"SUM(BD12:BD61)","v":0},null,{"$f":"SUM(BF12:BF61)","v":0},null,{"$f":"SUM(BH12:BH61)","v":0},null,{"$f":"SUM(BJ12:BJ61)","v":0},null,{"$f":"SUM(BL12:BL61)","v":0},null,{"$f":"SUM(BN12:BN61)","v":0},null,{"$f":"SUM(BP12:BP61)","v":0},null,{"$f":"SUM(BR12:BR61)","v":0},null,{"$f":"SUM(BT12:BT61)","v":0},null,{"$f":"SUM(BV12:BV61)","v":0},null,{"$f":"SUM(BX12:BX61)","v":0},null,{"$f":"SUM(BZ12:BZ61)","v":0},null,{"$f":"SUM(CB12:CB61)","v":0},null,{"$f":"SUM(CD12:CD61)","v":0},null,{"$f":"SUM(CF12:CF61)","v":0},null,{"$f":"SUM(CH12:CH61)","v":0},null,{"$f":"SUM(CJ12:CJ61)","v":0},null,{"$f":"SUM(CL12:CL61)","v":0},null,{"$f":"SUM(CN12:CN61)","v":0},null,{"$f":"SUM(CP12:CP61)","v":0},null,{"$f":"SUM(CR12:CR61)","v":0},null,{"$f":"SUM(CT12:CT61)","v":0},null,{"$f":"SUM(CV12:CV61)","v":0},null,{"$f":"SUM(CX12:CX61)","v":0},null,{"$f":"SUM(CZ12:CZ61)","v":0},null,{"$f":"SUM(DB12:DB61)","v":0},null,{"$f":"SUM(DD12:DD61)","v":0},null,{"$f":"SUM(DF12:DF61)","v":0},null,{"$f":"SUM(DH12:DH61)","v":0},null,{"$f":"SUM(DJ12:DJ61)","v":0},null,{"$f":"SUM(DL12:DL61)","v":0},null,{"$f":"SUM(DN12:DN61)","v":0},null,{"$f":"SUM(DP12:DP61)","v":0},null,{"$f":"SUM(DR12:DR61)","v":0},null,{"$f":"SUM(DT12:DT61)","v":0},null,{"$f":"SUM(DV12:DV61)","v":0},null,{"$f":"SUM(DX12:DX61)","v":0},null,{"$f":"SUM(DZ12:DZ61)","v":0},null,{"$f":"SUM(EB12:EB61)","v":0},null,{"$f":"SUM(ED12:ED61)","v":0},null,{"$f":"SUM(EF12:EF61)","v":0}]
[null,null,"CATEGORIAS",null,"QUANTIDADE"]
[null,null,null,null,null,null,null,null,null,null,null,null,null,null,null,null,{"$f":"IF($C15=Q$11,1,0)","v":0},null,{"$f":"IF($C15=S$11,1,0)","v":0},null,{"$f":"IF($C15=U$11,1,0)","v":0},null,{"$f":"IF($C15=W$11,1,0)","v":0},null,{"$f":"IF($C15=Y$11,1,0)","v":0},null,{"$f":"IF($C15=AA$11,1,0)","v":0},null,{"$f":"IF($C15=AC$11,1,0)","v":0},null,{"$f":"IF($C15=AE$11,1,0)","v":0},null,{"$f":"IF($C15=AG$11,1,0)","v":0},null,{"$f":"IF($C15=AI$11,1,0)","v":0},null,{"$f":"IF($C15=AK$11,1,0)","v":0},null,{"$f":"IF($C15=AM$11,1,0)","v":0},null,{"$f":"IF($C15=AO$11,1,0)","v":0},null,{"$f":"IF($C15=AQ$11,1,0)","v":0},null,{"$f":"IF($C15=AS$11,1,0)","v":0},null,{"$f":"IF($C15=AU$11,1,0)","v":0},null,{"$f":"IF($C15=AW$11,1,0)","v":0},null,{"$f":"IF($C15=AY$11,1,0)","v":0},null,{"$f":"IF($C15=BA$11,1,0)","v":0},null,{"$f":"IF($C15=BC$11,1,0)","v":0},null,{"$f":"IF($C15=BE$11,1,0)","v":0},null,{"$f":"IF($C15=BG$11,1,0)","v":0},null,{"$f":"IF($C15=BI$11,1,0)","v":0},null,{"$f":"IF($C15=BK$11,1,0)","v":0},null,{"$f":"IF($C15=BM$11,1,0)","v":0},null,{"$f":"IF($C15=BO$11,1,0)","v":0},null,{"$f":"IF($C15=BQ$11,1,0)","v":0},null,{"$f":"IF($C15=BS$11,1,0)","v":0},null,{"$f":"IF($C15=BU$11,1,0)","v":0},null,{"$f":"IF($C15=BW$11,1,0)","v":0},null,{"$f":"IF($C15=BY$11,1,0)","v":0},null,{"$f":"IF($C15=CA$11,1,0)","v":0},null,{"$f":"IF($C15=CC$11,1,0)","v":0},null,{"$f":"IF($C15=CE$11,1,0)","v":0},null,{"$f":"IF($C15=CG$11,1,0)","v":0},null,{"$f":"IF($C15=CI$11,1,0)","v":0},null,{"$f":"IF($C15=CK$11,1,0)","v":0},null,{"$f":"IF($C15=CM$11,1,0)","v":0},null,{"$f":"IF($C15=CO$11,1,0)","v":0},null,{"$f":"IF($C15=CQ$11,1,0)","v":0},null,{"$f":"IF($C15=CS$11,1,0)","v":0},null,{"$f":"IF($C15=CU$11,1,0)","v":0},null,{"$f":"IF($C15=CW$11,1,0)","v":0},null,{"$f":"IF($C15=CY$11,1,0)","v":0},null,{"$f":"IF($C15=DA$11,1,0)","v":0},null,{"$f":"IF($C15=DC$11,1,0)","v":0},null,{"$f":"IF($C15=DE$11,1,0)","v":0},null,{"$f":"IF($C15=DG$11,1,0)","v":0},null,{"$f":"IF($C15=DI$11,1,0)","v":0},null,{"$f":"IF($C15=DK$11,1,0)","v":0},null,{"$f":"IF($C15=DM$11,1,0)","v":0},null,{"$f":"IF($C15=DO$11,1,0)","v":0},null,{"$f":"IF($C15=DQ$11,1,0)","v":0},null,{"$f":"IF($C15=DS$11,1,0)","v":0},null,{"$f":"IF($C15=DU$11,1,0)","v":0},null,{"$f":"IF($C15=DW$11,1,0)","v":0},null,{"$f":"IF($C15=DY$11,1,0)","v":0},null,{"$f":"IF($C15=EA$11,1,0)","v":0},null,{"$f":"IF($C15=EC$11,1,0)","v":0},null,{"$f":"IF($C15=EE$11,1,0)","v":0}]
[null,null,null,{"$f":"HLOOKUP($C16,'Dados Gerais'!$D$5:$BK$10,6)","v":{"$error":"#N/A"}},{"$f":"HLOOKUP($C16,'Dados Gerais'!$D$5:$BK$14,10)","v":{"$error":"#N/A"}},null,null,null,null,null,null,null,null,null,null,null,{"$f":"IF($C16=Q$11,1,0)","v":0},null,{"$f":"IF($C16=S$11,1,0)","v":0},null,{"$f":"IF($C16=U$11,1,0)","v":0},null,{"$f":"IF($C16=W$11,1,0)","v":0},null,{"$f":"IF($C16=Y$11,1,0)","v":0},null,{"$f":"IF($C16=AA$11,1,0)","v":0},null,{"$f":"IF($C16=AC$11,1,0)","v":0},null,{"$f":"IF($C16=AE$11,1,0)","v":0},null,{"$f":"IF($C16=AG$11,1,0)","v":0},null,{"$f":"IF($C16=AI$11,1,0)","v":0},null,{"$f":"IF($C16=AK$11,1,0)","v":0},null,{"$f":"IF($C16=AM$11,1,0)","v":0},null,{"$f":"IF($C16=AO$11,1,0)","v":0},null,{"$f":"IF($C16=AQ$11,1,0)","v":0},null,{"$f":"IF($C16=AS$11,1,0)","v":0},null,{"$f":"IF($C16=AU$11,1,0)","v":0},null,{"$f":"IF($C16=AW$11,1,0)","v":0},null,{"$f":"IF($C16=AY$11,1,0)","v":0},null,{"$f":"IF($C16=BA$11,1,0)","v":0},null,{"$f":"IF($C16=BC$11,1,0)","v":0},null,{"$f":"IF($C16=BE$11,1,0)","v":0},null,{"$f":"IF($C16=BG$11,1,0)","v":0},null,{"$f":"IF($C16=BI$11,1,0)","v":0},null,{"$f":"IF($C16=BK$11,1,0)","v":0},null,{"$f":"IF($C16=BM$11,1,0)","v":0},null,{"$f":"IF($C16=BO$11,1,0)","v":0},null,{"$f":"IF($C16=BQ$11,1,0)","v":0},null,{"$f":"IF($C16=BS$11,1,0)","v":0},null,{"$f":"IF($C16=BU$11,1,0)","v":0},null,{"$f":"IF($C16=BW$11,1,0)","v":0},null,{"$f":"IF($C16=BY$11,1,0)","v":0},null,{"$f":"IF($C16=CA$11,1,0)","v":0},null,{"$f":"IF($C16=CC$11,1,0)","v":0},null,{"$f":"IF($C16=CE$11,1,0)","v":0},null,{"$f":"IF($C16=CG$11,1,0)","v":0},null,{"$f":"IF($C16=CI$11,1,0)","v":0},null,{"$f":"IF($C16=CK$11,1,0)","v":0},null,{"$f":"IF($C16=CM$11,1,0)","v":0},null,{"$f":"IF($C16=CO$11,1,0)","v":0},null,{"$f":"IF($C16=CQ$11,1,0)","v":0},null,{"$f":"IF($C16=CS$11,1,0)","v":0},null,{"$f":"IF($C16=CU$11,1,0)","v":0},null,{"$f":"IF($C16=CW$11,1,0)","v":0},null,{"$f":"IF($C16=CY$11,1,0)","v":0},null,{"$f":"IF($C16=DA$11,1,0)","v":0},null,{"$f":"IF($C16=DC$11,1,0)","v":0},null,{"$f":"IF($C16=DE$11,1,0)","v":0},null,{"$f":"IF($C16=DG$11,1,0)","v":0},null,{"$f":"IF($C16=DI$11,1,0)","v":0},null,{"$f":"IF($C16=DK$11,1,0)","v":0},null,{"$f":"IF($C16=DM$11,1,0)","v":0},null,{"$f":"IF($C16=DO$11,1,0)","v":0},null,{"$f":"IF($C16=DQ$11,1,0)","v":0},null,{"$f":"IF($C16=DS$11,1,0)","v":0},null,{"$f":"IF($C16=DU$11,1,0)","v":0},null,{"$f":"IF($C16=DW$11,1,0)","v":0},null,{"$f":"IF($C16=DY$11,1,0)","v":0},null,{"$f":"IF($C16=EA$11,1,0)","v":0},null,{"$f":"IF($C16=EC$11,1,0)","v":0},null,{"$f":"IF($C16=EE$11,1,0)","v":0}]
[null,null,null,null,null,null,null,null,null,null,null,null,null,null,null,null,{"$f":"IF($C17=Q$11,1,0)","v":0},null,{"$f":"IF($C17=S$11,1,0)","v":0},null,{"$f":"IF($C17=U$11,1,0)","v":0},null,{"$f":"IF($C17=W$11,1,0)","v":0},null,{"$f":"IF($C17=Y$11,1,0)","v":0},null,{"$f":"IF($C17=AA$11,1,0)","v":0},null,{"$f":"IF($C17=AC$11,1,0)","v":0},null,{"$f":"IF($C17=AE$11,1,0)","v":0},null,{"$f":"IF($C17=AG$11,1,0)","v":0},null,{"$f":"IF($C17=AI$11,1,0)","v":0},null,{"$f":"IF($C17=AK$11,1,0)","v":0},null,{"$f":"IF($C17=AM$11,1,0)","v":0},null,{"$f":"IF($C17=AO$11,1,0)","v":0},null,{"$f":"IF($C17=AQ$11,1,0)","v":0},null,{"$f":"IF($C17=AS$11,1,0)","v":0},null,{"$f":"IF($C17=AU$11,1,0)","v":0},null,{"$f":"IF($C17=AW$11,1,0)","v":0},null,{"$f":"IF($C17=AY$11,1,0)","v":0},null,{"$f":"IF($C17=BA$11,1,0)","v":0},null,{"$f":"IF($C17=BC$11,1,0)","v":0},null,{"$f":"IF($C17=BE$11,1,0)","v":0},null,{"$f":"IF($C17=BG$11,1,0)","v":0},null,{"$f":"IF($C17=BI$11,1,0)","v":0},null,{"$f":"IF($C17=BK$11,1,0)","v":0},null,{"$f":"IF($C17=BM$11,1,0)","v":0},null,{"$f":"IF($C17=BO$11,1,0)","v":0},null,{"$f":"IF($C17=BQ$11,1,0)","v":0},null,{"$f":"IF($C17=BS$11,1,0)","v":0},null,{"$f":"IF($C17=BU$11,1,0)","v":0},null,{"$f":"IF($C17=BW$11,1,0)","v":0},null,{"$f":"IF($C17=BY$11,1,0)","v":0},null,{"$f":"IF($C17=CA$11,1,0)","v":0},null,{"$f":"IF($C17=CC$11,1,0)","v":0},null,{"$f":"IF($C17=CE$11,1,0)","v":0},null,{"$f":"IF($C17=CG$11,1,0)","v":0},null,{"$f":"IF($C17=CI$11,1,0)","v":0},null,{"$f":"IF($C17=CK$11,1,0)","v":0},null,{"$f":"IF($C17=CM$11,1,0)","v":0},null,{"$f":"IF($C17=CO$11,1,0)","v":0},null,{"$f":"IF($C17=CQ$11,1,0)","v":0},null,{"$f":"IF($C17=CS$11,1,0)","v":0},null,{"$f":"IF($C17=CU$11,1,0)","v":0},null,{"$f":"IF($C17=CW$11,1,0)","v":0},null,{"$f":"IF($C17=CY$11,1,0)","v":0},null,{"$f":"IF($C17=DA$11,1,0)","v":0},null,{"$f":"IF($C17=DC$11,1,0)","v":0},null,{"$f":"IF($C17=DE$11,1,0)","v":0},null,{"$f":"IF($C17=DG$11,1,0)","v":0},null,{"$f":"IF($C17=DI$11,1,0)","v":0},null,{"$f":"IF($C17=DK$11,1,0)","v":0},null,{"$f":"IF($C17=DM$11,1,0)","v":0},null,{"$f":"IF($C17=DO$11,1,0)","v":0},null,{"$f":"IF($C17=DQ$11,1,0)","v":0},null,{"$f":"IF($C17=DS$11,1,0)","v":0},null,{"$f":"IF($C17=DU$11,1,0)","v":0},null,{"$f":"IF($C17=DW$11,1,0)","v":0},null,{"$f":"IF($C17=DY$11,1,0)","v":0},null,{"$f":"IF($C17=EA$11,1,0)","v":0},null,{"$f":"IF($C17=EC$11,1,0)","v":0},null,{"$f":"IF($C17=EE$11,1,0)","v":0}]
[]
[null,null,"PAGAMENTO DA DEPRECIAÇÃO"]
[null,null,"ITEM","DESCRIÇÃO","QUANT ANUAL","CONTA SIAFI","VALOR DE AQ.","% RESIDUAL","VIDA ÚTIL","DEP. MENSAL","CUSTO TOTAL","BDI (%)","PREÇO TOTAL","FONTE","REFERÊNCIA"]
[]
[null,null,null,null,null,null,null,null,null,{"$f":"G22*(1-H22)/(I22*12)","v":{"$error":"#DIV/0!"}},{"$f":"J22*E22","v":{"$error":"#DIV/0!"}},{"$f":"BDI!E26","v":0.21840000000000001},{"$f":"ROUND(K22*(1+L22),2)","v":{"$error":"#DIV/0!"}},"COTAÇÃO"]
[]
[]
[null,null,"PAGAMENTO DA MANUTENÇÃO"]
[null,null,"ITEM","DESCRIÇÃO",null,null,null,"K (calculado)","MENSAL DEPR.","% MAN X DEP","MENSAL MAN.","BDI (%)","PREÇO TOTAL"]
[]
[null,null,null,null,null,null,null,{"$f":"H35","v":0.23950080000000007},{"$f":"M22","v":{"$error":"#DIV/0!"}},{"$f":"H28","v":0.23950080000000007},{"$f":"I28*H28","v":{"$error":"#DIV/0!"}},{"$f":"L22","v":0.21840000000000001},{"$f":"ROUND(K28*(1+L28),2)","v":{"$error":"#DIV/0!"}}]
[]
[null,null,null,null,"K1","K2","K3","K4"]
[null,null,null,null,1,1,0.8,0.8]
[null,null,null,null,"K5","K6","K7","K8"]
[null,null,null,null,1,0.6,0.5,1.1000000000000001]
[null,null,null,null,"K9","K10","K11","RESULTADO"]
[null,null,null,"* a descrição de cada coeficiente segue abaixo",0.9,0.9,1.4,{"$f":"E31*F31*G31*H31*E33*F33*G33*H33*E35*F35*G35","v":0.23950080000000007}]
[]
[]
[null,null,"MATERIAL DE CONSUMO ASSOCIADO"]
[null,null,"ITEM","DESCRIÇÃO",null,null,null,"QUANTID/ANO","UNIDADE","VALOR DE AQ.","MENSAL MAT","BDI (%)","PREÇO TOTAL"]
[]
[null,null,null,null,null,null,null,null,null,null,{"$f":"J41*H41/12","v":0},{"$f":"L28","v":0.21840000000000001},{"$f":"ROUND(K41*(1+L41),2)","v":0}]
[]
[]
[null,null,"MATERIAL DE CONSUMO ASSOCIADO"]
[null,null,"ITEM","DESCRIÇÃO",null,null,null,null,null,null,null,null,"PREÇO TOTAL"]
[]
[null,null,1,"Componente DEPRECIAÇÃO - POR POSTO",null,null,null,null,null,null,null,null,{"$f":"M22","v":{"$error":"#DIV/0!"}}]
[null,null,2,"Componente MANUTENÇÃO - POR POSTO",null,null,null,null,null,null,null,null,{"$f":"M28","v":{"$error":"#DIV/0!"}}]
[null,null,3,"Componente MATERIAL DE CONSUMO ASSOCIADO - POR POSTO",null,null,null,null,null,null,null,null,{"$f":"M41","v":0}]
[]
[null,null,null,null,null,null,null,null,null,null,null,"SOMATÓRIO TOTAL MENSAL - POR POSTO",{"$f":"SUM(M46:M50)","v":{"$error":"#DIV/0!"}},null,null,null,null,{"$f":"IF(SUM(Q$15:Q$17)>0,$M51,0)","v":0},null,{"$f":"IF(SUM(S$15:S$17)>0,$M51,0)","v":0},null,{"$f":"IF(SUM(U$15:U$17)>0,$M51,0)","v":0},null,{"$f":"IF(SUM(W$15:W$17)>0,$M51,0)","v":0},null,{"$f":"IF(SUM(Y$15:Y$17)>0,$M51,0)","v":0},null,{"$f":"IF(SUM(AA$15:AA$17)>0,$M51,0)","v":0},null,{"$f":"IF(SUM(AC$15:AC$17)>0,$M51,0)","v":0},null,{"$f":"IF(SUM(AE$15:AE$17)>0,$M51,0)","v":0},null,{"$f":"IF(SUM(AG$15:AG$17)>0,$M51,0)","v":0},null,{"$f":"IF(SUM(AI$15:AI$17)>0,$M51,0)","v":0},null,{"$f":"IF(SUM(AK$15:AK$17)>0,$M51,0)","v":0},null,{"$f":"IF(SUM(AM$15:AM$17)>0,$M51,0)","v":0},null,{"$f":"IF(SUM(AO$15:AO$17)>0,$M51,0)","v":0},null,{"$f":"IF(SUM(AQ$15:AQ$17)>0,$M51,0)","v":0},null,{"$f":"IF(SUM(AS$15:AS$17)>0,$M51,0)","v":0},null,{"$f":"IF(SUM(AU$15:AU$17)>0,$M51,0)","v":0},null,{"$f":"IF(SUM(AW$15:AW$17)>0,$M51,0)","v":0},null,{"$f":"IF(SUM(AY$15:AY$17)>0,$M51,0)","v":0},null,{"$f":"IF(SUM(BA$15:BA$17)>0,$M51,0)","v":0},null,{"$f":"IF(SUM(BC$15:BC$17)>0,$M51,0)","v":0},null,{"$f":"IF(SUM(BE$15:BE$17)>0,$M51,0)","v":0},null,{"$f":"IF(SUM(BG$15:BG$17)>0,$M51,0)","v":0},null,{"$f":"IF(SUM(BI$15:BI$17)>0,$M51,0)","v":0},null,{"$f":"IF(SUM(BK$15:BK$17)>0,$M51,0)","v":0},null,{"$f":"IF(SUM(BM$15:BM$17)>0,$M51,0)","v":0},null,{"$f":"IF(SUM(BO$15:BO$17)>0,$M51,0)","v":0},null,{"$f":"IF(SUM(BQ$15:BQ$17)>0,$M51,0)","v":0},null,{"$f":"IF(SUM(BS$15:BS$17)>0,$M51,0)","v":0},null,{"$f":"IF(SUM(BU$15:BU$17)>0,$M51,0)","v":0},null,{"$f":"IF(SUM(BW$15:BW$17)>0,$M51,0)","v":0},null,{"$f":"IF(SUM(BY$15:BY$17)>0,$M51,0)","v":0},null,{"$f":"IF(SUM(CA$15:CA$17)>0,$M51,0)","v":0},null,{"$f":"IF(SUM(CC$15:CC$17)>0,$M51,0)","v":0},null,{"$f":"IF(SUM(CE$15:CE$17)>0,$M51,0)","v":0},null,{"$f":"IF(SUM(CG$15:CG$17)>0,$M51,0)","v":0},null,{"$f":"IF(SUM(CI$15:CI$17)>0,$M51,0)","v":0},null,{"$f":"IF(SUM(CK$15:CK$17)>0,$M51,0)","v":0},null,{"$f":"IF(SUM(CM$15:CM$17)>0,$M51,0)","v":0},null,{"$f":"IF(SUM(CO$15:CO$17)>0,$M51,0)","v":0},null,{"$f":"IF(SUM(CQ$15:CQ$17)>0,$M51,0)","v":0},null,{"$f":"IF(SUM(CS$15:CS$17)>0,$M51,0)","v":0},null,{"$f":"IF(SUM(CU$15:CU$17)>0,$M51,0)","v":0},null,{"$f":"IF(SUM(CW$15:CW$17)>0,$M51,0)","v":0},null,{"$f":"IF(SUM(CY$15:CY$17)>0,$M51,0)","v":0},null,{"$f":"IF(SUM(DA$15:DA$17)>0,$M51,0)","v":0},null,{"$f":"IF(SUM(DC$15:DC$17)>0,$M51,0)","v":0},null,{"$f":"IF(SUM(DE$15:DE$17)>0,$M51,0)","v":0},null,{"$f":"IF(SUM(DG$15:DG$17)>0,$M51,0)","v":0},null,{"$f":"IF(SUM(DI$15:DI$17)>0,$M51,0)","v":0},null,{"$f":"IF(SUM(DK$15:DK$17)>0,$M51,0)","v":0},null,{"$f":"IF(SUM(DM$15:DM$17)>0,$M51,0)","v":0},null,{"$f":"IF(SUM(DO$15:DO$17)>0,$M51,0)","v":0},null,{"$f":"IF(SUM(DQ$15:DQ$17)>0,$M51,0)","v":0},null,{"$f":"IF(SUM(DS$15:DS$17)>0,$M51,0)","v":0},null,{"$f":"IF(SUM(DU$15:DU$17)>0,$M51,0)","v":0},null,{"$f":"IF(SUM(DW$15:DW$17)>0,$M51,0)","v":0},null,{"$f":"IF(SUM(DY$15:DY$17)>0,$M51,0)","v":0},null,{"$f":"IF(SUM(EA$15:EA$17)>0,$M51,0)","v":0},null,{"$f":"IF(SUM(EC$15:EC$17)>0,$M51,0)","v":0},null,{"$f":"IF(SUM(EE$15:EE$17)>0,$M51,0)","v":0}]
[null,null,null,null,null,null,null,null,null,null,null,"SOMATÓRIO TOTAL ANUAL - POR POSTO",{"$f":"M51*12","v":{"$error":"#DIV/0!"}}]
[]
[]
[null,null,"MATERIAL DE CONSUMO ASSOCIADO"]
[null,null,"MEMÓRIA DE CÁLCULO DO COEFICIENTE DE CORRELAÇÃO MANUTENÇÃO X DEPRECIAÇÃO (K)"]
[]
[null,null,"JUSTIFICATIVAS",null,"TIPO","K1",null,"Condições de Trab","K4",null,"Tempo Vida (anos)","K6",null,"Temperatura","K8"]
[null,null,null,null,"Guindaste",0.5,null,"Em espera",0.4,null,1,0.6,null,"Muito quente (> 40º C)",1.3]
[null,null,"K1","Arbitrado 1","Caminhão-comum",0.8,null,"Leves",0.8,null,2,0.7,null,"Quente (30º a 40º C)",1.1000000000000001]
[null,null,"K2","Considerado o operador médio","Fora-de-estrada",1,null,"Médias",1,null,3,0.8,null,"Médio (10º a 30º C)",1]
[null,null,"K3","Consideradas ferramentas de primeira qualidade","Carregadeira",1,null,"Pesadas",1.4,null,4,0.9,null,"Frio (< 10º C)",1.2]
[null,null,"K4","Consições leves","Escavadeira",1.4,null,"Severas",2,null,5,1]
[null,null,"K5","Considerando manutenção normal","Motoescrêiper",1.1000000000000001,null,null,null,null,6,1,null,"Ritmo de Trabalho","K9"]
[null,null,"K6","Equipamentos novos","Trator de esteira",1.2,null,"Manutenção","K5",null,7,1,null,"Folgado",0.9]
[null,null,"K7","220h por mês, 252 dias por ano",null,null,null,"Excelente",0.6,null,8,1.2,null,"Médio ",1]
[null,null,"K8","Clima quente, acima de 30º C","Qualid do Operador","K2",null,"Boa",0.8,null,9,1.3,null,"Com pressa",1.5]
[null,null,"K9","Ritmo de trabalho usualmente folgado","Excelente",0.8,null,"Média",1,null,10,1.4]
[null,null,"K10","Considerado o operador médio","Boa",0.9,null,"Ruim ",1.5,null,11,2,null,"Conh do Serviço","K10"]
[null,null,"K11","Foi considerada a opção de aluguel a terceiros, ainda que a simulação seja dos custos do contratado, contudo a execução dos serviços é em local de terceiros","Média",1,null,"Inexistente",3,null,15,2,null,"Grande ",0.8]
[null,null,null,null,"Ruim",1.2,null,null,null,null,null,null,null,"Médio     ",0.9]
[null,null,null,null,"Péssima",2,null,"Horas de Uso ","K7",6000,1,null,null,"Pouco ",1]
[null,null,null,null,null,null,null,1000,0.5,8000,1.3]
[null,null,null,null,"Qualidade do Equip","K3",null,2000,0.5,10000,1.6,null,null,"Tipo do Serviço","K11"]
[null,null,null,null,"De primeira",0.8,null,3000,0.6,12000,1.9,null,null,"Mina ou Pedreira",0.8]
[null,null,null,null,"Média",1,null,4000,0.7,15000,2.2999999999999998,null,null,"Construção Geral",1]
[null,null,null,null,"Ruim",1.5,null,5000,0.9,20000,3,null,null,"Aluguel a Terceiros",1.4]
[]
[null,null,null,null,"Fonte: "]
[null,null,null,null,"MATTOS, Aldo Dórea. Como preparar orçamentos de obras. São Paulo: Pini, 2006. 281 p., il"]

{"sheet":"Não Rel - Depr","index":21,"n_rows":92,"n_cols":15,"rows_kept":92,"cut":false,"hidden":false,"merged":[[2,1,2,3],[3,1,3,14]]}
[]
[]
[]
[null,"EQUIPAMENTOS NÃO RELACIONADOS DIRETAMENTE A UM POSTO DE TRABALHO - PAGAMENTO DA DEPRECIAÇÃO / MANUTENÇÃO"]
[]
[]
[null,null,"PAGAMENTO DA DEPRECIAÇÃO"]
[null,null,"ITEM","DESCRIÇÃO","QUANT ANUAL","CONTA SIAFI","VALOR DE AQ.","% RESIDUAL","VIDA ÚTIL","DEP. MENSAL","CUSTO TOTAL","BDI (%)","PREÇO TOTAL","FONTE","REFERÊNCIA"]
[]
[null,null,1,"Aspirador com elemento filtrante a base de combinação do separador com água (Ref. Pró-Áqua ou outro de desempenho e qualidade similar ou superior)",4,"12311.01.25",519.54999999999995,0.1,10,{"$f":"G10*(1-H10)/(I10*12)","v":3.8966249999999998},{"$f":"J10*E10","v":15.586499999999999},{"$f":"BDI!$E$26","v":0.21840000000000001},{"$f":"ROUND(K10*(1+L10),2)","v":18.989999999999998},"COTAÇÃO"]
[null,null,2,"Aspirador doméstico pequeno (ref. Eletrolux GT 2200 ou Leo da Soteco 12000 W ou outro de desempenho e qualidade similar ou superior)",4,"12311.01.25",1809.95,0.1,10,13.574625000000001,54.298500000000004,{"$f":"BDI!$E$26","v":0.21840000000000001},66.16,"COTAÇÃO"]
[null,null,3,"Aspirador industrial e (ref. Eletrolux GT 3000 PRO ou A280 da Soteco)",5,"12311.01.25",4007.45,0.1,10,30.055875,150.27937500000002,{"$f":"BDI!$E$26","v":0.21840000000000001},183.1,"COTAÇÃO"]
[null,null,4,"Cabo Extensor 06 metros, (ref. Braslimpia EX 600 ou outro de desempenho e qualidade similar ou superior)",7,"12311.01.25",202.86,0.1,10,1.5214500000000002,10.650150000000002,{"$f":"BDI!$E$26","v":0.21840000000000001},12.98,"COTAÇÃO"]
[null,null,5,"Carrinho funcional para limpeza, com sacos para (ref. TTS 380  S,  completo ou Tomki\n1021 ou outro de desempenho e qualidade similar ou superior)",20,"12311.01.25",3000.9,0.1,10,22.50675,450.13499999999999,{"$f":"BDI!$E$26","v":0.21840000000000001},548.44000000000005,"COTAÇÃO"]
[null,null,6,"Carro contêiner para coleta de lixo cap. 120 litros, c/ 02 rodízios pneumáticos (ref. Soluvan ou Contenur ou rubbermaid ou fiberglass ou outro de desempenho e qualidade similar\nou superior)",3,"12311.01.25",254.45,0.1,10,1.9083749999999999,5.7251250000000002,{"$f":"BDI!$E$26","v":0.21840000000000001},6.98,"COTAÇÃO"]
[null,null,7,"Carro contêiner para transporte de lixo cap. 600 litros com 04 rodízios pneumáticos (ref. Contenur, Soluvan, rubbermaid ou fiberglass ou outro de desempenho e qualidade similar ou superior)",5,"12311.01.25",2588.7449999999999,0.1,10,19.415587500000001,97.077937500000004,{"$f":"BDI!$E$26","v":0.21840000000000001},118.28,"COTAÇÃO"]
[null,null,8,"Carro contêiner cor branca, para coleta de lixo hospitalar, cap. 120 litros, c/ 02 rodízios pneumáticos (ref. Pead MGB da Contenur ou outro de desempenho e qualidade similar ou superior)",3,"12311.01.25",230,0.1,10,1.7250000000000001,5.1750000000000007,{"$f":"BDI!$E$26","v":0.21840000000000001},6.31,"COTAÇÃO"]
[null,null,9,"Carro contêiner cor branca, para coleta de lixo hospitalar, cap. 240 litros, c/ 02 rodízios giratórios (ref. Fiberglass, Contenur ou outro de desempenho e qualidade similar ou superior)",2,"12311.01.25",391.79499999999996,0.1,10,2.9384625,5.876925,{"$f":"BDI!$E$26","v":0.21840000000000001},7.16,"COTAÇÃO"]
[null,null,10,"Enceradeira doméstica (Ref. Eletrolux b61 ou outro de desempenho e qualidade similar ou superior)",1,"12311.01.25",634.4,0.1,10,4.758,4.758,{"$f":"BDI!$E$26","v":0.21840000000000001},5.8,"COTAÇÃO"]
[null,null,11,"Enceradeira industrial grande 410 mm (ref. Bandeirante, Karcher, ou Cleaner ou outro de desempenho e qualidade similar ou superior)",15,"12311.01.25",2781,0.1,10,20.857500000000002,312.86250000000001,{"$f":"BDI!$E$26","v":0.21840000000000001},381.19,"COTAÇÃO"]
[null,null,12,"Enceradeira industrial grande 510 mm (ref. Bandeirante, Karcher, ou Cleaner ou outro de desempenho e qualidade similar ou superior)",10,"12311.01.25",2971.5,0.1,10,{"$f":"G21*(1-H21)/(I21*12)","v":22.286249999999999},{"$f":"J21*E21","v":222.86249999999998},{"$f":"BDI!$E$26","v":0.21840000000000001},{"$f":"ROUND(K21*(1+L21),2)","v":271.54000000000002},"COTAÇÃO"]
[null,null,13,"Enceradeira industrial pequena 350 mm (ref. Bandeirante, Karcher, ou Cleaner ou outro de desempenho e qualidade similar ou superior)",2,"12311.01.25",2252.125,0.1,10,16.8909375,33.781874999999999,{"$f":"BDI!$E$26","v":0.21840000000000001},41.16,"COTAÇÃO"]
[null,null,14,"Escada em com 04 degraus (ref. Aluleve ou Artfactory ou outro de desempenho e qualidade similar ou superior)",5,"12311.01.25",171.215,0.1,10,1.2841125,6.4205625,{"$f":"BDI!$E$26","v":0.21840000000000001},7.82,"COTAÇÃO"]
[null,null,15,"Escada em alumínio com 06 degraus (ref Aluleve ou Artfactory ou outro de desempenho e qualidade similar ou superior)",3,"12311.01.25",208.535,0.1,10,1.5640125,4.6920374999999996,{"$f":"BDI!$E$26","v":0.21840000000000001},5.72,"COTAÇÃO"]
[null,null,16,"Escada em alumínio com 16 degraus (ref. Aluleve ou Artfactory)",1,"12311.01.25",585.64499999999998,0.1,10,4.3923375,4.3923375,{"$f":"BDI!$E$26","v":0.21840000000000001},5.35,"COTAÇÃO"]
[null,null,17,"Lavadora de alta pressão (ref. Wap L2600 ou L2800 ou Eletrolux L2400 ou outro de desempenho e qualidade similar ou superior)",2,"12311.01.25",12149.365,0.1,10,91.120237500000002,182.240475,{"$f":"BDI!$E$26","v":0.21840000000000001},222.04,"COTAÇÃO"]
[null,null,18,"Lavadora e secadora automática de pisos, semi-tracionária, movida a bateria (ref. Plataforma LST-51B, Johnson Diversey Aquamat 45 ou Comac Simpla E/45B ou outro de desempenho e qualidade similar ou superior)",2,"12311.01.25",26015.635000000002,0.1,10,195.11726250000001,390.23452500000002,{"$f":"BDI!$E$26","v":0.21840000000000001},475.46,"COTAÇÃO"]
[null,null,19,"Lavadora extratora para carpete tanque expansível 38 litros (ref. Tennant Lavadora 1240 ou outro de desempenho e qualidade similar ou superior)",2,"12311.01.25",2440.9349999999999,0.1,10,18.307012499999999,36.614024999999998,{"$f":"BDI!$E$26","v":0.21840000000000001},44.61,"COTAÇÃO"]
[null,null,20,"Limpadora a vapor de aquecimento rápido (ref. SKY VAP MAX ou Karcher ou outro de desempenho e qualidade similar ou superior)",8,"12311.01.25",1082.8399999999999,0.1,10,8.1212999999999997,64.970399999999998,{"$f":"BDI!$E$26","v":0.21840000000000001},79.16,"COTAÇÃO"]
[null,null,21,"Limpadora extratora para carpete (ref. Eletrolux Extracar 5002 Pro)",2,"12311.01.25",3496.91,0.1,10,26.226825000000002,52.453650000000003,{"$f":"BDI!$E$26","v":0.21840000000000001},63.91,"COTAÇÃO"]
[null,null,22,"Lustradora Ultra Speed (ref. Platinum UHS 1600 da Plataforma ou outro de desempenho e qualidade similar ou superior)",3,"12311.01.25",7006,0.1,10,52.545000000000002,157.63499999999999,{"$f":"BDI!$E$26","v":0.21840000000000001},192.06,"COTAÇÃO"]
[null,null,23,"Mini Kit Limpa-vidros combinado com guia removível, raspadores, luvas para lavagem e cabos de alumínio montáveis (ref. Bralimpia KT 900 ou outro de desempenho e qualidade similar ou superior)",10,"12311.01.25",174.57,0.1,10,1.309275,13.092749999999999,{"$f":"BDI!$E$26","v":0.21840000000000001},15.95,"COTAÇÃO"]
[null,null,24,"Rodo aspirador p/ pisos (ref. Floor VAC 1500 da Wap ou outro de desempenho e qualidade similar ou superior)",2,"12311.01.25",1861.9450000000002,0.1,10,13.9645875,27.929175000000001,{"$f":"BDI!$E$26","v":0.21840000000000001},34.03,"COTAÇÃO"]
[null,null,25,"Varredora coletora para estacionamento (ref. Eureka Picobello 151 ou Karcher T500 ou outro de desempenho e qualidade similar ou superior)",2,"12311.01.25",15462.385000000002,0.1,10,115.96788750000002,231.93577500000004,{"$f":"BDI!$E$26","v":0.21840000000000001},282.58999999999997,"COTAÇÃO"]
[]
[]
[null,null,"PAGAMENTO DA MANUTENÇÃO"]
[null,null,"ITEM","DESCRIÇÃO",null,null,null,"K (calculado)","MENSAL DEPR.","% MAN X DEP","MENSAL MAN.","BDI (%)","PREÇO TOTAL"]
[]
[null,null,null,null,null,null,null,{"$f":"H47","v":0.42411600000000005},{"$f":"SUM(M10:M34)","v":3096.7899999999995},{"$f":"H40","v":0.42411600000000005},{"$f":"I40*H40","v":1313.3981876399998},{"$f":"BDI!E26","v":0.21840000000000001},{"$f":"ROUND(K40*(1+L40),2)","v":1600.24}]
[]
[null,null,null,null,"K1","K2","K3","K4"]
[null,null,null,null,0.85,1,0.8,1]
[null,null,null,null,"K5","K6","K7","K8"]
[null,null,null,null,1,0.6,0.5,1.1000000000000001]
[null,null,null,null,"K9","K10","K11","RESULTADO"]
[null,null,null,"* a descrição de cada coeficiente segue abaixo",1.5,0.9,1.4,{"$f":"E43*F43*G43*H43*E45*F45*G45*H45*E47*F47*G47","v":0.42411600000000005}]
[]
[]
[null,null,"MATERIAL DE CONSUMO ASSOCIADO"]
[null,null,"ITEM","DESCRIÇÃO",null,null,null,"QUANTID/ANO","UNIDADE","VALOR DE AQ.","MENSAL MAT","BDI (%)","PREÇO TOTAL"]
[]
[null,null,null,null,null,null,null,null,null,null,{"$f":"J53*H53/12","v":0},{"$f":"BDI!E26","v":0.21840000000000001},{"$f":"ROUND(K53*(1+L53),2)","v":0}]
[]
[]
[null,null,"MATERIAL DE CONSUMO ASSOCIADO"]
[null,null,"ITEM","DESCRIÇÃO",null,null,null,null,null,null,null,null,"PREÇO TOTAL"]
[]
[null,null,1,"Componente DEPRECIAÇÃO",null,null,null,null,null,null,null,null,{"$f":"I40","v":3096.7899999999995}]
[null,null,2,"Componente MANUTENÇÃO",null,null,null,null,null,null,null,null,{"$f":"M40","v":1600.24}]
[null,null,3,"Componente MATERIAL DE CONSUMO ASSOCIADO",null,null,null,null,null,null,null,null,{"$f":"M53","v":0}]
[]
[null,null,null,null,null,null,null,null,null,null,null,"SOMATÓRIO TOTAL MENSAL",{"$f":"SUM(M58:M62)","v":4697.03}]
[null,null,null,null,null,null,null,null,null,null,null,"SOMATÓRIO TOTAL ANUAL",{"$f":"M63*12","v":56364.36}]
[]
[]
[null,null,"MATERIAL DE CONSUMO ASSOCIADO"]
[null,null,"MEMÓRIA DE CÁLCULO DO COEFICIENTE DE CORRELAÇÃO MANUTENÇÃO X DEPRECIAÇÃO (K)"]
[]
[null,null,"JUSTIFICATIVAS",null,"TIPO","K1",null,"Condições de Trab","K4",null,"Tempo Vida (anos)","K6",null,"Temperatura","K8"]
[null,null,null,null,"Guindaste",0.5,null,"Em espera",0.4,null,1,0.6,null,"Muito quente (> 40º C)",1.3]
[null,null,"K1","Considerado o valor médio de 0,85","Caminhão-comum",0.8,null,"Leves",0.8,null,2,0.7,null,"Quente (30º a 40º C)",1.1000000000000001]
[null,null,"K2","Considerado o operador médio","Fora-de-estrada",1,null,"Médias",1,null,3,0.8,null,"Médio (10º a 30º C)",1]
[null,null,"K3","Consideradas ferramentas de primeira qualidade","Carregadeira",1,null,"Pesadas",1.4,null,4,0.9,null,"Frio (< 10º C)",1.2]
[null,null,"K4","Há todo o tipo de trabalho, foi considerado o valor médio","Escavadeira",1.4,null,"Severas",2,null,5,1]
[null,null,"K5","Considerando manutenção normal","Motoescrêiper",1.1000000000000001,null,null,null,null,6,1,null,"Ritmo de Trabalho","K9"]
[null,null,"K6","Equipamentos novos","Trator de esteira",1.2,null,"Manutenção","K5",null,7,1,null,"Folgado",0.9]
[null,null,"K7","220h por mês, 252 dias por ano",null,null,null,"Excelente",0.6,null,8,1.2,null,"Médio ",1]
[null,null,"K8","Clima quente, acima de 30º C","Qualid do Operador","K2",null,"Boa",0.8,null,9,1.3,null,"Com pressa",1.5]
[null,null,"K9","Ritmo de trabalho usualmente com pressa","Excelente",0.8,null,"Média",1,null,10,1.4]
[null,null,"K10","Considerado o operador médio","Boa",0.9,null,"Ruim ",1.5,null,11,2,null,"Conh do Serviço","K10"]
[null,null,"K11","Foi considerada a opção de aluguel a terceiros, ainda que a simulação seja dos custos do contratado, contudo a execução dos serviços é em local de terceiros","Média",1,null,"Inexistente",3,null,15,2,null,"Grande ",0.8]
[null,null,null,null,"Ruim",1.2,null,null,null,null,null,null,null,"Médio     ",0.9]
[null,null,null,null,"Péssima",2,null,"Horas de Uso ","K7",6000,1,null,null,"Pouco ",1]
[null,null,null,null,null,null,null,1000,0.5,8000,1.3]
[null,null,null,null,"Qualidade do Equip","K3",null,2000,0.5,10000,1.6,null,null,"Tipo do Serviço","K11"]
[null,null,null,null,"De primeira",0.8,null,3000,0.6,12000,1.9,null,null,"Mina ou Pedreira",0.8]
[null,null,null,null,"Média",1,null,4000,0.7,15000,2.2999999999999998,null,null,"Construção Geral",1]
[null,null,null,null,"Ruim",1.5,null,5000,0.9,20000,3,null,null,"Aluguel a Terceiros",1.4]
[]
[null,null,null,null,"Fonte: "]
[null,null,null,null,"MATTOS, Aldo Dórea. Como preparar orçamentos de obras. São Paulo: Pini, 2006. 281 p., il"]

{"sheet":"Não Rel - Mat Consumo","index":22,"n_rows":57,"n_cols":14,"rows_kept":57,"cut":false,"hidden":false,"merged":[[2,1,2,4],[3,1,3,13]]}
[]
[]
[]
[null,"MATERIAIS NÃO RELACIONADOS DIRETAMENTE A UM POSTO DE TRABALHO - AQUISIÇÃO SOB DEMANDA"]
[]
[]
[null,null,"ITEM","CÓDIGO","DESCRIÇÃO","MÉDIA CONSUMO MENSAL","QUANT ANUAL","UNIDADE","CUSTO UNITÁRIO","CUSTO TOTAL","BDI (%)","PREÇO TOTAL","FONTE","REFERÊNCIA"]
[]
[null,null,1,null,"Água Sanitária",156,{"$f":"F9*12","v":1872},"Litros",2.8233333333333337,{"$f":"I9*G9","v":5285.2800000000007},{"$f":"BDI!E26","v":0.21840000000000001},{"$f":"ROUND(J9*(1+K9),2)","v":6439.59},"Cotação"]
[null,null,2,null,"Álcool líquido com teor ativo 70 %",240,{"$f":"F10*12","v":2880},"Litros",8.0150000000000006,{"$f":"I10*G10","v":23083.200000000001},{"$f":"K9","v":0.21840000000000001},{"$f":"ROUND(J10*(1+K10),2)","v":28124.57},"Cotação"]
[null,null,3,null,"Brilho Inox em Spray à base de óleo mineral e emulsão de silicone (ref: 3M ou outro de desempenho e qualidade similar)",4,48,"Frasco de 500 ml",9.5850000000000009,460.08000000000004,{"$f":"K10","v":0.21840000000000001},560.55999999999995,"Cotação"]
[null,null,4,null,"Cloro Granulado (balde de 10 kg)",1,12,"Balde",287.45,3449.3999999999996,0.21840000000000001,4202.75,"Cotação"]
[null,null,5,null,"Desinfetante Alcalino p/ Limpeza Geral , diluição 1/100 (ref. Bryo Plus da Inglesa ou outro de desempenho e qualidade similar)",40,480,"Galão de 5 litros",12.95,6216,0.21840000000000001,7573.57,"Cotação"]
[null,null,6,null,"Desinfetante hospitalar Mirax Oxy a base de Peroxido de Hidrogênio e Quaternário de amônio (5ºGeração) (ref., Renko, diluição 1/100, ou outro de desempenho e qualidade similar)",2,24,"Galão de 5 litros",91.9,2205.6000000000004,0.21840000000000001,2687.3,"Cotação"]
[null,null,7,null,"Desinfetante hospitalar – Mult Germ 200 – 1/200 – (ref. Multquímica ou outro de desempenho e qualidade similar)",2,24,"Galão de 5 litros",113.45,2722.8,0.21840000000000001,3317.46,"Cotação"]
[null,null,8,null,"Desodorizante frasco 400 ml (ref. Bom Ar, Domline, No Ar da Bombril ou outro de desempenho e qualidade similar)",30,360,"Frasco de 400 ml",9.4450000000000003,3400.2000000000003,0.21840000000000001,4142.8,"Cotação"]
[null,null,9,null,"Detergente líquido neutro (ref. Bryo Plus, diluição 1/100, Inglesa ou outro de desempenho e qualidade similar)",24,288,"Galão de 5 litros",18.690000000000001,5382.72,0.21840000000000001,6558.31,"Cotação"]
[null,null,10,null,"Disco Removível p/ enceradeira 350 mm (preto, verde, vermelho, amarelo e branco) (ref: 3m ou outro de desempenho e qualidade similar)",8,96,"Unidade",18.329999999999998,1759.6799999999998,0.21840000000000001,2143.9899999999998,"Cotação"]
[null,null,11,null,"Disco Bonnet Certec Sintético – 430 mm – para lavagem de carpete",2,24,"Unidade",27.425000000000001,658.2,0.21840000000000001,801.95,"Cotação"]
[null,null,12,null,"Disco p/ Polidora High Speed, polidor, restauradora para retirada de marcas, de fibra natural, 510 mm (ref. 3M – pêlo de porco – Restaurador)",8,96,"Unidade",50.916666666666664,4888,0.21840000000000001,5955.54,"Cotação"]
[null,null,13,null,"Disco para enceradeira restaurador para mármore 510mm Cor roxo. (ref: 3M)",8,96,"Unidade",294.53999999999996,28275.839999999997,0.21840000000000001,34451.279999999999,"Cotação"]
[null,null,14,null,"Disco removível para enceradeira, 410mm, (preto, verde, vermelho, amarelo e branco) (ref: 3m ou outro de desempenho e qualidade similar)",30,360,"Unidade",25.945,9340.2000000000007,0.21840000000000001,11380.1,"Cotação"]
[null,null,15,null,"Disco removível para enceradeira, 510mm, (preto, verde, vermelho, amarelo e branco) (ref: 3m ou outro de desempenho e qualidade similar ou superior)",20,240,"Unidade",40.424999999999997,9702,0.21840000000000001,11820.92,"Cotação"]
[null,null,16,null,"Escova de Nylon multiuso Manual, 13x6,5 cm fibra de aprox. 2,5 cm",10,120,"Unidade",3.34,400.79999999999995,0.21840000000000001,488.33,"Cotação"]
[null,null,17,null,"Esponja de Aço 60g (ref. Bombril, Assolan ou outro de desempenho e qualidade similar ou superior)",120,1440,"Unidade",1.75,2520,0.21840000000000001,3070.37,"Cotação"]
[null,null,18,null,"Esponja Dupla Face (ref: 3M ou similar)",220,2640,"Unidade",0.74833333333333329,1975.6,0.21840000000000001,2407.0700000000002,"Cotação"]
[null,null,19,null,"Fita Adesiva Transparente Para Empacotamento e uso Geral 48mm X 100m (ref. 3M, Scotch Brite Johnson ou outro de desempenho e qualidade similar ou superior)",2,24,"Unidade",11.15,267.60000000000002,0.21840000000000001,326.04000000000002,"Cotação"]
[null,null,20,null,"Fita dupla face de silicone para instalação, largura de 19 mm, rolo com 20m",5,60,"Unidade",66.900000000000006,4014.0000000000005,0.21840000000000001,4890.66,"Cotação"]
[null,null,21,null,"Flanela em Peça, 40x60 cm (ref. Copalimpa, star ou outro de desempenho e qualidade similar ou superior)",144,1728,"Unidade",1.7283333333333335,2986.5600000000004,0.21840000000000001,3638.82,"Cotação"]
[null,null,22,null,"Hipoclorito de Sódio 12% ativo líquido concentrado (ref. START ou outro de desempenho e qualidade similar ou superior)",8,96,"Galão de 5 litros",16.14,1549.44,0.21840000000000001,1887.84,"Cotação"]
[null,null,23,null,"Impermeabilizante acrílico metalizado (ref. Traffic HS - Johnson ou outro de desempenho e qualidade similar ou superior)",50,600,"Galão de 5 litros",110.36,66216,0.21840000000000001,80677.570000000007,"Cotação"]
[null,null,24,null,"Limpa Carpete Diluível 1/20 – (ref. Briosol ou ZAZ, ou outro de desempenho e qualidade similar ou superior)",5,60,"Galão de 5 litros",69.484999999999999,4169.1000000000004,0.21840000000000001,5079.63,"Cotação"]
[null,null,25,null,"Limpa Vidros (ref. Start ou outro de desempenho e qualidade similar ou superior)",40,480,"Frasco de 500 ml",2.9350000000000001,1408.8,0.21840000000000001,1716.48,"Cotação"]
[null,null,26,null,"Limpador multiuso diluível 1/ 20 – 500 ml (ref. Ajax fresh ou outro de desempenho e qualidade similar ou superior)",10,120,"Caixa de 12 unid",34.623333333333328,4154.7999999999993,0.21840000000000001,5062.21,"Cotação"]
[null,null,27,null,"Lustra Móveis (ref. worker ou outro de desempenho e qualidade similar ou superior)",50,600,"Frasco de 250 ml",6.87,4122,0.21840000000000001,5022.24,"Cotação"]
[null,null,28,null,"Papel higiênico Interfolhado - caixa com 12.000 folhas, folha dupla, tamanho 21,6 x 11,00 cm (ref. Inovata ou outro de desempenho e qualidade similar ou superior)",250,3000,"Caixa ",143.13499999999999,429405,0.21840000000000001,523187.05,"Cotação"]
[null,null,29,null,"Papel toalha interfolhado, caixa com 2.400 folhas, folha dupla, tamanho 23 x 20 cm (ref. Inovata, Santher ou outro de desempenho e qualidade similar ou superior)",900,10800,"Caixa",85.245000000000005,920646,0.21840000000000001,1121715.0900000001,"Cotação"]
[null,null,30,null,"Tela Sanitária floral (Ref. Zupp, Sany Mix ou outro de desempenho e qualidade similar ou superior)",5,60,"Caixa de 60 unid",221.7,13302,0.21840000000000001,16207.16,"Cotação"]
[null,null,31,null,"Polidor para Metais (ref. silvo ou similar)",1,{"$f":"F39*12","v":12},"Frasco de 200 ml",37.07,{"$f":"I39*G39","v":444.84000000000003},0.21840000000000001,{"$f":"ROUND(J39*(1+K39),2)","v":541.99},"Cotação"]
[null,null,32,null,"Removedor de alta performance com embalagem tipo Bico de Pato” para uso sanitário (ref. pato Purific - ou outro de desempenho e qualidade similar ou superior)",20,240,"Frasco de 500 ml",13.350000000000001,3204.0000000000005,0.21840000000000001,3903.75,"Cotação"]
[null,null,33,null,"Removedor para piso impermeabilizado (ref. Jato da Johnson Diversey, Start ou outro de desempenho e qualidade similar ou superior)",20,240,"Galão de 5 litros",39.4,9456,0.21840000000000001,11521.19,"Cotação"]
[null,null,34,null,"Restaurador Sistema Metalic HS, Metalic 40 (diluível até ¼) (ref. Indeba, Johnson ou outro de desempenho e qualidade similar ou superior)",5,60,"Galão de 5 litros",138.5,{"$f":"I42*G42","v":8310},0.21840000000000001,{"$f":"ROUND(J42*(1+K42),2)","v":10124.9},"Cotação"]
[null,null,35,null,"Sabão de Coco - 100 g",80,960,"Pacote de 5 Unid",15.664999999999999,{"$f":"I43*G43","v":15038.4},0.21840000000000001,{"$f":"ROUND(J43*(1+K43),2)","v":18322.79},"Cotação"]
[null,null,36,null,"Sabão em pó",10,120,"Caixa de 1 Kg",6.875,825,0.21840000000000001,1005.18,"Cotação"]
[null,null,37,null,"Sabonete líquido Nobla perolizado 5 litros (ref. Johnson, ZAZ ou outro de desempenho e qualidade similar ou superior)",80,960,"Galão de 5 litros",33.414999999999999,32078.399999999998,0.21840000000000001,39084.32,"Cotação"]
[null,null,38,null,"Saco de pano para Limpeza – tam 1,00 x 0,60 m (ref. Star Textil ou outro de desempenho e qualidade similar ou superior)",200,2400,"Unidade",4.62,11088,0.21840000000000001,13509.62,"Cotação"]
[null,null,39,null,"Saco plástico azul p/ lixo 100 litros",5000,60000,"Unidade",0.82400000000000007,49440.000000000007,0.21840000000000001,60237.7,"Cotação"]
[null,null,40,null,"Saco plástico leitoso infect. para lixo hospitalar 100 litros",1000,12000,"Unidade",0.74,8880,0.21840000000000001,10819.39,"Cotação"]
[null,null,41,null,"Saco plástico leitoso infect. para lixo hospitalar 40 litros",1500,18000,"Unidade",0.26,4680,0.21840000000000001,5702.11,"Cotação"]
[null,null,42,null,"Saco plástico preto p/ lixo 100 litros",12000,144000,"Unidade",0.64399999999999991,92735.999999999985,0.21840000000000001,112989.54,"Cotação"]
[null,null,43,null,"Saco plástico preto p/ lixo 40 litros",8000,96000,"Unidade",0.20500000000000002,{"$f":"I51*G51","v":19680},0.21840000000000001,{"$f":"ROUND(J51*(1+K51),2)","v":23978.11},"Cotação"]
[null,null,44,null,"Saco plástico vermelho para lixo 100 litros",8000,96000,"Unidade",0.82400000000000007,{"$f":"I52*G52","v":79104},0.21840000000000001,{"$f":"ROUND(J52*(1+K52),2)","v":96380.31},"Cotação"]
[null,null,45,null,"Saco plástico vermelho para lixo 40 litros",1500,18000,"Unidade",0.255,4590,0.21840000000000001,5592.46,"Cotação"]
[null,null,46,null,"Sapólio liquido (ref. Zupp, Bombril ou similar)",12,144,"Galão de 5 litros",59.94,8631.36,0.21840000000000001,10516.45,"Cotação"]
[]
[null,null,null,null,null,null,null,null,null,null,"SOMATÓRIO TOTAL MENSAL",{"$f":"L57/12","v":194147.255}]
[null,null,null,null,null,null,null,null,null,null,"SOMATÓRIO TOTAL ANUAL",{"$f":"SUM(L8:L55)","v":2329767.06}]

{"sheet":"Não Rel - Mat Cons Durável","index":23,"n_rows":38,"n_cols":15,"rows_kept":38,"cut":false,"hidden":false,"merged":[[2,1,2,4],[3,1,3,14]]}
[]
[]
[]
[null,"MATERIAIS DE CONSUMO PERMANENTE NÃO RELACIONADOS DIRETAMENTE A UM POSTO DE TRABALHO - AQUISIÇÃO SOB DEMANDA"]
[]
[]
[null,null,"ITEM","CÓDIGO","DESCRIÇÃO","ESTOQUE INICIAL","MÉDIA CONSUMO MENSAL","QTDE. ANUAL","UNIDADE","CUSTO UNITÁRIO","CUSTO TOTAL","BDI (%)","PREÇO TOTAL","FONTE","REFERÊNCIA"]
[]
[null,null,1,null,"Balde Plástico 12 Litros",70,8,166,"Unidade",8.9566666666666652,{"$f":"J9*H9","v":1486.8066666666664},{"$f":"BDI!E26","v":0.21840000000000001},{"$f":"ROUND(K9*(1+L9),2)","v":1811.53},"Cotação"]
[null,null,2,null,"Balde plástico 20 litros",20,2,44,"Unidade",15.5,{"$f":"J10*H10","v":682},{"$f":"L9","v":0.21840000000000001},{"$f":"ROUND(K10*(1+L10),2)","v":830.95},"Cotação"]
[null,null,3,null,"Balde Plástico 60 Litros",4,1,16,"Unidade",46.024999999999999,736.4,{"$f":"L10","v":0.21840000000000001},897.23,"Cotação"]
[null,null,4,null,"Capa para chuva com capuz, cor amarela, longa, tamanho G",8,2,32,"Unidade",18.164999999999999,581.28,0.21840000000000001,708.23,"Cotação"]
[null,null,5,null,"Chapéu legionário (com proteção p/ nuca)",20,2,44,"Unidade",22.445,987.58,0.21840000000000001,1203.27,"Cotação"]
[null,null,6,null,"Conjunto completo para limpeza de rodapé (cabo, suporte e fibra) (ref. Braslimpia ST 304 e FP262 ou similar)",8,0,8,"Unidade",110.175,881.4,0.21840000000000001,1073.9000000000001,"Cotação"]
[null,null,7,null,"Conjunto completo para Mop pó, com amarração (cabo, armação e cabeleira) (ref. Mop seco Euro CJ 60E ou similar)",8,0,8,"Unidade",131.28,1050.24,0.21840000000000001,1279.6099999999999,"Cotação"]
[null,null,8,null,"Espátula de aço com cabo de madeira 4\" 101x185mm, cabo amarelo (ref. Max Ferramentas ou similar)",12,2,36,"Unidade",22.4,806.4,0.21840000000000001,982.52,"Cotação"]
[null,null,9,null,"Extensão elétrica com carretel 2 X 2,5mm² X 50,00 m – suporte com carretel injetado em polipropileno com diâmetro de 290mm com 3 tomadas universais",10,0,10,"Unidade",578,5780,0.21840000000000001,7042.35,"Cotação"]
[null,null,10,null,"Fita para isolamento de área zebrada amarelo e preta ultra resistente 7,6cm x 200m",10,0,10,"Unidade",9.14,91.4,0.21840000000000001,111.36,"Cotação"]
[null,null,11,null,"Macacão de segurança Tipo 6 (ref. SteelgenVicsa, Steelflex ou outro de desempenho e qualidade similar ou superior).",12,4,60,"Unidade",27.825000000000003,1669.5000000000002,0.21840000000000001,2034.12,"Cotação"]
[null,null,12,null,"Mangueira Top cristal Ø3/4”x 250m em PVC flexível, camada em poliester trançado, para pressões de 6 bar (ref. Tramontina Mult Johnson ou outro de desempenho e qualidade similar ou superior)",5,0,5,"Unidade",557.44499999999994,2787.2249999999995,0.21840000000000001,3395.95,"Cotação"]
[null,null,13,null,"Pá para lixo, plástica, com cabo longo 90 cm (ref. 15300 marca Tomki São Bernardo, Madetec Johnson ou outro de desempenho e qualidade similar ou superior)",20,2,44,"Unidade",9.8666666666666654,434.13333333333327,0.21840000000000001,528.95000000000005,"Cotação"]
[null,null,14,null,"Placa de sinalização em vinil para piso molhado",40,0,40,"Unidade",54.614999999999995,2184.6,0.21840000000000001,2661.72,"Cotação"]
[null,null,15,null,"Pulverizador Costal Simétrico 20L (ref.Guarany, Vulcan,Vonder ou outro de desempenho e qualidade similar ou superior).",2,0,2,"Unidade",164.51499999999999,329.03,0.21840000000000001,400.89,"Cotação"]
[null,null,16,null,"Rodo P/ Pia de Banheiro manual anatômico – (ref. Guirado, Bettani ou Dalcim ou outro de desempenho e qualidade similar ou superior)",15,1,27,"Unidade",11.376666666666665,307.16999999999996,0.21840000000000001,374.26,"Cotação"]
[null,null,17,null,"Rodo de 40cm de madeira/plástico (borracha dupla) com cabo 1,50 m – marcas Tomki, Guirado, Bettani, Dalcim ou outro de desempenho e qualidade similar ou superior)",80,10,200,"Unidade",8.4633333333333329,1692.6666666666665,0.21840000000000001,2062.35,"Cotação"]
[null,null,18,null,"Rodo de 60cm de madeira/plástico (borracha dupla) com cabo 1,50m (ref. Tomki, Guirado, Bettani, Dalcim ou outro de desempenho e qualidade similar ou superior)",35,8,131,"Unidade",15.120000000000001,1980.72,0.21840000000000001,2413.31,"Cotação"]
[null,null,19,null,"Rodo de 90cm de madeira/plástico (borracha dupla) com cabo 1,50m (ref. Tomki, Guirado, Bettani, Dalcim ou outro de desempenho e qualidade similar ou superior)",15,2,39,"Unidade",15.233333333333334,594.1,0.21840000000000001,723.85,"Cotação"]
[null,null,20,null,"Saco para aspirador doméstico pequeno descartável (ref. Eletrolux Silent Prof ou Leo da Soteco ou outro de desempenho e qualidade similar ou superior)",12,3,48,"Unidade",6.1588888888888889,295.62666666666667,0.21840000000000001,360.19,"Cotação"]
[null,null,21,null,"Saco para aspirador industrial água e pó descartável (ref. Karcher A2104 ou Eletrolux GT 3000 Pro ou outro de desempenho e qualidade similar ou superior)",4,2,28,"Unidade",13.42,375.76,0.21840000000000001,457.83,"Cotação"]
[null,null,22,null,"Suporte para papel higiênico (ref. Santher ou outro de desempenho e qualidade similar ou superior)",345,2,369,"Unidade",33.6,12398.4,0.21840000000000001,15106.21,"Cotação"]
[null,null,23,null,"Suporte para papel toalha (ref. Santher ou outro de desempenho e qualidade similar ou superior)",385,2,409,"Unidade",39.094999999999999,15989.855,0.21840000000000001,19482.04,"Cotação"]
[null,null,24,null,"Suporte para saboneteira (ref. Santher ou outro de desempenho e qualidade similar ou superior)",230,2,254,"Unidade",33.475000000000001,8502.65,0.21840000000000001,10359.629999999999,"Cotação"]
[null,null,25,null,"Vassoura de Pêlo 40cm nylon com cabo 1,50 m (ref. Tomki, Guirado, Bettani, Dalcim ou outro de desempenho e qualidade similar ou superior)",12,2,36,"Unidade",12.2,439.2,{"$f":"L31","v":0.21840000000000001},{"$f":"ROUND(K33*(1+L33),2)","v":535.12},"Cotação"]
[null,null,26,null,"Vassoura Piaçava nº 3 com cabo 1,50m (ref. Guirado, Bettani, Dalcim ou outro de desempenho e qualidade similar ou superior)",30,8,126,"Unidade",12.024999999999999,{"$f":"J34*H34","v":1515.1499999999999},{"$f":"L31","v":0.21840000000000001},1846.06,"Cotação"]
[null,null,27,null,"Vassoura para Vaso Sanitário com cabo de madeira (ref. Guirado, Bettani, Dalcim ou outro de desempenho e qualidade similar ou superior)",60,10,180,"Unidade",5.6,1007.9999999999999,{"$f":"L32","v":0.21840000000000001},1228.1500000000001,"Cotação"]
[]
[null,null,null,null,null,null,null,null,null,null,null,"SOMATÓRIO TOTAL MENSAL",{"$f":"M38/12","v":6659.2983333333323}]
[null,null,null,null,null,null,null,null,null,null,null,"SOMATÓRIO TOTAL ANUAL",{"$f":"SUM(M8:M36)","v":79911.579999999987}]

{"sheet":"Não Rel - Serviços","index":24,"n_rows":11,"n_cols":13,"rows_kept":11,"cut":false,"hidden":false,"merged":[[1,1,1,4],[2,1,2,12]]}
[]
[]
[null,"SERVIÇOS NÃO RELACIONADOS DIRETAMENTE A UM POSTO DE TRABALHO - SOB DEMANDA"]
[]
[]
[null,null,"ITEM","CÓDIGO","DESCRIÇÃO","QUANT ANUAL","UNIDADE","CUSTO UNITÁRIO","CUSTO TOTAL","BDI (%)","PREÇO TOTAL","FONTE","REFERÊNCIA"]
[]
[null,null,1,null,"Serviços de desinsetização e desratização em uma área de 59.203 m²",4,"aplicações",8422.5,{"$f":"H8*F8","v":33690},{"$f":"BDI!E26","v":0.21840000000000001},{"$f":"ROUND(I8*(1+J8),2)","v":41047.9},"Cotação"]
[]
[null,null,null,null,null,null,null,null,null,"SOMATÓRIO TOTAL MENSAL",{"$f":"K11/12","v":3420.6583333333333}]
[null,null,null,null,null,null,null,null,null,"SOMATÓRIO TOTAL ANUAL",{"$f":"SUM(K7:K9)","v":41047.9}]

{"sheet":"Not. Demanda","index":25,"n_rows":51,"n_cols":8,"rows_kept":51,"cut":false,"hidden":true,"merged":[[1,1,1,3],[2,1,2,7]]}
[]
[]
[null,"ADICIONAL NOTURNO SOB DEMANDA"]
[]
[]
[null,null,"CATEGORIAS",null,null,null,"HORAS / MÊS","% NOTURNA"]
[]
[null,null,8,{"$f":"HLOOKUP($C8,'Dados Gerais'!$D$5:$BK$10,6)","v":"SERVENTE COM ADICIONAL DE INSALUBRIDADE"},null,null,null,0.22500000000000001]
[null,null,9,{"$f":"HLOOKUP($C9,'Dados Gerais'!$D$5:$BK$10,6)","v":"SERVENTE COM ADICIONAL DE INSALUBRIDADE E ADICIONAL NOTURNO"},null,null,null,0.22500000000000001]
[]
[]
[null,null,"AJUSTE DE HORAS FICTAS",null,"AJUSTE H.NOT","HORA NORMAL","H.FICTAS/MÊS","H.ÚTEIS/MÊS"]
[]
[null,null,8,{"$f":"HLOOKUP($C14,'Dados Gerais'!$D$5:$BK$10,6)","v":"SERVENTE COM ADICIONAL DE INSALUBRIDADE"},60,60,{"$f":"G8*(F14/E14)","v":0},{"$f":"HLOOKUP(C14,'Dados Gerais'!$D$5:$L$16,12,0)","v":220}]
[null,null,9,{"$f":"HLOOKUP($C15,'Dados Gerais'!$D$5:$BK$10,6)","v":"SERVENTE COM ADICIONAL DE INSALUBRIDADE E ADICIONAL NOTURNO"},60,60,{"$f":"G9*(F15/E15)","v":0},{"$f":"HLOOKUP(C15,'Dados Gerais'!$D$5:$L$16,12,0)","v":220}]
[]
[]
[null,null,"VALOR DO ADICIONAL NOTURNO",null,null,"SALÁRIO MÊS","VL.H.NORMAL","ADIC.H.FICTAS"]
[]
[null,null,8,{"$f":"HLOOKUP($C20,'Dados Gerais'!$D$5:$BK$10,6)","v":"SERVENTE COM ADICIONAL DE INSALUBRIDADE"},null,{"$f":"HLOOKUP(C20,'Dados Gerais'!$D$5:$L$12,8,0)","v":1898.58},{"$f":"F20/H14","v":8.6299090909090914},{"$f":"G20*(H8)","v":1.9417295454545456}]
[null,null,9,{"$f":"HLOOKUP($C21,'Dados Gerais'!$D$5:$BK$10,6)","v":"SERVENTE COM ADICIONAL DE INSALUBRIDADE E ADICIONAL NOTURNO"},null,{"$f":"HLOOKUP(C21,'Dados Gerais'!$D$5:$L$12,8,0)","v":1898.58},{"$f":"F21/H15","v":8.6299090909090914},{"$f":"G21*(H9)","v":1.9417295454545456}]
[]
[]
[null,null,"RESUMO DO ADICIONAL NOTURNO SOB DEMANDA"]
[null,null,"TOTAIS MENSAIS",null,null,null,"PREÇO MENSAL"]
[]
[null,null,8,{"$f":"HLOOKUP($C27,'Dados Gerais'!$D$5:$BK$10,6)","v":"SERVENTE COM ADICIONAL DE INSALUBRIDADE"},null,null,{"$f":"H20*G14","v":0}]
[null,null,9,{"$f":"HLOOKUP($C28,'Dados Gerais'!$D$5:$BK$10,6)","v":"SERVENTE COM ADICIONAL DE INSALUBRIDADE E ADICIONAL NOTURNO"},null,null,{"$f":"H21*G15","v":0}]
[]
[null,null,null,null,null,"SOMATÓRIO TOTAL MENSAL",{"$f":"SUM(G27:G29)","v":0}]
[null,null,null,null,null,"SOMATÓRIO TOTAL ANUAL",{"$f":"G30*12","v":0}]
[]
[]
[null,null,"ENCARGOS SOCIAIS E BDI SOBRE ADICIONAL NOTURNO SOB DEMANDA"]
[null,null,"TOTAIS MENSAIS",null,null,"PERCENTUAIS","PREÇO MENSAL"]
[]
[null,null,null,"ENCARGOS SOCIAIS",null,{"$f":"'Encargos Sociais'!$E$46","v":0.73899999999999999},{"$f":"F37*G30","v":0}]
[null,null,null,"BDI",null,{"$f":"BDI!$E$26","v":0.21840000000000001},{"$f":"F38*(G30+G37)","v":0}]
[]
[null,null,null,null,null,"SOMATÓRIO TOTAL MENSAL",{"$f":"SUM(G37:G39)","v":0}]
[null,null,null,null,null,"SOMATÓRIO TOTAL ANUAL",{"$f":"G40*12","v":0}]
[]
[]
[null,null,"VALOR TOTAL ADICIONAL NOTURNO SOB DEMANDA (COM ENCARGOS SOCIAIS E BDI INCLUSOS)"]
[null,null,"TOTAIS MENSAIS",null,null,"PERCENTUAIS","PREÇO MENSAL"]
[]
[null,null,null,"ENCARGOS SOCIAIS",null,{"$f":"'Encargos Sociais'!$E$46","v":0.73899999999999999},{"$f":"G27+G37","v":0}]
[null,null,null,"BDI",null,{"$f":"BDI!$E$26","v":0.21840000000000001},{"$f":"G28+G38","v":0}]
[]
[null,null,null,null,null,"SOMATÓRIO TOTAL MENSAL",{"$f":"SUM(G47:G49)","v":0}]
[null,null,null,null,null,"SOMATÓRIO TOTAL ANUAL",{"$f":"G50*12","v":0}]

{"sheet":"Mat Cons","index":26,"n_rows":28,"n_cols":128,"rows_kept":28,"cut":false,"hidden":true,"merged":[[9,1,9,3],[10,1,10,5]]}
[null,null,"CÂMARA DOS DEPUTADOS"]
[null,null,"DEPARTAMENTO TÉCNICO"]
[null,null,"Coordenação de Planejamento e Gestão"]
[]
[null,null,"Data:",{"$f":"'Dados Gerais'!#REF!","v":{"$error":"#REF!"}}]
[null,null,"Processo:",{"$f":"'Dados Gerais'!#REF!","v":{"$error":"#REF!"}}]
[null,null,"Objeto:",{"$f":"'Dados Gerais'!#REF!","v":{"$error":"#REF!"}}]
[]
[]
[]
[null,"MATERIAIS DE CONSUMO RELACIONADOS AO POSTO - AQUISIÇÃO",null,null,null,null,null,null,1,null,{"$f":"I11+1","v":2},null,{"$f":"K11+1","v":3},null,{"$f":"M11+1","v":4},null,{"$f":"O11+1","v":5},null,{"$f":"Q11+1","v":6},null,{"$f":"S11+1","v":7},null,{"$f":"U11+1","v":8},null,{"$f":"W11+1","v":9},null,{"$f":"Y11+1","v":10},null,{"$f":"AA11+1","v":11},null,{"$f":"AC11+1","v":12},null,{"$f":"AE11+1","v":13},null,{"$f":"AG11+1","v":14},null,{"$f":"AI11+1","v":15},null,{"$f":"AK11+1","v":16},null,{"$f":"AM11+1","v":17},null,{"$f":"AO11+1","v":18},null,{"$f":"AQ11+1","v":19},null,{"$f":"AS11+1","v":20},null,{"$f":"AU11+1","v":21},null,{"$f":"AW11+1","v":22},null,{"$f":"AY11+1","v":23},null,{"$f":"BA11+1","v":24},null,{"$f":"BC11+1","v":25},null,{"$f":"BE11+1","v":26},null,{"$f":"BG11+1","v":27},null,{"$f":"BI11+1","v":28},null,{"$f":"BK11+1","v":29},null,{"$f":"BM11+1","v":30},null,{"$f":"BO11+1","v":31},null,{"$f":"BQ11+1","v":32},null,{"$f":"BS11+1","v":33},null,{"$f":"BU11+1","v":34},null,{"$f":"BW11+1","v":35},null,{"$f":"BY11+1","v":36},null,{"$f":"CA11+1","v":37},null,{"$f":"CC11+1","v":38},null,{"$f":"CE11+1","v":39},null,{"$f":"CG11+1","v":40},null,{"$f":"CI11+1","v":41},null,{"$f":"CK11+1","v":42},null,{"$f":"CM11+1","v":43},null,{"$f":"CO11+1","v":44},null,{"$f":"CQ11+1","v":45},null,{"$f":"CS11+1","v":46},null,{"$f":"CU11+1","v":47},null,{"$f":"CW11+1","v":48},null,{"$f":"CY11+1","v":49},null,{"$f":"DA11+1","v":50},null,{"$f":"DC11+1","v":51},null,{"$f":"DE11+1","v":52},null,{"$f":"DG11+1","v":53},null,{"$f":"DI11+1","v":54},null,{"$f":"DK11+1","v":55},null,{"$f":"DM11+1","v":56},null,{"$f":"DO11+1","v":57},null,{"$f":"DQ11+1","v":58},null,{"$f":"DS11+1","v":59},null,{"$f":"DU11+1","v":60}]
[]
[null,null,null,null,null,null,null,null,{"$f":"ROUND(SUM(J12:J65),2)","v":0},null,{"$f":"ROUND(SUM(L12:L65),2)","v":0},null,{"$f":"ROUND(SUM(N12:N65),2)","v":0},null,{"$f":"ROUND(SUM(P12:P65),2)","v":0},null,{"$f":"ROUND(SUM(R12:R65),2)","v":0},null,{"$f":"ROUND(SUM(T12:T65),2)","v":0},null,{"$f":"ROUND(SUM(V12:V65),2)","v":0},null,{"$f":"ROUND(SUM(X12:X65),2)","v":0},null,{"$f":"ROUND(SUM(Z12:Z65),2)","v":0},null,{"$f":"ROUND(SUM(AB12:AB65),2)","v":0},null,{"$f":"ROUND(SUM(AD12:AD65),2)","v":0},null,{"$f":"ROUND(SUM(AF12:AF65),2)","v":0},null,{"$f":"ROUND(SUM(AH12:AH65),2)","v":0},null,{"$f":"ROUND(SUM(AJ12:AJ65),2)","v":0},null,{"$f":"ROUND(SUM(AL12:AL65),2)","v":0},null,{"$f":"ROUND(SUM(AN12:AN65),2)","v":0},null,{"$f":"ROUND(SUM(AP12:AP65),2)","v":0},null,{"$f":"ROUND(SUM(AR12:AR65),2)","v":0},null,{"$f":"ROUND(SUM(AT12:AT65),2)","v":0},null,{"$f":"ROUND(SUM(AV12:AV65),2)","v":0},null,{"$f":"ROUND(SUM(AX12:AX65),2)","v":0},null,{"$f":"ROUND(SUM(AZ12:AZ65),2)","v":0},null,{"$f":"ROUND(SUM(BB12:BB65),2)","v":0},null,{"$f":"ROUND(SUM(BD12:BD65),2)","v":0},null,{"$f":"ROUND(SUM(BF12:BF65),2)","v":0},null,{"$f":"ROUND(SUM(BH12:BH65),2)","v":0},null,{"$f":"ROUND(SUM(BJ12:BJ65),2)","v":0},null,{"$f":"ROUND(SUM(BL12:BL65),2)","v":0},null,{"$f":"ROUND(SUM(BN12:BN65),2)","v":0},null,{"$f":"ROUND(SUM(BP12:BP65),2)","v":0},null,{"$f":"ROUND(SUM(BR12:BR65),2)","v":0},null,{"$f":"ROUND(SUM(BT12:BT65),2)","v":0},null,{"$f":"ROUND(SUM(BV12:BV65),2)","v":0},null,{"$f":"ROUND(SUM(BX12:BX65),2)","v":0},null,{"$f":"ROUND(SUM(BZ12:BZ65),2)","v":0},null,{"$f":"ROUND(SUM(CB12:CB65),2)","v":0},null,{"$f":"ROUND(SUM(CD12:CD65),2)","v":0},null,{"$f":"ROUND(SUM(CF12:CF65),2)","v":0},null,{"$f":"ROUND(SUM(CH12:CH65),2)","v":0},null,{"$f":"ROUND(SUM(CJ12:CJ65),2)","v":0},null,{"$f":"ROUND(SUM(CL12:CL65),2)","v":0},null,{"$f":"ROUND(SUM(CN12:CN65),2)","v":0},null,{"$f":"ROUND(SUM(CP12:CP65),2)","v":0},null,{"$f":"ROUND(SUM(CR12:CR65),2)","v":0},null,{"$f":"ROUND(SUM(CT12:CT65),2)","v":0},null,{"$f":"ROUND(SUM(CV12:CV65),2)","v":0},null,{"$f":"ROUND(SUM(CX12:CX65),2)","v":0},null,{"$f":"ROUND(SUM(CZ12:CZ65),2)","v":0},null,{"$f":"ROUND(SUM(DB12:DB65),2)","v":0},null,{"$f":"ROUND(SUM(DD12:DD65),2)","v":0},null,{"$f":"ROUND(SUM(DF12:DF65),2)","v":0},null,{"$f":"ROUND(SUM(DH12:DH65),2)","v":0},null,{"$f":"ROUND(SUM(DJ12:DJ65),2)","v":0},null,{"$f":"ROUND(SUM(DL12:DL65),2)","v":0},null,{"$f":"ROUND(SUM(DN12:DN65),2)","v":0},null,{"$f":"ROUND(SUM(DP12:DP65),2)","v":0},null,{"$f":"ROUND(SUM(DR12:DR65),2)","v":0},null,{"$f":"ROUND(SUM(DT12:DT65),2)","v":0},null,{"$f":"ROUND(SUM(DV12:DV65),2)","v":0},null,{"$f":"ROUND(SUM(DX12:DX65),2)","v":0}]
[null,null,"CATEGORIAS",null,null,"QUANTIDADE"]
[null,null,null,null,null,null,null,null,{"$f":"IF($C15=I$11,1,0)","v":0}]
[null,null,null,null,null,null,null,null,0,null,{"$f":"IF($C16=K$11,1,0)","v":0},null,{"$f":"IF($C16=M$11,1,0)","v":0},null,{"$f":"IF($C16=O$11,1,0)","v":0},null,{"$f":"IF($C16=Q$11,1,0)","v":0},null,{"$f":"IF($C16=S$11,1,0)","v":0},null,{"$f":"IF($C16=U$11,1,0)","v":0},null,{"$f":"IF($C16=W$11,1,0)","v":0},null,{"$f":"IF($C16=Y$11,1,0)","v":0},null,{"$f":"IF($C16=AA$11,1,0)","v":0},null,{"$f":"IF($C16=AC$11,1,0)","v":0},null,{"$f":"IF($C16=AE$11,1,0)","v":0},null,{"$f":"IF($C16=AG$11,1,0)","v":0},null,{"$f":"IF($C16=AI$11,1,0)","v":0},null,{"$f":"IF($C16=AK$11,1,0)","v":0},null,{"$f":"IF($C16=AM$11,1,0)","v":0},null,{"$f":"IF($C16=AO$11,1,0)","v":0},null,{"$f":"IF($C16=AQ$11,1,0)","v":0},null,{"$f":"IF($C16=AS$11,1,0)","v":0},null,{"$f":"IF($C16=AU$11,1,0)","v":0},null,{"$f":"IF($C16=AW$11,1,0)","v":0},null,{"$f":"IF($C16=AY$11,1,0)","v":0},null,{"$f":"IF($C16=BA$11,1,0)","v":0},null,{"$f":"IF($C16=BC$11,1,0)","v":0},null,{"$f":"IF($C16=BE$11,1,0)","v":0},null,{"$f":"IF($C16=BG$11,1,0)","v":0},null,{"$f":"IF($C16=BI$11,1,0)","v":0},null,{"$f":"IF($C16=BK$11,1,0)","v":0},null,{"$f":"IF($C16=BM$11,1,0)","v":0},null,{"$f":"IF($C16=BO$11,1,0)","v":0},null,{"$f":"IF($C16=BQ$11,1,0)","v":0},null,{"$f":"IF($C16=BS$11,1,0)","v":0},null,{"$f":"IF($C16=BU$11,1,0)","v":0},null,{"$f":"IF($C16=BW$11,1,0)","v":0},null,{"$f":"IF($C16=BY$11,1,0)","v":0},null,{"$f":"IF($C16=CA$11,1,0)","v":0},null,{"$f":"IF($C16=CC$11,1,0)","v":0},null,{"$f":"IF($C16=CE$11,1,0)","v":0},null,{"$f":"IF($C16=CG$11,1,0)","v":0},null,{"$f":"IF($C16=CI$11,1,0)","v":0},null,{"$f":"IF($C16=CK$11,1,0)","v":0},null,{"$f":"IF($C16=CM$11,1,0)","v":0},null,{"$f":"IF($C16=CO$11,1,0)","v":0},null,{"$f":"IF($C16=CQ$11,1,0)","v":0},null,{"$f":"IF($C16=CS$11,1,0)","v":0},null,{"$f":"IF($C16=CU$11,1,0)","v":0},null,{"$f":"IF($C16=CW$11,1,0)","v":0},null,{"$f":"IF($C16=CY$11,1,0)","v":0},null,{"$f":"IF($C16=DA$11,1,0)","v":0},null,{"$f":"IF($C16=DC$11,1,0)","v":0},null,{"$f":"IF($C16=DE$11,1,0)","v":0},null,{"$f":"IF($C16=DG$11,1,0)","v":0},null,{"$f":"IF($C16=DI$11,1,0)","v":0},null,{"$f":"IF($C16=DK$11,1,0)","v":0},null,{"$f":"IF($C16=DM$11,1,0)","v":0},null,{"$f":"IF($C16=DO$11,1,0)","v":0},null,{"$f":"IF($C16=DQ$11,1,0)","v":0},null,{"$f":"IF($C16=DS$11,1,0)","v":0},null,{"$f":"IF($C16=DU$11,1,0)","v":0},null,{"$f":"IF($C16=DW$11,1,0)","v":0}]
[null,null,null,null,null,null,null,null,0,null,0,null,0,null,0,null,0,null,0,null,0,null,0,null,0,null,0,null,0,null,0,null,0,null,0,null,0,null,0,null,0,null,0,null,0,null,0,null,0,null,0,null,0,null,0,null,0,null,0,null,0,null,0,null,0,null,0,null,0,null,0,null,0,null,0,null,0,null,0,null,0,null,0,null,0,null,0,null,0,null,0,null,0,null,0,null,0,null,0,null,0,null,0,null,0,null,0,null,0,null,0,null,0,null,0,null,0,null,0,null,0,null,0,null,0,null,0]
[null,null,null,null,null,null,null,null,0,null,0,null,0,null,0,null,0,null,0,null,0,null,0,null,0,null,0,null,0,null,0,null,0,null,0,null,0,null,0,null,0,null,0,null,0,null,0,null,0,null,0,null,0,null,0,null,0,null,0,null,0,null,0,null,0,null,0,null,0,null,0,null,0,null,0,null,0,null,0,null,0,null,0,null,0,null,0,null,0,null,0,null,0,null,0,null,0,null,0,null,0,null,0,null,0,null,0,null,0,null,0,null,0,null,0,null,0,null,0,null,0,null,0,null,0,null,0]
[null,null,null,null,null,null,null,null,0,null,0,null,0,null,0,null,0,null,0,null,0,null,0,null,0,null,0,null,0,null,0,null,0,null,0,null,0,null,0,null,0,null,0,null,0,null,0,null,0,null,0,null,0,null,0,null,0,null,0,null,0,null,0,null,0,null,0,null,0,null,0,null,0,null,0,null,0,null,0,null,0,null,0,null,0,null,0,null,0,null,0,null,0,null,0,null,0,null,0,null,0,null,0,null,0,null,0,null,0,null,0,null,0,null,0,null,0,null,0,null,0,null,0,null,0,null,0]
[null,null,null,null,null,null,null,null,0,null,0,null,0,null,0,null,0,null,0,null,0,null,0,null,0,null,0,null,0,null,0,null,0,null,0,null,0,null,0,null,0,null,0,null,0,null,0,null,0,null,0,null,0,null,0,null,0,null,0,null,0,null,0,null,0,null,0,null,0,null,0,null,0,null,0,null,0,null,0,null,0,null,0,null,0,null,0,null,0,null,0,null,0,null,0,null,0,null,0,null,0,null,0,null,0,null,0,null,0,null,0,null,0,null,0,null,0,null,0,null,0,null,0,null,0,null,0]
[null,null,null,null,null,null,null,null,0,null,0,null,0,null,0,null,0,null,0,null,0,null,0,null,0,null,0,null,0,null,0,null,0,null,0,null,0,null,0,null,0,null,0,null,0,null,0,null,0,null,0,null,0,null,0,null,0,null,0,null,0,null,0,null,0,null,0,null,0,null,0,null,0,null,0,null,0,null,0,null,0,null,0,null,0,null,0,null,0,null,0,null,0,null,0,null,0,null,0,null,0,null,0,null,0,null,0,null,0,null,0,null,0,null,0,null,0,null,0,null,0,null,0,null,0,null,0]
[null,null,null,null,null,null,null,null,0]
[]
[null,null,"ITEM","DESCRIÇÃO","QUANT ANUAL","VALOR"]
[null,null,null,null,null,null,null,null,null,{"$f":"IF(SUM(I$15:I$22)>0,$E25*$F25,0)","v":0},null,{"$f":"IF(SUM(K$15:K$22)>0,$E25*$F25,0)","v":0},null,{"$f":"IF(SUM(M$15:M$22)>0,$E25*$F25,0)","v":0},null,{"$f":"IF(SUM(O$15:O$22)>0,$E25*$F25,0)","v":0},null,{"$f":"IF(SUM(Q$15:Q$22)>0,$E25*$F25,0)","v":0},null,{"$f":"IF(SUM(S$15:S$22)>0,$E25*$F25,0)","v":0},null,{"$f":"IF(SUM(U$15:U$22)>0,$E25*$F25,0)","v":0},null,{"$f":"IF(SUM(W$15:W$22)>0,$E25*$F25,0)","v":0},null,{"$f":"IF(SUM(Y$15:Y$22)>0,$E25*$F25,0)","v":0},null,{"$f":"IF(SUM(AA$15:AA$22)>0,$E25*$F25,0)","v":0},null,{"$f":"IF(SUM(AC$15:AC$22)>0,$E25*$F25,0)","v":0},null,{"$f":"IF(SUM(AE$15:AE$22)>0,$E25*$F25,0)","v":0},null,{"$f":"IF(SUM(AG$15:AG$22)>0,$E25*$F25,0)","v":0},null,{"$f":"IF(SUM(AI$15:AI$22)>0,$E25*$F25,0)","v":0},null,{"$f":"IF(SUM(AK$15:AK$22)>0,$E25*$F25,0)","v":0},null,{"$f":"IF(SUM(AM$15:AM$22)>0,$E25*$F25,0)","v":0},null,{"$f":"IF(SUM(AO$15:AO$22)>0,$E25*$F25,0)","v":0},null,{"$f":"IF(SUM(AQ$15:AQ$22)>0,$E25*$F25,0)","v":0},null,{"$f":"IF(SUM(AS$15:AS$22)>0,$E25*$F25,0)","v":0},null,{"$f":"IF(SUM(AU$15:AU$22)>0,$E25*$F25,0)","v":0},null,{"$f":"IF(SUM(AW$15:AW$22)>0,$E25*$F25,0)","v":0},null,{"$f":"IF(SUM(AY$15:AY$22)>0,$E25*$F25,0)","v":0},null,{"$f":"IF(SUM(BA$15:BA$22)>0,$E25*$F25,0)","v":0},null,{"$f":"IF(SUM(BC$15:BC$22)>0,$E25*$F25,0)","v":0},null,{"$f":"IF(SUM(BE$15:BE$22)>0,$E25*$F25,0)","v":0},null,{"$f":"IF(SUM(BG$15:BG$22)>0,$E25*$F25,0)","v":0},null,{"$f":"IF(SUM(BI$15:BI$22)>0,$E25*$F25,0)","v":0},null,{"$f":"IF(SUM(BK$15:BK$22)>0,$E25*$F25,0)","v":0},null,{"$f":"IF(SUM(BM$15:BM$22)>0,$E25*$F25,0)","v":0},null,{"$f":"IF(SUM(BO$15:BO$22)>0,$E25*$F25,0)","v":0},null,{"$f":"IF(SUM(BQ$15:BQ$22)>0,$E25*$F25,0)","v":0},null,{"$f":"IF(SUM(BS$15:BS$22)>0,$E25*$F25,0)","v":0},null,{"$f":"IF(SUM(BU$15:BU$22)>0,$E25*$F25,0)","v":0},null,{"$f":"IF(SUM(BW$15:BW$22)>0,$E25*$F25,0)","v":0},null,{"$f":"IF(SUM(BY$15:BY$22)>0,$E25*$F25,0)","v":0},null,{"$f":"IF(SUM(CA$15:CA$22)>0,$E25*$F25,0)","v":0},null,{"$f":"IF(SUM(CC$15:CC$22)>0,$E25*$F25,0)","v":0},null,{"$f":"IF(SUM(CE$15:CE$22)>0,$E25*$F25,0)","v":0},null,{"$f":"IF(SUM(CG$15:CG$22)>0,$E25*$F25,0)","v":0},null,{"$f":"IF(SUM(CI$15:CI$22)>0,$E25*$F25,0)","v":0},null,{"$f":"IF(SUM(CK$15:CK$22)>0,$E25*$F25,0)","v":0},null,{"$f":"IF(SUM(CM$15:CM$22)>0,$E25*$F25,0)","v":0},null,{"$f":"IF(SUM(CO$15:CO$22)>0,$E25*$F25,0)","v":0},null,{"$f":"IF(SUM(CQ$15:CQ$22)>0,$E25*$F25,0)","v":0},null,{"$f":"IF(SUM(CS$15:CS$22)>0,$E25*$F25,0)","v":0},null,{"$f":"IF(SUM(CU$15:CU$22)>0,$E25*$F25,0)","v":0},null,{"$f":"IF(SUM(CW$15:CW$22)>0,$E25*$F25,0)","v":0},null,{"$f":"IF(SUM(CY$15:CY$22)>0,$E25*$F25,0)","v":0},null,{"$f":"IF(SUM(DA$15:DA$22)>0,$E25*$F25,0)","v":0},null,{"$f":"IF(SUM(DC$15:DC$22)>0,$E25*$F25,0)","v":0},null,{"$f":"IF(SUM(DE$15:DE$22)>0,$E25*$F25,0)","v":0},null,{"$f":"IF(SUM(DG$15:DG$22)>0,$E25*$F25,0)","v":0},null,{"$f":"IF(SUM(DI$15:DI$22)>0,$E25*$F25,0)","v":0},null,{"$f":"IF(SUM(DK$15:DK$22)>0,$E25*$F25,0)","v":0},null,{"$f":"IF(SUM(DM$15:DM$22)>0,$E25*$F25,0)","v":0},null,{"$f":"IF(SUM(DO$15:DO$22)>0,$E25*$F25,0)","v":0},null,{"$f":"IF(SUM(DQ$15:DQ$22)>0,$E25*$F25,0)","v":0},null,{"$f":"IF(SUM(DS$15:DS$22)>0,$E25*$F25,0)","v":0},null,{"$f":"IF(SUM(DU$15:DU$22)>0,$E25*$F25,0)","v":0},null,{"$f":"IF(SUM(DW$15:DW$22)>0,$E25*$F25,0)","v":0}]
[null,null,null,null,null,null,null,null,null,{"$f":"IF(SUM(I$15:I$22)>0,$E26*$F26,0)","v":0},null,{"$f":"IF(SUM(K$15:K$22)>0,$E26*$F26,0)","v":0},null,{"$f":"IF(SUM(M$15:M$22)>0,$E26*$F26,0)","v":0},null,{"$f":"IF(SUM(O$15:O$22)>0,$E26*$F26,0)","v":0},null,{"$f":"IF(SUM(Q$15:Q$22)>0,$E26*$F26,0)","v":0},null,{"$f":"IF(SUM(S$15:S$22)>0,$E26*$F26,0)","v":0},null,{"$f":"IF(SUM(U$15:U$22)>0,$E26*$F26,0)","v":0},null,{"$f":"IF(SUM(W$15:W$22)>0,$E26*$F26,0)","v":0},null,{"$f":"IF(SUM(Y$15:Y$22)>0,$E26*$F26,0)","v":0},null,{"$f":"IF(SUM(AA$15:AA$22)>0,$E26*$F26,0)","v":0},null,{"$f":"IF(SUM(AC$15:AC$22)>0,$E26*$F26,0)","v":0},null,{"$f":"IF(SUM(AE$15:AE$22)>0,$E26*$F26,0)","v":0},null,{"$f":"IF(SUM(AG$15:AG$22)>0,$E26*$F26,0)","v":0},null,{"$f":"IF(SUM(AI$15:AI$22)>0,$E26*$F26,0)","v":0},null,{"$f":"IF(SUM(AK$15:AK$22)>0,$E26*$F26,0)","v":0},null,{"$f":"IF(SUM(AM$15:AM$22)>0,$E26*$F26,0)","v":0},null,{"$f":"IF(SUM(AO$15:AO$22)>0,$E26*$F26,0)","v":0},null,{"$f":"IF(SUM(AQ$15:AQ$22)>0,$E26*$F26,0)","v":0},null,{"$f":"IF(SUM(AS$15:AS$22)>0,$E26*$F26,0)","v":0},null,{"$f":"IF(SUM(AU$15:AU$22)>0,$E26*$F26,0)","v":0},null,{"$f":"IF(SUM(AW$15:AW$22)>0,$E26*$F26,0)","v":0},null,{"$f":"IF(SUM(AY$15:AY$22)>0,$E26*$F26,0)","v":0},null,{"$f":"IF(SUM(BA$15:BA$22)>0,$E26*$F26,0)","v":0},null,{"$f":"IF(SUM(BC$15:BC$22)>0,$E26*$F26,0)","v":0},null,{"$f":"IF(SUM(BE$15:BE$22)>0,$E26*$F26,0)","v":0},null,{"$f":"IF(SUM(BG$15:BG$22)>0,$E26*$F26,0)","v":0},null,{"$f":"IF(SUM(BI$15:BI$22)>0,$E26*$F26,0)","v":0},null,{"$f":"IF(SUM(BK$15:BK$22)>0,$E26*$F26,0)","v":0},null,{"$f":"IF(SUM(BM$15:BM$22)>0,$E26*$F26,0)","v":0},null,{"$f":"IF(SUM(BO$15:BO$22)>0,$E26*$F26,0)","v":0},null,{"$f":"IF(SUM(BQ$15:BQ$22)>0,$E26*$F26,0)","v":0},null,{"$f":"IF(SUM(BS$15:BS$22)>0,$E26*$F26,0)","v":0},null,{"$f":"IF(SUM(BU$15:BU$22)>0,$E26*$F26,0)","v":0},null,{"$f":"IF(SUM(BW$15:BW$22)>0,$E26*$F26,0)","v":0},null,{"$f":"IF(SUM(BY$15:BY$22)>0,$E26*$F26,0)","v":0},null,{"$f":"IF(SUM(CA$15:CA$22)>0,$E26*$F26,0)","v":0},null,{"$f":"IF(SUM(CC$15:CC$22)>0,$E26*$F26,0)","v":0},null,{"$f":"IF(SUM(CE$15:CE$22)>0,$E26*$F26,0)","v":0},null,{"$f":"IF(SUM(CG$15:CG$22)>0,$E26*$F26,0)","v":0},null,{"$f":"IF(SUM(CI$15:CI$22)>0,$E26*$F26,0)","v":0},null,{"$f":"IF(SUM(CK$15:CK$22)>0,$E26*$F26,0)","v":0},null,{"$f":"IF(SUM(CM$15:CM$22)>0,$E26*$F26,0)","v":0},null,{"$f":"IF(SUM(CO$15:CO$22)>0,$E26*$F26,0)","v":0},null,{"$f":"IF(SUM(CQ$15:CQ$22)>0,$E26*$F26,0)","v":0},null,{"$f":"IF(SUM(CS$15:CS$22)>0,$E26*$F26,0)","v":0},null,{"$f":"IF(SUM(CU$15:CU$22)>0,$E26*$F26,0)","v":0},null,{"$f":"IF(SUM(CW$15:CW$22)>0,$E26*$F26,0)","v":0},null,{"$f":"IF(SUM(CY$15:CY$22)>0,$E26*$F26,0)","v":0},null,{"$f":"IF(SUM(DA$15:DA$22)>0,$E26*$F26,0)","v":0},null,{"$f":"IF(SUM(DC$15:DC$22)>0,$E26*$F26,0)","v":0},null,{"$f":"IF(SUM(DE$15:DE$22)>0,$E26*$F26,0)","v":0},null,{"$f":"IF(SUM(DG$15:DG$22)>0,$E26*$F26,0)","v":0},null,{"$f":"IF(SUM(DI$15:DI$22)>0,$E26*$F26,0)","v":0},null,{"$f":"IF(SUM(DK$15:DK$22)>0,$E26*$F26,0)","v":0},null,{"$f":"IF(SUM(DM$15:DM$22)>0,$E26*$F26,0)","v":0},null,{"$f":"IF(SUM(DO$15:DO$22)>0,$E26*$F26,0)","v":0},null,{"$f":"IF(SUM(DQ$15:DQ$22)>0,$E26*$F26,0)","v":0},null,{"$f":"IF(SUM(DS$15:DS$22)>0,$E26*$F26,0)","v":0},null,{"$f":"IF(SUM(DU$15:DU$22)>0,$E26*$F26,0)","v":0},null,{"$f":"IF(SUM(DW$15:DW$22)>0,$E26*$F26,0)","v":0}]
[null,null,null,null,null,null,null,null,null,{"$f":"IF(SUM(I$15:I$22)>0,$E27*$F27,0)","v":0},null,{"$f":"IF(SUM(K$15:K$22)>0,$E27*$F27,0)","v":0},null,{"$f":"IF(SUM(M$15:M$22)>0,$E27*$F27,0)","v":0},null,{"$f":"IF(SUM(O$15:O$22)>0,$E27*$F27,0)","v":0},null,{"$f":"IF(SUM(Q$15:Q$22)>0,$E27*$F27,0)","v":0},null,{"$f":"IF(SUM(S$15:S$22)>0,$E27*$F27,0)","v":0},null,{"$f":"IF(SUM(U$15:U$22)>0,$E27*$F27,0)","v":0},null,{"$f":"IF(SUM(W$15:W$22)>0,$E27*$F27,0)","v":0},null,{"$f":"IF(SUM(Y$15:Y$22)>0,$E27*$F27,0)","v":0},null,{"$f":"IF(SUM(AA$15:AA$22)>0,$E27*$F27,0)","v":0},null,{"$f":"IF(SUM(AC$15:AC$22)>0,$E27*$F27,0)","v":0},null,{"$f":"IF(SUM(AE$15:AE$22)>0,$E27*$F27,0)","v":0},null,{"$f":"IF(SUM(AG$15:AG$22)>0,$E27*$F27,0)","v":0},null,{"$f":"IF(SUM(AI$15:AI$22)>0,$E27*$F27,0)","v":0},null,{"$f":"IF(SUM(AK$15:AK$22)>0,$E27*$F27,0)","v":0},null,{"$f":"IF(SUM(AM$15:AM$22)>0,$E27*$F27,0)","v":0},null,{"$f":"IF(SUM(AO$15:AO$22)>0,$E27*$F27,0)","v":0},null,{"$f":"IF(SUM(AQ$15:AQ$22)>0,$E27*$F27,0)","v":0},null,{"$f":"IF(SUM(AS$15:AS$22)>0,$E27*$F27,0)","v":0},null,{"$f":"IF(SUM(AU$15:AU$22)>0,$E27*$F27,0)","v":0},null,{"$f":"IF(SUM(AW$15:AW$22)>0,$E27*$F27,0)","v":0},null,{"$f":"IF(SUM(AY$15:AY$22)>0,$E27*$F27,0)","v":0},null,{"$f":"IF(SUM(BA$15:BA$22)>0,$E27*$F27,0)","v":0},null,{"$f":"IF(SUM(BC$15:BC$22)>0,$E27*$F27,0)","v":0},null,{"$f":"IF(SUM(BE$15:BE$22)>0,$E27*$F27,0)","v":0},null,{"$f":"IF(SUM(BG$15:BG$22)>0,$E27*$F27,0)","v":0},null,{"$f":"IF(SUM(BI$15:BI$22)>0,$E27*$F27,0)","v":0},null,{"$f":"IF(SUM(BK$15:BK$22)>0,$E27*$F27,0)","v":0},null,{"$f":"IF(SUM(BM$15:BM$22)>0,$E27*$F27,0)","v":0},null,{"$f":"IF(SUM(BO$15:BO$22)>0,$E27*$F27,0)","v":0},null,{"$f":"IF(SUM(BQ$15:BQ$22)>0,$E27*$F27,0)","v":0},null,{"$f":"IF(SUM(BS$15:BS$22)>0,$E27*$F27,0)","v":0},null,{"$f":"IF(SUM(BU$15:BU$22)>0,$E27*$F27,0)","v":0},null,{"$f":"IF(SUM(BW$15:BW$22)>0,$E27*$F27,0)","v":0},null,{"$f":"IF(SUM(BY$15:BY$22)>0,$E27*$F27,0)","v":0},null,{"$f":"IF(SUM(CA$15:CA$22)>0,$E27*$F27,0)","v":0},null,{"$f":"IF(SUM(CC$15:CC$22)>0,$E27*$F27,0)","v":0},null,{"$f":"IF(SUM(CE$15:CE$22)>0,$E27*$F27,0)","v":0},null,{"$f":"IF(SUM(CG$15:CG$22)>0,$E27*$F27,0)","v":0},null,{"$f":"IF(SUM(CI$15:CI$22)>0,$E27*$F27,0)","v":0},null,{"$f":"IF(SUM(CK$15:CK$22)>0,$E27*$F27,0)","v":0},null,{"$f":"IF(SUM(CM$15:CM$22)>0,$E27*$F27,0)","v":0},null,{"$f":"IF(SUM(CO$15:CO$22)>0,$E27*$F27,0)","v":0},null,{"$f":"IF(SUM(CQ$15:CQ$22)>0,$E27*$F27,0)","v":0},null,{"$f":"IF(SUM(CS$15:CS$22)>0,$E27*$F27,0)","v":0},null,{"$f":"IF(SUM(CU$15:CU$22)>0,$E27*$F27,0)","v":0},null,{"$f":"IF(SUM(CW$15:CW$22)>0,$E27*$F27,0)","v":0},null,{"$f":"IF(SUM(CY$15:CY$22)>0,$E27*$F27,0)","v":0},null,{"$f":"IF(SUM(DA$15:DA$22)>0,$E27*$F27,0)","v":0},null,{"$f":"IF(SUM(DC$15:DC$22)>0,$E27*$F27,0)","v":0},null,{"$f":"IF(SUM(DE$15:DE$22)>0,$E27*$F27,0)","v":0},null,{"$f":"IF(SUM(DG$15:DG$22)>0,$E27*$F27,0)","v":0},null,{"$f":"IF(SUM(DI$15:DI$22)>0,$E27*$F27,0)","v":0},null,{"$f":"IF(SUM(DK$15:DK$22)>0,$E27*$F27,0)","v":0},null,{"$f":"IF(SUM(DM$15:DM$22)>0,$E27*$F27,0)","v":0},null,{"$f":"IF(SUM(DO$15:DO$22)>0,$E27*$F27,0)","v":0},null,{"$f":"IF(SUM(DQ$15:DQ$22)>0,$E27*$F27,0)","v":0},null,{"$f":"IF(SUM(DS$15:DS$22)>0,$E27*$F27,0)","v":0},null,{"$f":"IF(SUM(DU$15:DU$22)>0,$E27*$F27,0)","v":0},null,{"$f":"IF(SUM(DW$15:DW$22)>0,$E27*$F27,0)","v":0}]
[null,null,null,null,null,null,null,null,null,{"$f":"IF(SUM(I$15:I$22)>0,$E28*$F28,0)","v":0},null,{"$f":"IF(SUM(K$15:K$22)>0,$E28*$F28,0)","v":0},null,{"$f":"IF(SUM(M$15:M$22)>0,$E28*$F28,0)","v":0},null,{"$f":"IF(SUM(O$15:O$22)>0,$E28*$F28,0)","v":0},null,{"$f":"IF(SUM(Q$15:Q$22)>0,$E28*$F28,0)","v":0},null,{"$f":"IF(SUM(S$15:S$22)>0,$E28*$F28,0)","v":0},null,{"$f":"IF(SUM(U$15:U$22)>0,$E28*$F28,0)","v":0},null,{"$f":"IF(SUM(W$15:W$22)>0,$E28*$F28,0)","v":0},null,{"$f":"IF(SUM(Y$15:Y$22)>0,$E28*$F28,0)","v":0},null,{"$f":"IF(SUM(AA$15:AA$22)>0,$E28*$F28,0)","v":0},null,{"$f":"IF(SUM(AC$15:AC$22)>0,$E28*$F28,0)","v":0},null,{"$f":"IF(SUM(AE$15:AE$22)>0,$E28*$F28,0)","v":0},null,{"$f":"IF(SUM(AG$15:AG$22)>0,$E28*$F28,0)","v":0},null,{"$f":"IF(SUM(AI$15:AI$22)>0,$E28*$F28,0)","v":0},null,{"$f":"IF(SUM(AK$15:AK$22)>0,$E28*$F28,0)","v":0},null,{"$f":"IF(SUM(AM$15:AM$22)>0,$E28*$F28,0)","v":0},null,{"$f":"IF(SUM(AO$15:AO$22)>0,$E28*$F28,0)","v":0},null,{"$f":"IF(SUM(AQ$15:AQ$22)>0,$E28*$F28,0)","v":0},null,{"$f":"IF(SUM(AS$15:AS$22)>0,$E28*$F28,0)","v":0},null,{"$f":"IF(SUM(AU$15:AU$22)>0,$E28*$F28,0)","v":0},null,{"$f":"IF(SUM(AW$15:AW$22)>0,$E28*$F28,0)","v":0},null,{"$f":"IF(SUM(AY$15:AY$22)>0,$E28*$F28,0)","v":0},null,{"$f":"IF(SUM(BA$15:BA$22)>0,$E28*$F28,0)","v":0},null,{"$f":"IF(SUM(BC$15:BC$22)>0,$E28*$F28,0)","v":0},null,{"$f":"IF(SUM(BE$15:BE$22)>0,$E28*$F28,0)","v":0},null,{"$f":"IF(SUM(BG$15:BG$22)>0,$E28*$F28,0)","v":0},null,{"$f":"IF(SUM(BI$15:BI$22)>0,$E28*$F28,0)","v":0},null,{"$f":"IF(SUM(BK$15:BK$22)>0,$E28*$F28,0)","v":0},null,{"$f":"IF(SUM(BM$15:BM$22)>0,$E28*$F28,0)","v":0},null,{"$f":"IF(SUM(BO$15:BO$22)>0,$E28*$F28,0)","v":0},null,{"$f":"IF(SUM(BQ$15:BQ$22)>0,$E28*$F28,0)","v":0},null,{"$f":"IF(SUM(BS$15:BS$22)>0,$E28*$F28,0)","v":0},null,{"$f":"IF(SUM(BU$15:BU$22)>0,$E28*$F28,0)","v":0},null,{"$f":"IF(SUM(BW$15:BW$22)>0,$E28*$F28,0)","v":0},null,{"$f":"IF(SUM(BY$15:BY$22)>0,$E28*$F28,0)","v":0},null,{"$f":"IF(SUM(CA$15:CA$22)>0,$E28*$F28,0)","v":0},null,{"$f":"IF(SUM(CC$15:CC$22)>0,$E28*$F28,0)","v":0},null,{"$f":"IF(SUM(CE$15:CE$22)>0,$E28*$F28,0)","v":0},null,{"$f":"IF(SUM(CG$15:CG$22)>0,$E28*$F28,0)","v":0},null,{"$f":"IF(SUM(CI$15:CI$22)>0,$E28*$F28,0)","v":0},null,{"$f":"IF(SUM(CK$15:CK$22)>0,$E28*$F28,0)","v":0},null,{"$f":"IF(SUM(CM$15:CM$22)>0,$E28*$F28,0)","v":0},null,{"$f":"IF(SUM(CO$15:CO$22)>0,$E28*$F28,0)","v":0},null,{"$f":"IF(SUM(CQ$15:CQ$22)>0,$E28*$F28,0)","v":0},null,{"$f":"IF(SUM(CS$15:CS$22)>0,$E28*$F28,0)","v":0},null,{"$f":"IF(SUM(CU$15:CU$22)>0,$E28*$F28,0)","v":0},null,{"$f":"IF(SUM(CW$15:CW$22)>0,$E28*$F28,0)","v":0},null,{"$f":"IF(SUM(CY$15:CY$22)>0,$E28*$F28,0)","v":0},null,{"$f":"IF(SUM(DA$15:DA$22)>0,$E28*$F28,0)","v":0},null,{"$f":"IF(SUM(DC$15:DC$22)>0,$E28*$F28,0)","v":0},null,{"$f":"IF(SUM(DE$15:DE$22)>0,$E28*$F28,0)","v":0},null,{"$f":"IF(SUM(DG$15:DG$22)>0,$E28*$F28,0)","v":0},null,{"$f":"IF(SUM(DI$15:DI$22)>0,$E28*$F28,0)","v":0},null,{"$f":"IF(SUM(DK$15:DK$22)>0,$E28*$F28,0)","v":0},null,{"$f":"IF(SUM(DM$15:DM$22)>0,$E28*$F28,0)","v":0},null,{"$f":"IF(SUM(DO$15:DO$22)>0,$E28*$F28,0)","v":0},null,{"$f":"IF(SUM(DQ$15:DQ$22)>0,$E28*$F28,0)","v":0},null,{"$f":"IF(SUM(DS$15:DS$22)>0,$E28*$F28,0)","v":0},null,{"$f":"IF(SUM(DU$15:DU$22)>0,$E28*$F28,0)","v":0},null,{"$f":"IF(SUM(DW$15:DW$22)>0,$E28*$F28,0)","v":0}]

{"sheet":"Mat Perm","index":27,"n_rows":113,"n_cols":136,"rows_kept":113,"cut":false,"hidden":true,"merged":[[9,1,9,3],[10,1,10,14]]}
[null,null,"CÂMARA DOS DEPUTADOS"]
[null,null,"DEPARTAMENTO TÉCNICO"]
[null,null,"Coordenação de Planejamento e Gestão"]
[]
[null,null,"Data:",{"$f":"'Dados Gerais'!#REF!","v":{"$error":"#REF!"}}]
[null,null,"Processo:",{"$f":"'Dados Gerais'!#REF!","v":{"$error":"#REF!"}}]
[null,null,"Objeto:",{"$f":"'Dados Gerais'!#REF!","v":{"$error":"#REF!"}}]
[]
[]
[]
[null,"MATERIAIS PERMANENTES RELACIONADOS AO POSTO - PAGAMENTO DA DEPRECIAÇÃO / MANUTENÇÃO",null,null,null,null,null,null,null,null,null,null,null,null,null,null,1,null,{"$f":"Q11+1","v":2},null,{"$f":"S11+1","v":3},null,{"$f":"U11+1","v":4},null,{"$f":"W11+1","v":5},null,{"$f":"Y11+1","v":6},null,{"$f":"AA11+1","v":7},null,{"$f":"AC11+1","v":8},null,{"$f":"AE11+1","v":9},null,{"$f":"AG11+1","v":10},null,{"$f":"AI11+1","v":11},null,{"$f":"AK11+1","v":12},null,{"$f":"AM11+1","v":13},null,{"$f":"AO11+1","v":14},null,{"$f":"AQ11+1","v":15},null,{"$f":"AS11+1","v":16},null,{"$f":"AU11+1","v":17},null,{"$f":"AW11+1","v":18},null,{"$f":"AY11+1","v":19},null,{"$f":"BA11+1","v":20},null,{"$f":"BC11+1","v":21},null,{"$f":"BE11+1","v":22},null,{"$f":"BG11+1","v":23},null,{"$f":"BI11+1","v":24},null,{"$f":"BK11+1","v":25},null,{"$f":"BM11+1","v":26},null,{"$f":"BO11+1","v":27},null,{"$f":"BQ11+1","v":28},null,{"$f":"BS11+1","v":29},null,{"$f":"BU11+1","v":30},null,{"$f":"BW11+1","v":31},null,{"$f":"BY11+1","v":32},null,{"$f":"CA11+1","v":33},null,{"$f":"CC11+1","v":34},null,{"$f":"CE11+1","v":35},null,{"$f":"CG11+1","v":36},null,{"$f":"CI11+1","v":37},null,{"$f":"CK11+1","v":38},null,{"$f":"CM11+1","v":39},null,{"$f":"CO11+1","v":40},null,{"$f":"CQ11+1","v":41},null,{"$f":"CS11+1","v":42},null,{"$f":"CU11+1","v":43},null,{"$f":"CW11+1","v":44},null,{"$f":"CY11+1","v":45},null,{"$f":"DA11+1","v":46},null,{"$f":"DC11+1","v":47},null,{"$f":"DE11+1","v":48},null,{"$f":"DG11+1","v":49},null,{"$f":"DI11+1","v":50},null,{"$f":"DK11+1","v":51},null,{"$f":"DM11+1","v":52},null,{"$f":"DO11+1","v":53},null,{"$f":"DQ11+1","v":54},null,{"$f":"DS11+1","v":55},null,{"$f":"DU11+1","v":56},null,{"$f":"DW11+1","v":57},null,{"$f":"DY11+1","v":58},null,{"$f":"EA11+1","v":59},null,{"$f":"EC11+1","v":60}]
[]
[null,null,null,null,null,null,null,null,null,null,null,null,null,null,null,null,{"$f":"SUM(R12:R94)","v":0},null,{"$f":"SUM(T12:T94)","v":0},null,{"$f":"SUM(V12:V94)","v":0},null,{"$f":"SUM(X12:X94)","v":0},null,{"$f":"SUM(Z12:Z94)","v":0},null,{"$f":"SUM(AB12:AB94)","v":0},null,{"$f":"SUM(AD12:AD94)","v":0},null,{"$f":"SUM(AF12:AF94)","v":0},null,{"$f":"SUM(AH12:AH94)","v":0},null,{"$f":"SUM(AJ12:AJ94)","v":0},null,{"$f":"SUM(AL12:AL94)","v":0},null,{"$f":"SUM(AN12:AN94)","v":0},null,{"$f":"SUM(AP12:AP94)","v":0},null,{"$f":"SUM(AR12:AR94)","v":0},null,{"$f":"SUM(AT12:AT94)","v":0},null,{"$f":"SUM(AV12:AV94)","v":0},null,{"$f":"SUM(AX12:AX94)","v":0},null,{"$f":"SUM(AZ12:AZ94)","v":0},null,{"$f":"SUM(BB12:BB94)","v":0},null,{"$f":"SUM(BD12:BD94)","v":0},null,{"$f":"SUM(BF12:BF94)","v":0},null,{"$f":"SUM(BH12:BH94)","v":0},null,{"$f":"SUM(BJ12:BJ94)","v":0},null,{"$f":"SUM(BL12:BL94)","v":0},null,{"$f":"SUM(BN12:BN94)","v":0},null,{"$f":"SUM(BP12:BP94)","v":0},null,{"$f":"SUM(BR12:BR94)","v":0},null,{"$f":"SUM(BT12:BT94)","v":0},null,{"$f":"SUM(BV12:BV94)","v":0},null,{"$f":"SUM(BX12:BX94)","v":0},null,{"$f":"SUM(BZ12:BZ94)","v":0},null,{"$f":"SUM(CB12:CB94)","v":0},null,{"$f":"SUM(CD12:CD94)","v":0},null,{"$f":"SUM(CF12:CF94)","v":0},null,{"$f":"SUM(CH12:CH94)","v":0},null,{"$f":"SUM(CJ12:CJ94)","v":0},null,{"$f":"SUM(CL12:CL94)","v":0},null,{"$f":"SUM(CN12:CN94)","v":0},null,{"$f":"SUM(CP12:CP94)","v":0},null,{"$f":"SUM(CR12:CR94)","v":0},null,{"$f":"SUM(CT12:CT94)","v":0},null,{"$f":"SUM(CV12:CV94)","v":0},null,{"$f":"SUM(CX12:CX94)","v":0},null,{"$f":"SUM(CZ12:CZ94)","v":0},null,{"$f":"SUM(DB12:DB94)","v":0},null,{"$f":"SUM(DD12:DD94)","v":0},null,{"$f":"SUM(DF12:DF94)","v":0},null,{"$f":"SUM(DH12:DH94)","v":0},null,{"$f":"SUM(DJ12:DJ94)","v":0},null,{"$f":"SUM(DL12:DL94)","v":0},null,{"$f":"SUM(DN12:DN94)","v":0},null,{"$f":"SUM(DP12:DP94)","v":0},null,{"$f":"SUM(DR12:DR94)","v":0},null,{"$f":"SUM(DT12:DT94)","v":0},null,{"$f":"SUM(DV12:DV94)","v":0},null,{"$f":"SUM(DX12:DX94)","v":0},null,{"$f":"SUM(DZ12:DZ94)","v":0},null,{"$f":"SUM(EB12:EB94)","v":0},null,{"$f":"SUM(ED12:ED94)","v":0},null,{"$f":"SUM(EF12:EF94)","v":0}]
[null,null,"CATEGORIAS",null,"QUANTIDADE"]
[null,null,null,null,null,null,null,null,null,null,null,null,null,null,null,null,{"$f":"IF($C15=Q$11,1,0)","v":0},null,{"$f":"IF($C15=S$11,1,0)","v":0},null,{"$f":"IF($C15=U$11,1,0)","v":0},null,{"$f":"IF($C15=W$11,1,0)","v":0},null,{"$f":"IF($C15=Y$11,1,0)","v":0},null,{"$f":"IF($C15=AA$11,1,0)","v":0},null,{"$f":"IF($C15=AC$11,1,0)","v":0},null,{"$f":"IF($C15=AE$11,1,0)","v":0},null,{"$f":"IF($C15=AG$11,1,0)","v":0},null,{"$f":"IF($C15=AI$11,1,0)","v":0},null,{"$f":"IF($C15=AK$11,1,0)","v":0},null,{"$f":"IF($C15=AM$11,1,0)","v":0},null,{"$f":"IF($C15=AO$11,1,0)","v":0},null,{"$f":"IF($C15=AQ$11,1,0)","v":0},null,{"$f":"IF($C15=AS$11,1,0)","v":0},null,{"$f":"IF($C15=AU$11,1,0)","v":0},null,{"$f":"IF($C15=AW$11,1,0)","v":0},null,{"$f":"IF($C15=AY$11,1,0)","v":0},null,{"$f":"IF($C15=BA$11,1,0)","v":0},null,{"$f":"IF($C15=BC$11,1,0)","v":0},null,{"$f":"IF($C15=BE$11,1,0)","v":0},null,{"$f":"IF($C15=BG$11,1,0)","v":0},null,{"$f":"IF($C15=BI$11,1,0)","v":0},null,{"$f":"IF($C15=BK$11,1,0)","v":0},null,{"$f":"IF($C15=BM$11,1,0)","v":0},null,{"$f":"IF($C15=BO$11,1,0)","v":0},null,{"$f":"IF($C15=BQ$11,1,0)","v":0},null,{"$f":"IF($C15=BS$11,1,0)","v":0},null,{"$f":"IF($C15=BU$11,1,0)","v":0},null,{"$f":"IF($C15=BW$11,1,0)","v":0},null,{"$f":"IF($C15=BY$11,1,0)","v":0},null,{"$f":"IF($C15=CA$11,1,0)","v":0},null,{"$f":"IF($C15=CC$11,1,0)","v":0},null,{"$f":"IF($C15=CE$11,1,0)","v":0},null,{"$f":"IF($C15=CG$11,1,0)","v":0},null,{"$f":"IF($C15=CI$11,1,0)","v":0},null,{"$f":"IF($C15=CK$11,1,0)","v":0},null,{"$f":"IF($C15=CM$11,1,0)","v":0},null,{"$f":"IF($C15=CO$11,1,0)","v":0},null,{"$f":"IF($C15=CQ$11,1,0)","v":0},null,{"$f":"IF($C15=CS$11,1,0)","v":0},null,{"$f":"IF($C15=CU$11,1,0)","v":0},null,{"$f":"IF($C15=CW$11,1,0)","v":0},null,{"$f":"IF($C15=CY$11,1,0)","v":0},null,{"$f":"IF($C15=DA$11,1,0)","v":0},null,{"$f":"IF($C15=DC$11,1,0)","v":0},null,{"$f":"IF($C15=DE$11,1,0)","v":0},null,{"$f":"IF($C15=DG$11,1,0)","v":0},null,{"$f":"IF($C15=DI$11,1,0)","v":0},null,{"$f":"IF($C15=DK$11,1,0)","v":0},null,{"$f":"IF($C15=DM$11,1,0)","v":0},null,{"$f":"IF($C15=DO$11,1,0)","v":0},null,{"$f":"IF($C15=DQ$11,1,0)","v":0},null,{"$f":"IF($C15=DS$11,1,0)","v":0},null,{"$f":"IF($C15=DU$11,1,0)","v":0},null,{"$f":"IF($C15=DW$11,1,0)","v":0},null,{"$f":"IF($C15=DY$11,1,0)","v":0},null,{"$f":"IF($C15=EA$11,1,0)","v":0},null,{"$f":"IF($C15=EC$11,1,0)","v":0},null,{"$f":"IF($C15=EE$11,1,0)","v":0}]
[null,null,null,{"$f":"HLOOKUP($C16,'Dados Gerais'!$D$5:$BK$10,6)","v":{"$error":"#N/A"}},{"$f":"HLOOKUP($C16,'Dados Gerais'!$D$5:$BK$14,10)","v":{"$error":"#N/A"}},null,null,null,null,null,null,null,null,null,null,null,0,null,0,null,0,null,0,null,0,null,0,null,0,null,0,null,0,null,0,null,0,null,0,null,0,null,0,null,0,null,0,null,0,null,0,null,0,null,0,null,0,null,0,null,0,null,0,null,0,null,0,null,0,null,0,null,0,null,0,null,0,null,0,null,0,null,0,null,0,null,0,null,0,null,0,null,0,null,0,null,0,null,0,null,0,null,0,null,0,null,0,null,0,null,0,null,0,null,0,null,0,null,0,null,0,null,0,null,0,null,0,null,0,null,0,null,0,null,0]
[null,null,null,{"$f":"HLOOKUP($C17,'Dados Gerais'!$D$5:$BK$10,6)","v":{"$error":"#N/A"}},{"$f":"HLOOKUP($C17,'Dados Gerais'!$D$5:$BK$14,10)","v":{"$error":"#N/A"}},null,null,null,null,null,null,null,null,null,null,null,0,null,0,null,0,null,0,null,0,null,0,null,0,null,0,null,0,null,0,null,0,null,0,null,0,null,0,null,0,null,0,null,0,null,0,null,0,null,0,null,0,null,0,null,0,null,0,null,0,null,0,null,0,null,0,null,0,null,0,null,0,null,0,null,0,null,0,null,0,null,0,null,0,null,0,null,0,null,0,null,0,null,0,null,0,null,0,null,0,null,0,null,0,null,0,null,0,null,0,null,0,null,0,null,0,null,0,null,0,null,0,null,0,null,0,null,0,null,0]
[null,null,null,{"$f":"HLOOKUP($C18,'Dados Gerais'!$D$5:$BK$10,6)","v":{"$error":"#N/A"}},{"$f":"HLOOKUP($C18,'Dados Gerais'!$D$5:$BK$14,10)","v":{"$error":"#N/A"}},null,null,null,null,null,null,null,null,null,null,null,0,null,0,null,0,null,0,null,0,null,0,null,0,null,0,null,0,null,0,null,0,null,0,null,0,null,0,null,0,null,0,null,0,null,0,null,0,null,0,null,0,null,0,null,0,null,0,null,0,null,0,null,0,null,0,null,0,null,0,null,0,null,0,null,0,null,0,null,0,null,0,null,0,null,0,null,0,null,0,null,0,null,0,null,0,null,0,null,0,null,0,null,0,null,0,null,0,null,0,null,0,null,0,null,0,null,0,null,0,null,0,null,0,null,0,null,0,null,0]
[null,null,null,{"$f":"HLOOKUP($C19,'Dados Gerais'!$D$5:$BK$10,6)","v":{"$error":"#N/A"}},{"$f":"HLOOKUP($C19,'Dados Gerais'!$D$5:$BK$14,10)","v":{"$error":"#N/A"}},null,null,null,null,null,null,null,null,null,null,null,0,null,0,null,0,null,0,null,0,null,0,null,0,null,0,null,0,null,0,null,0,null,0,null,0,null,0,null,0,null,0,null,0,null,0,null,0,null,0,null,0,null,0,null,0,null,0,null,0,null,0,null,0,null,0,null,0,null,0,null,0,null,0,null,0,null,0,null,0,null,0,null,0,null,0,null,0,null,0,null,0,null,0,null,0,null,0,null,0,null,0,null,0,null,0,null,0,null,0,null,0,null,0,null,0,null,0,null,0,null,0,null,0,null,0,null,0,null,0]
[null,null,null,{"$f":"HLOOKUP($C20,'Dados Gerais'!$D$5:$BK$10,6)","v":{"$error":"#N/A"}},{"$f":"HLOOKUP($C20,'Dados Gerais'!$D$5:$BK$14,10)","v":{"$error":"#N/A"}},null,null,null,null,null,null,null,null,null,null,null,0,null,0,null,0,null,0,null,0,null,0,null,0,null,0,null,0,null,0,null,0,null,0,null,0,null,0,null,0,null,0,null,0,null,0,null,0,null,0,null,0,null,0,null,0,null,0,null,0,null,0,null,0,null,0,null,0,null,0,null,0,null,0,null,0,null,0,null,0,null,0,null,0,null,0,null,0,null,0,null,0,null,0,null,0,null,0,null,0,null,0,null,0,null,0,null,0,null,0,null,0,null,0,null,0,null,0,null,0,null,0,null,0,null,0,null,0,null,0]
[null,null,null,{"$f":"HLOOKUP($C21,'Dados Gerais'!$D$5:$BK$10,6)","v":{"$error":"#N/A"}},{"$f":"HLOOKUP($C21,'Dados Gerais'!$D$5:$BK$14,10)","v":{"$error":"#N/A"}},null,null,null,null,null,null,null,null,null,null,null,0,null,0,null,0,null,0,null,0,null,0,null,0,null,0,null,0,null,0,null,0,null,0,null,0,null,0,null,0,null,0,null,0,null,0,null,0,null,0,null,0,null,0,null,0,null,0,null,0,null,0,null,0,null,0,null,0,null,0,null,0,null,0,null,0,null,0,null,0,null,0,null,0,null,0,null,0,null,0,null,0,null,0,null,0,null,0,null,0,null,0,null,0,null,0,null,0,null,0,null,0,null,0,null,0,null,0,null,0,null,0,null,0,null,0,null,0,null,0]
[null,null,null,null,null,null,null,null,null,null,null,null,null,null,null,null,0,null,0,null,0,null,0,null,0,null,0,null,0,null,0,null,0,null,0,null,0,null,0,null,0,null,0,null,0,null,0,null,0,null,0,null,0,null,0,null,0,null,0,null,0,null,0,null,0,null,0,null,0,null,0,null,0,null,0,null,0,null,0,null,0,null,0,null,0,null,0,null,0,null,0,null,0,null,0,null,0,null,0,null,0,null,0,null,0,null,0,null,0,null,0,null,0,null,0,null,0,null,0,null,0,null,0,null,0,null,0,null,0,null,0,null,0,null,0]
[]
[null,null,"PAGAMENTO DA DEPRECIAÇÃO"]
[null,null,"ITEM","DESCRIÇÃO","QUANT ANUAL","CONTA SIAFI","VALOR DE AQ.","% RESIDUAL","VIDA ÚTIL","DEP. MENSAL","CUSTO TOTAL","BDI (%)","PREÇO TOTAL","FONTE","REFERÊNCIA"]
[]
[null,null,null,null,null,"12311.01.09",89.34,0.1,10,{"$f":"G27*(1-H27)/(I27*12)","v":0.67005000000000003},{"$f":"J27*E27","v":0},{"$f":"BDI!$E$26","v":0.21840000000000001},{"$f":"ROUND(K27*(1+L27),2)","v":0},"COTAÇÃO"]
[null,null,null,null,null,"12311.01.09",39,0.1,10,{"$f":"G28*(1-H28)/(I28*12)","v":0.29250000000000004},{"$f":"J28*E28","v":0},{"$f":"BDI!$E$26","v":0.21840000000000001},{"$f":"ROUND(K28*(1+L28),2)","v":0},"COTAÇÃO"]
[null,null,null,null,null,"12311.01.09",22.08,0.1,10,0.1656,0,{"$f":"BDI!$E$26","v":0.21840000000000001},0,"COTAÇÃO"]
[null,null,null,null,null,"12311.01.09",8.02,0.1,10,6.0150000000000002E-2,0,{"$f":"BDI!$E$26","v":0.21840000000000001},0,"COTAÇÃO"]
[null,null,null,null,null,"12311.01.09",15.64,0.1,10,0.1173,0,{"$f":"BDI!$E$26","v":0.21840000000000001},0,"COTAÇÃO"]
[null,null,null,null,null,"12311.01.09",7.63,0.1,10,5.7224999999999998E-2,0,{"$f":"BDI!$E$26","v":0.21840000000000001},0,"COTAÇÃO"]
[null,null,null,null,null,"12311.01.09",21.48,0.1,10,0.16109999999999999,0,{"$f":"BDI!$E$26","v":0.21840000000000001},0,"COTAÇÃO"]
[null,null,null,null,null,"12311.01.09",7.87,0.1,10,5.9025000000000001E-2,0,{"$f":"BDI!$E$26","v":0.21840000000000001},0,"COTAÇÃO"]
[null,null,null,null,null,"12311.01.09",6.73,0.1,10,5.0475000000000006E-2,0,{"$f":"BDI!$E$26","v":0.21840000000000001},0,"COTAÇÃO"]
[null,null,null,null,null,"12311.01.09",15.35,0.1,10,0.11512499999999999,0,{"$f":"BDI!$E$26","v":0.21840000000000001},0,"COTAÇÃO"]
[null,null,null,null,null,"12311.01.09",12.86,0.1,10,9.6449999999999994E-2,0,{"$f":"BDI!$E$26","v":0.21840000000000001},0,"COTAÇÃO"]
[null,null,null,null,null,"12311.01.09",10.119999999999999,0.1,10,7.5899999999999995E-2,0,{"$f":"BDI!$E$26","v":0.21840000000000001},0,"COTAÇÃO"]
[null,null,null,null,null,"12311.01.09",61.31,0.1,10,0.45982500000000004,0,{"$f":"BDI!$E$26","v":0.21840000000000001},0,"COTAÇÃO"]
[null,null,null,null,null,"12311.01.09",40.409999999999997,0.1,10,0.30307499999999998,0,{"$f":"BDI!$E$26","v":0.21840000000000001},0,"COTAÇÃO"]
[null,null,null,null,null,"12311.01.09",120.53,0.1,10,0.90397500000000008,0,{"$f":"BDI!$E$26","v":0.21840000000000001},0,"COTAÇÃO"]
[null,null,null,null,null,"12311.01.09",31.48,0.1,10,0.2361,0,{"$f":"BDI!$E$26","v":0.21840000000000001},0,"COTAÇÃO"]
[null,null,null,null,null,"12311.01.09",191.93,0.1,10,1.4394750000000003,0,{"$f":"BDI!$E$26","v":0.21840000000000001},0,"COTAÇÃO"]
[null,null,null,null,null,"12311.01.09",92.78,0.1,10,0.69585000000000008,0,{"$f":"BDI!$E$26","v":0.21840000000000001},0,"COTAÇÃO"]
[null,null,null,null,null,"12311.01.09",36.01,0.1,10,0.27007500000000001,0,{"$f":"BDI!$E$26","v":0.21840000000000001},0,"COTAÇÃO"]
[null,null,null,null,null,"12311.01.09",16.579999999999998,0.1,10,0.12434999999999999,0,{"$f":"BDI!$E$26","v":0.21840000000000001},0,"COTAÇÃO"]
[null,null,null,null,null,"12311.01.09",57.93,0.1,10,0.434475,0,{"$f":"BDI!$E$26","v":0.21840000000000001},0,"COTAÇÃO"]
[null,null,null,null,null,"12311.01.09",47.81,0.1,10,0.35857500000000003,0,{"$f":"BDI!$E$26","v":0.21840000000000001},0,"COTAÇÃO"]
[null,null,null,null,null,"12311.01.09",31.18,0.1,10,0.23385,0,{"$f":"BDI!$E$26","v":0.21840000000000001},0,"COTAÇÃO"]
[null,null,null,null,null,"12311.01.09",23.95,0.1,10,0.17962500000000001,0,{"$f":"BDI!$E$26","v":0.21840000000000001},0,"COTAÇÃO"]
[null,null,null,null,null,"12311.01.09",35.04,0.1,10,0.26280000000000003,0,{"$f":"BDI!$E$26","v":0.21840000000000001},0,"COTAÇÃO"]
[null,null,null,null,null,"12311.01.09",200.31,0.1,10,1.5023249999999999,0,{"$f":"BDI!$E$26","v":0.21840000000000001},0,"COTAÇÃO"]
[null,null,null,null,null,"12311.01.09",79.59,0.1,10,0.59692500000000004,0,{"$f":"BDI!$E$26","v":0.21840000000000001},0,"COTAÇÃO"]
[null,null,null,null,null,"12311.01.09",227.75,0.1,10,1.7081249999999999,0,{"$f":"BDI!$E$26","v":0.21840000000000001},0,"COTAÇÃO"]
[null,null,null,null,null,"12311.01.09",127.59,0.1,10,0.95692500000000003,0,{"$f":"BDI!$E$26","v":0.21840000000000001},0,"COTAÇÃO"]
[]
[]
[null,null,"PAGAMENTO DA MANUTENÇÃO"]
[null,null,"ITEM","DESCRIÇÃO",null,null,null,"K (calculado)","MENSAL DEPR.","% MAN X DEP","MENSAL MAN.","BDI (%)","PREÇO TOTAL"]
[]
[null,null,null,null,null,null,null,{"$f":"H68","v":0.42411600000000005},{"$f":"SUM(M27:M55)","v":0},{"$f":"H61","v":0.42411600000000005},{"$f":"I61*H61","v":0},{"$f":"L27","v":0.21840000000000001},{"$f":"ROUND(K61*(1+L61),2)","v":0}]
[]
[null,null,null,null,"K1","K2","K3","K4"]
[null,null,null,null,0.85,1,0.8,1]
[null,null,null,null,"K5","K6","K7","K8"]
[null,null,null,null,1,0.6,0.5,1.1000000000000001]
[null,null,null,null,"K9","K10","K11","RESULTADO"]
[null,null,null,"* a descrição de cada coeficiente segue abaixo",1.5,0.9,1.4,{"$f":"E64*F64*G64*H64*E66*F66*G66*H66*E68*F68*G68","v":0.42411600000000005}]
[]
[]
[null,null,"MATERIAL DE CONSUMO ASSOCIADO"]
[null,null,"ITEM","DESCRIÇÃO",null,null,null,"QUANTID/ANO","UNIDADE","VALOR DE AQ.","MENSAL MAT","BDI (%)","PREÇO TOTAL"]
[]
[null,null,null,null,null,null,null,null,null,null,{"$f":"J74*H74/12","v":0},{"$f":"L61","v":0.21840000000000001},{"$f":"ROUND(K74*(1+L74),2)","v":0}]
[]
[]
[null,null,"MATERIAL DE CONSUMO ASSOCIADO"]
[null,null,"ITEM","DESCRIÇÃO",null,null,null,null,null,null,null,null,"PREÇO TOTAL"]
[]
[null,null,1,"Componente DEPRECIAÇÃO - POR POSTO",null,null,null,null,null,null,null,null,{"$f":"I61","v":0}]
[null,null,2,"Componente MANUTENÇÃO - POR POSTO",null,null,null,null,null,null,null,null,{"$f":"M61","v":0}]
[null,null,3,"Componente MATERIAL DE CONSUMO ASSOCIADO - POR POSTO",null,null,null,null,null,null,null,null,{"$f":"M74","v":0}]
[]
[null,null,null,null,null,null,null,null,null,null,null,"SOMATÓRIO TOTAL MENSAL - POR POSTO",{"$f":"SUM(M79:M83)","v":0},null,null,null,null,{"$f":"IF(SUM(Q$15:Q$22)>0,$M84,0)","v":0},null,{"$f":"IF(SUM(S$15:S$22)>0,$M84,0)","v":0},null,{"$f":"IF(SUM(U$15:U$22)>0,$M84,0)","v":0},null,{"$f":"IF(SUM(W$15:W$22)>0,$M84,0)","v":0},null,{"$f":"IF(SUM(Y$15:Y$22)>0,$M84,0)","v":0},null,{"$f":"IF(SUM(AA$15:AA$22)>0,$M84,0)","v":0},null,{"$f":"IF(SUM(AC$15:AC$22)>0,$M84,0)","v":0},null,{"$f":"IF(SUM(AE$15:AE$22)>0,$M84,0)","v":0},null,{"$f":"IF(SUM(AG$15:AG$22)>0,$M84,0)","v":0},null,{"$f":"IF(SUM(AI$15:AI$22)>0,$M84,0)","v":0},null,{"$f":"IF(SUM(AK$15:AK$22)>0,$M84,0)","v":0},null,{"$f":"IF(SUM(AM$15:AM$22)>0,$M84,0)","v":0},null,{"$f":"IF(SUM(AO$15:AO$22)>0,$M84,0)","v":0},null,{"$f":"IF(SUM(AQ$15:AQ$22)>0,$M84,0)","v":0},null,{"$f":"IF(SUM(AS$15:AS$22)>0,$M84,0)","v":0},null,{"$f":"IF(SUM(AU$15:AU$22)>0,$M84,0)","v":0},null,{"$f":"IF(SUM(AW$15:AW$22)>0,$M84,0)","v":0},null,{"$f":"IF(SUM(AY$15:AY$22)>0,$M84,0)","v":0},null,{"$f":"IF(SUM(BA$15:BA$22)>0,$M84,0)","v":0},null,{"$f":"IF(SUM(BC$15:BC$22)>0,$M84,0)","v":0},null,{"$f":"IF(SUM(BE$15:BE$22)>0,$M84,0)","v":0},null,{"$f":"IF(SUM(BG$15:BG$22)>0,$M84,0)","v":0},null,{"$f":"IF(SUM(BI$15:BI$22)>0,$M84,0)","v":0},null,{"$f":"IF(SUM(BK$15:BK$22)>0,$M84,0)","v":0},null,{"$f":"IF(SUM(BM$15:BM$22)>0,$M84,0)","v":0},null,{"$f":"IF(SUM(BO$15:BO$22)>0,$M84,0)","v":0},null,{"$f":"IF(SUM(BQ$15:BQ$22)>0,$M84,0)","v":0},null,{"$f":"IF(SUM(BS$15:BS$22)>0,$M84,0)","v":0},null,{"$f":"IF(SUM(BU$15:BU$22)>0,$M84,0)","v":0},null,{"$f":"IF(SUM(BW$15:BW$22)>0,$M84,0)","v":0},null,{"$f":"IF(SUM(BY$15:BY$22)>0,$M84,0)","v":0},null,{"$f":"IF(SUM(CA$15:CA$22)>0,$M84,0)","v":0},null,{"$f":"IF(SUM(CC$15:CC$22)>0,$M84,0)","v":0},null,{"$f":"IF(SUM(CE$15:CE$22)>0,$M84,0)","v":0},null,{"$f":"IF(SUM(CG$15:CG$22)>0,$M84,0)","v":0},null,{"$f":"IF(SUM(CI$15:CI$22)>0,$M84,0)","v":0},null,{"$f":"IF(SUM(CK$15:CK$22)>0,$M84,0)","v":0},null,{"$f":"IF(SUM(CM$15:CM$22)>0,$M84,0)","v":0},null,{"$f":"IF(SUM(CO$15:CO$22)>0,$M84,0)","v":0},null,{"$f":"IF(SUM(CQ$15:CQ$22)>0,$M84,0)","v":0},null,{"$f":"IF(SUM(CS$15:CS$22)>0,$M84,0)","v":0},null,{"$f":"IF(SUM(CU$15:CU$22)>0,$M84,0)","v":0},null,{"$f":"IF(SUM(CW$15:CW$22)>0,$M84,0)","v":0},null,{"$f":"IF(SUM(CY$15:CY$22)>0,$M84,0)","v":0},null,{"$f":"IF(SUM(DA$15:DA$22)>0,$M84,0)","v":0},null,{"$f":"IF(SUM(DC$15:DC$22)>0,$M84,0)","v":0},null,{"$f":"IF(SUM(DE$15:DE$22)>0,$M84,0)","v":0},null,{"$f":"IF(SUM(DG$15:DG$22)>0,$M84,0)","v":0},null,{"$f":"IF(SUM(DI$15:DI$22)>0,$M84,0)","v":0},null,{"$f":"IF(SUM(DK$15:DK$22)>0,$M84,0)","v":0},null,{"$f":"IF(SUM(DM$15:DM$22)>0,$M84,0)","v":0},null,{"$f":"IF(SUM(DO$15:DO$22)>0,$M84,0)","v":0},null,{"$f":"IF(SUM(DQ$15:DQ$22)>0,$M84,0)","v":0},null,{"$f":"IF(SUM(DS$15:DS$22)>0,$M84,0)","v":0},null,{"$f":"IF(SUM(DU$15:DU$22)>0,$M84,0)","v":0},null,{"$f":"IF(SUM(DW$15:DW$22)>0,$M84,0)","v":0},null,{"$f":"IF(SUM(DY$15:DY$22)>0,$M84,0)","v":0},null,{"$f":"IF(SUM(EA$15:EA$22)>0,$M84,0)","v":0},null,{"$f":"IF(SUM(EC$15:EC$22)>0,$M84,0)","v":0},null,{"$f":"IF(SUM(EE$15:EE$22)>0,$M84,0)","v":0}]
[null,null,null,null,null,null,null,null,null,null,null,"SOMATÓRIO TOTAL ANUAL - POR POSTO",{"$f":"M84*12","v":0}]
[]
[]
[null,null,"MATERIAL DE CONSUMO ASSOCIADO"]
[null,null,"MEMÓRIA DE CÁLCULO DO COEFICIENTE DE CORRELAÇÃO MANUTENÇÃO X DEPRECIAÇÃO (K)"]
[]
[null,null,"JUSTIFICATIVAS",null,"TIPO","K1",null,"Condições de Trab","K4",null,"Tempo Vida (anos)","K6",null,"Temperatura","K8"]
[null,null,null,null,"Guindaste",0.5,null,"Em espera",0.4,null,1,0.6,null,"Muito quente (> 40º C)",1.3]
[null,null,"K1","Considerado o valor médio de 0,85","Caminhão-comum",0.8,null,"Leves",0.8,null,2,0.7,null,"Quente (30º a 40º C)",1.1000000000000001]
[null,null,"K2","Considerado o operador médio","Fora-de-estrada",1,null,"Médias",1,null,3,0.8,null,"Médio (10º a 30º C)",1]
[null,null,"K3","Consideradas ferramentas de primeira qualidade","Carregadeira",1,null,"Pesadas",1.4,null,4,0.9,null,"Frio (< 10º C)",1.2]
[null,null,"K4","Há todo o tipo de trabalho, foi considerado o valor médio","Escavadeira",1.4,null,"Severas",2,null,5,1]
[null,null,"K5","Considerando manutenção normal","Motoescrêiper",1.1000000000000001,null,null,null,null,6,1,null,"Ritmo de Trabalho","K9"]
[null,null,"K6","Equipamentos novos","Trator de esteira",1.2,null,"Manutenção","K5",null,7,1,null,"Folgado",0.9]
[null,null,"K7","220h por mês, 252 dias por ano",null,null,null,"Excelente",0.6,null,8,1.2,null,"Médio ",1]
[null,null,"K8","Clima quente, acima de 30º C","Qualid do Operador","K2",null,"Boa",0.8,null,9,1.3,null,"Com pressa",1.5]
[null,null,"K9","Ritmo de trabalho usualmente com pressa","Excelente",0.8,null,"Média",1,null,10,1.4]
[null,null,"K10","Considerado o operador médio","Boa",0.9,null,"Ruim ",1.5,null,11,2,null,"Conh do Serviço","K10"]
[null,null,"K11","Foi considerada a opção de aluguel a terceiros, ainda que a simulação seja dos custos do contratado, contudo a execução dos serviços é em local de terceiros","Média",1,null,"Inexistente",3,null,15,2,null,"Grande ",0.8]
[null,null,null,null,"Ruim",1.2,null,null,null,null,null,null,null,"Médio     ",0.9]
[null,null,null,null,"Péssima",2,null,"Horas de Uso ","K7",6000,1,null,null,"Pouco ",1]
[null,null,null,null,null,null,null,1000,0.5,8000,1.3]
[null,null,null,null,"Qualidade do Equip","K3",null,2000,0.5,10000,1.6,null,null,"Tipo do Serviço","K11"]
[null,null,null,null,"De primeira",0.8,null,3000,0.6,12000,1.9,null,null,"Mina ou Pedreira",0.8]
[null,null,null,null,"Média",1,null,4000,0.7,15000,2.2999999999999998,null,null,"Construção Geral",1]
[null,null,null,null,"Ruim",1.5,null,5000,0.9,20000,3,null,null,"Aluguel a Terceiros",1.4]
[]
[null,null,null,null,"Fonte: "]
[null,null,null,null,"MATTOS, Aldo Dórea. Como preparar orçamentos de obras. São Paulo: Pini, 2006. 281 p., il"]