{"text_format":"1","workbook":"xlsx","n_sheets":26,"sheets":["GUIA PARA PREENCHIMENTO","MODELO PROPOSTA","Remunerações"," RESUMO","1","2","3","4","5","6","7","Dados Gerais","Encargos Sociais","BDI","Uniformes","EPI","SREP","Não Rel - EPI","Equip Rel","Não Rel - Uniformes","Não Rel - Ferram.Depr","Not. Demanda","Não Rel - Mat Cons Durável","Não Rel - Serviços","Mat Cons","Mat Perm"],"not_rendered":{"charts":0,"images":11,"macros":1,"external_links":0,"defined_names":34,"comments":1,"pivot_tables":0},"unopened":[],"bounds":{"document_bytes":16777216,"sheet_cells":100000,"rows_first":2000,"rows_last":500,"rows_between":2000,"halvings":0,"cell_chars":16384,"cell_head_chars":4096},"cells_cut":0,"cells_raw":0,"read":"whole","date_system":"1900"}

{"sheet":"GUIA PARA PREENCHIMENTO","index":0,"n_rows":5,"n_cols":1,"rows_kept":5,"cut":false,"hidden":false,"merged":[]}
["GUIA PARA PREENCHIMENTO"]
[]
["1 - Preencher apenas as guias azuis:"]
[]
["2 - Recomendamos preencher somente as células com fundo azul claro. As demais possuem fórmulas e sugerimos não alterá-las."]

{"sheet":"MODELO PROPOSTA","index":1,"n_rows":61,"n_cols":2,"rows_kept":61,"cut":false,"hidden":false,"merged":[[52,1,52,9],[55,1,55,9],[56,1,56,9],[57,1,57,9],[60,1,60,9],[51,1,51,4],[51,5,51,9],[46,1,46,9],[48,1,48,9],[49,1,49,4],[49,5,49,9],[50,1,50,4],[50,5,50,9],[33,1,33,9],[34,6,34,10],[35,1,35,9],[36,1,36,9],[37,1,37,9],[38,1,38,9],[40,1,40,9],[42,1,42,9],[43,1,43,9],[44,1,44,9],[29,1,29,4],[29,5,29,9],[30,1,30,4],[30,5,30,9],[31,1,31,4],[31,5,31,9],[26,1,26,4],[26,5,26,9],[27,1,27,4],[27,5,27,9],[28,1,28,4],[28,5,28,9],[25,1,25,4],[25,5,25,9],[10,1,10,9],[11,1,11,9],[12,1,12,9],[14,1,14,9],[15,1,15,9],[16,1,16,2],[17,1,18,9],[19,1,19,9],[21,1,21,9],[22,1,22,9],[23,1,23,9],[9,1,9,9],[1,1,1,9],[4,1,4,9],[6,1,6,9],[7,1,7,9],[8,1,8,9]]}
[]
[null,"MODELO DA PROPOSTA COMPLETA"]
[]
[null,"."]
[null,"I – FORMALIZAÇÃO"]
[]
[null,"PREGÃO ELETRÔNICO N. 118/22"]
[null,"OBJETO: Prestação de serviços continuados de atendimento e suporte técnico à microinformática, com dedicação exclusiva de profissionais, por empresa especializada, para cerca de 12.000 (doze mil) estações de trabalho, pelo período de doze meses."]
[null,"LICITANTE: _____________________________________________________"]
[null,"CNPJ: ________________________________________________________"]
{"$rows_left_out":52}
{"sheet":"Remunerações","index":2,"n_rows":13,"n_cols":13,"rows_kept":13,"cut":false,"hidden":false,"merged":[[0,1,0,10]]}
[null,"QUADRO DE REMUNERAÇÕES"]
[]
[null,null,"ITEM","POSTO DE TRABALHO","QUANTIDADE","SALÁRIO","ADICIONAL DE PERICULOSIDADE","ADICIONAL DE INSALUBRIDADE","ADICIONAL NOTURNO","OUTROS","SALÁRIO COM ADICIONAIS"]
[null,null,null,"POSTO DE TRABALHO - EQUIPE DE TRABALHO"]
[null,null,1,{"$f":"HLOOKUP($C5,'Dados Gerais'!$D$5:$O$68,6)","v":"Analista de suporte técnico"},{"$f":"HLOOKUP($C5,'Dados Gerais'!$D$5:$O$68,10)","v":87},{"$f":"HLOOKUP($C5,'Dados Gerais'!$D$5:$O$68,8)","v":3698.66},{"$f":"HLOOKUP($C5,'Dados Gerais'!$D$5:$O$68,25)","v":0},{"$f":"HLOOKUP($C5,'Dados Gerais'!$D$5:$O$68,31)","v":0},{"$f":"HLOOKUP($C5,'Dados Gerais'!$D$5:$O$68,46)","v":0},{"$f":"HLOOKUP($C5,'Dados Gerais'!$D$5:$O$68,33)","v":0},{"$f":"SUM(F5:J5)","v":3698.66},null,{"$f":"E5*K5","v":321783.42}]
[null,null,2,{"$f":"HLOOKUP($C6,'Dados Gerais'!$D$5:$O$68,6)","v":"Encarregado de suporte técnico"},{"$f":"HLOOKUP($C6,'Dados Gerais'!$D$5:$O$68,10)","v":14},{"$f":"HLOOKUP($C6,'Dados Gerais'!$D$5:$O$68,8)","v":5377.41},{"$f":"HLOOKUP($C6,'Dados Gerais'!$D$5:$O$68,25)","v":0},{"$f":"HLOOKUP($C6,'Dados Gerais'!$D$5:$O$68,31)","v":0},{"$f":"HLOOKUP($C6,'Dados Gerais'!$D$5:$O$68,46)","v":0},{"$f":"HLOOKUP($C6,'Dados Gerais'!$D$5:$O$68,33)","v":0},{"$f":"SUM(F6:J6)","v":5377.41},null,{"$f":"E6*K6","v":75283.739999999991}]
[null,null,3,{"$f":"HLOOKUP($C7,'Dados Gerais'!$D$5:$O$68,6)","v":"Analista de contratos especializado em gerenciamento de fornecedores e contratos de informática"},{"$f":"HLOOKUP($C7,'Dados Gerais'!$D$5:$O$68,10)","v":2},{"$f":"HLOOKUP($C7,'Dados Gerais'!$D$5:$O$68,8)","v":6483.53},{"$f":"HLOOKUP($C7,'Dados Gerais'!$D$5:$O$68,25)","v":0},{"$f":"HLOOKUP($C7,'Dados Gerais'!$D$5:$O$68,31)","v":0},{"$f":"HLOOKUP($C7,'Dados Gerais'!$D$5:$O$68,46)","v":0},{"$f":"HLOOKUP($C7,'Dados Gerais'!$D$5:$O$68,33)","v":0},6483.53,null,12967.06]
[null,null,4,{"$f":"HLOOKUP($C8,'Dados Gerais'!$D$5:$O$68,6)","v":"Analista de suporte técnico especializado em gerenciamento de software de microinformática"},{"$f":"HLOOKUP($C8,'Dados Gerais'!$D$5:$O$68,10)","v":2},{"$f":"HLOOKUP($C8,'Dados Gerais'!$D$5:$O$68,8)","v":4846.1400000000003},{"$f":"HLOOKUP($C8,'Dados Gerais'!$D$5:$O$68,25)","v":0},{"$f":"HLOOKUP($C8,'Dados Gerais'!$D$5:$O$68,31)","v":0},{"$f":"HLOOKUP($C8,'Dados Gerais'!$D$5:$O$68,46)","v":0},{"$f":"HLOOKUP($C8,'Dados Gerais'!$D$5:$O$68,33)","v":0},4846.1400000000003,null,9692.2800000000007]
[null,null,5,{"$f":"HLOOKUP($C9,'Dados Gerais'!$D$5:$O$68,6)","v":"Analista de suporte técnico especializado em levantamento de requisitos, especificação e orçamento de contratações de microinformática"},{"$f":"HLOOKUP($C9,'Dados Gerais'!$D$5:$O$68,10)","v":2},{"$f":"HLOOKUP($C9,'Dados Gerais'!$D$5:$O$68,8)","v":5809.79},{"$f":"HLOOKUP($C9,'Dados Gerais'!$D$5:$O$68,25)","v":0},{"$f":"HLOOKUP($C9,'Dados Gerais'!$D$5:$O$68,31)","v":0},{"$f":"HLOOKUP($C9,'Dados Gerais'!$D$5:$O$68,46)","v":0},{"$f":"HLOOKUP($C9,'Dados Gerais'!$D$5:$O$68,33)","v":0},5809.79,null,11619.58]
[null,null,6,{"$f":"HLOOKUP($C10,'Dados Gerais'!$D$5:$O$68,6)","v":"Analista de qualidade especializado em monitoramento e controle de qualidade de service desk"},{"$f":"HLOOKUP($C10,'Dados Gerais'!$D$5:$O$68,10)","v":2},{"$f":"HLOOKUP($C10,'Dados Gerais'!$D$5:$O$68,8)","v":4582.8500000000004},{"$f":"HLOOKUP($C10,'Dados Gerais'!$D$5:$O$68,25)","v":0},{"$f":"HLOOKUP($C10,'Dados Gerais'!$D$5:$O$68,31)","v":0},{"$f":"HLOOKUP($C10,'Dados Gerais'!$D$5:$O$68,46)","v":0},{"$f":"HLOOKUP($C10,'Dados Gerais'!$D$5:$O$68,33)","v":0},4582.8500000000004,null,9165.7000000000007]
{"$rows_left_out":4}
{"sheet":" RESUMO","index":3,"n_rows":77,"n_cols":12,"rows_kept":77,"cut":false,"hidden":false,"merged":[[68,10,69,18],[70,3,70,7],[74,3,74,7],[59,3,59,7],[2,1,2,8],[32,1,32,8],[17,1,17,8]]}
[]
[]
[null,"RESUMO - TOTAIS MENSAIS - FATURA ORDINÁRIA (SEM O 13º E SEM OS ITENS SOB DEMANDA)"]
[]
[]
[null,null,"ITEM","POSTO DE TRABALHO","QUANTIDADE","PREÇO UNIT       (SEM O 13º)","DESTAQUE DO 13º","PREÇO POR EMPREGADO","PREÇO TOTAL (MENSAL)"]
[null,null,1,{"$f":"HLOOKUP(C7,'Dados Gerais'!$D$5:$BJ$10,6)","v":"Analista de suporte técnico"},{"$f":"HLOOKUP(C7,'Dados Gerais'!$D$5:$BJ$14,10)","v":87},{"$f":"'1'!$E$116","v":8935.918298999999},0,{"$f":"G7+F7","v":8935.918298999999},{"$f":"H7*E7","v":777424.89201299986}]
[null,null,2,{"$f":"HLOOKUP(C8,'Dados Gerais'!$D$5:$BJ$10,6)","v":"Encarregado de suporte técnico"},{"$f":"HLOOKUP(C8,'Dados Gerais'!$D$5:$BJ$14,10)","v":14},{"$f":"'2'!$E$116","v":12171.091938999998},0,12171.091938999998,170395.28714599996]
[null,null,3,{"$f":"HLOOKUP(C9,'Dados Gerais'!$D$5:$BJ$10,6)","v":"Analista de contratos especializado em gerenciamento de fornecedores e contratos de informática"},{"$f":"HLOOKUP(C9,'Dados Gerais'!$D$5:$BJ$14,10)","v":2},{"$f":"'3'!$E$116","v":14408.567747999999},0,14408.567747999999,28817.135495999999]
[null,null,4,{"$f":"HLOOKUP(C10,'Dados Gerais'!$D$5:$BJ$10,6)","v":"Analista de suporte técnico especializado em gerenciamento de software de microinformática"},{"$f":"HLOOKUP(C10,'Dados Gerais'!$D$5:$BJ$14,10)","v":2},{"$f":"'4'!$E$116","v":11109.403194999999},0,11109.403194999999,22218.806389999998]
{"$rows_left_out":68}
{"sheet":"1","index":4,"n_rows":119,"n_cols":8,"rows_kept":119,"cut":false,"hidden":false,"merged":[[106,1,106,3],[1,1,1,5],[2,1,2,5],[7,1,7,3],[17,1,17,3],[4,1,4,2],[46,1,46,3],[56,1,56,3],[74,1,74,3],[83,1,83,3],[5,1,5,2],[39,3,39,5],[68,3,68,5]]}
[]
[null,"PLANILHA DE ESTIMATIVA DE CUSTOS"]
[null,"Padrão IN 05/2017 e IN 07/2018 - MPDG"]
[]
[null,1,null,{"$f":"HLOOKUP($B$5,'Dados Gerais'!$D$5:$BJ$20,6)","v":"Analista de suporte técnico"},"QUANTIDADE",{"$f":"HLOOKUP($B$5,'Dados Gerais'!$D$5:$BJ$20,10)","v":87}]
[null,"CCT",null,{"$f":"HLOOKUP($B$5,'Dados Gerais'!$D$5:$BJ$20,15)","v":"SINDPD/DF X SINDESEI/DF 2021/2022 Nº DF000608/2021"},"DATA-BASE",{"$f":"HLOOKUP($B$5,'Dados Gerais'!$D$5:$BJ$20,16)","v":44317}]
[]
[null,"MÓDULO 1 - COMPOSIÇÃO DA REMUNERAÇÃO",null,null,null,"Valor"]
[null,null,"A","Salário-Base",null,{"$f":"HLOOKUP($B$5,'Dados Gerais'!$D$5:$BJ$20,8)","v":3698.66}]
[null,null,"B","Adicional de Periculosidade",null,{"$f":"HLOOKUP($B$5,'Dados Gerais'!$D$5:$BJ$37,25)","v":0}]
{"$rows_left_out":110}
{"sheet":"2","index":5,"n_rows":119,"n_cols":8,"rows_kept":119,"cut":false,"hidden":false,"merged":[[1,1,1,5],[2,1,2,5],[4,1,4,2],[5,1,5,2],[7,1,7,3],[17,1,17,3],[106,1,106,3],[39,3,39,5],[46,1,46,3],[56,1,56,3],[68,3,68,5],[74,1,74,3],[83,1,83,3]]}
[]
[null,"PLANILHA DE ESTIMATIVA DE CUSTOS"]
[null,"Padrão IN 05/2017 e IN 07/2018 - MPDG"]
[]
[null,2,null,{"$f":"HLOOKUP($B$5,'Dados Gerais'!$D$5:$BJ$20,6)","v":"Encarregado de suporte técnico"},"QUANTIDADE",{"$f":"HLOOKUP($B$5,'Dados Gerais'!$D$5:$BJ$20,10)","v":14}]
[null,"CCT",null,{"$f":"HLOOKUP($B$5,'Dados Gerais'!$D$5:$BJ$20,15)","v":"SINDPD/DF X SINDESEI/DF 2021/2022 Nº DF000608/2021"},"DATA-BASE",{"$f":"HLOOKUP($B$5,'Dados Gerais'!$D$5:$BJ$20,16)","v":44317}]
[]
[null,"MÓDULO 1 - COMPOSIÇÃO DA REMUNERAÇÃO",null,null,null,"Valor"]
[null,null,"A","Salário-Base",null,{"$f":"HLOOKUP($B$5,'Dados Gerais'!$D$5:$BJ$20,8)","v":5377.41}]
[null,null,"B","Adicional de Periculosidade",null,{"$f":"HLOOKUP($B$5,'Dados Gerais'!$D$5:$BJ$37,25)","v":0}]
{"$rows_left_out":110}
{"sheet":"3","index":6,"n_rows":119,"n_cols":8,"rows_kept":119,"cut":false,"hidden":false,"merged":[[1,1,1,5],[2,1,2,5],[4,1,4,2],[5,1,5,2],[7,1,7,3],[17,1,17,3],[106,1,106,3],[39,3,39,5],[46,1,46,3],[56,1,56,3],[68,3,68,5],[74,1,74,3],[83,1,83,3]]}
[]
[null,"PLANILHA DE ESTIMATIVA DE CUSTOS"]
[null,"Padrão IN 05/2017 e IN 07/2018 - MPDG"]
[]
[null,3,null,{"$f":"HLOOKUP($B$5,'Dados Gerais'!$D$5:$BJ$20,6)","v":"Analista de contratos especializado em gerenciamento de fornecedores e contratos de informática"},"QUANTIDADE",{"$f":"HLOOKUP($B$5,'Dados Gerais'!$D$5:$BJ$20,10)","v":2}]
[null,"CCT",null,{"$f":"HLOOKUP($B$5,'Dados Gerais'!$D$5:$BJ$20,15)","v":"SINDPD/DF X SINDESEI/DF 2021/2022 Nº DF000608/2021"},"DATA-BASE",{"$f":"HLOOKUP($B$5,'Dados Gerais'!$D$5:$BJ$20,16)","v":44317}]
[]
[null,"MÓDULO 1 - COMPOSIÇÃO DA REMUNERAÇÃO",null,null,null,"Valor"]
[null,null,"A","Salário-Base",null,{"$f":"HLOOKUP($B$5,'Dados Gerais'!$D$5:$BJ$20,8)","v":6483.53}]
[null,null,"B","Adicional de Periculosidade",null,{"$f":"HLOOKUP($B$5,'Dados Gerais'!$D$5:$BJ$37,25)","v":0}]
{"$rows_left_out":110}
{"sheet":"4","index":7,"n_rows":119,"n_cols":8,"rows_kept":119,"cut":false,"hidden":false,"merged":[[1,1,1,5],[2,1,2,5],[4,1,4,2],[5,1,5,2],[7,1,7,3],[17,1,17,3],[106,1,106,3],[39,3,39,5],[46,1,46,3],[56,1,56,3],[68,3,68,5],[74,1,74,3],[83,1,83,3]]}
[]
[null,"PLANILHA DE ESTIMATIVA DE CUSTOS"]
[null,"Padrão IN 05/2017 e IN 07/2018 - MPDG"]
[]
[null,4,null,{"$f":"HLOOKUP($B$5,'Dados Gerais'!$D$5:$BJ$20,6)","v":"Analista de suporte técnico especializado em gerenciamento de software de microinformática"},"QUANTIDADE",{"$f":"HLOOKUP($B$5,'Dados Gerais'!$D$5:$BJ$20,10)","v":2}]
[null,"CCT",null,{"$f":"HLOOKUP($B$5,'Dados Gerais'!$D$5:$BJ$20,15)","v":"SINDPD/DF X SINDESEI/DF 2021/2022 Nº DF000608/2021"},"DATA-BASE",{"$f":"HLOOKUP($B$5,'Dados Gerais'!$D$5:$BJ$20,16)","v":44317}]
[]
[null,"MÓDULO 1 - COMPOSIÇÃO DA REMUNERAÇÃO",null,null,null,"Valor"]
[null,null,"A","Salário-Base",null,{"$f":"HLOOKUP($B$5,'Dados Gerais'!$D$5:$BJ$20,8)","v":4846.1400000000003}]
[null,null,"B","Adicional de Periculosidade",null,{"$f":"HLOOKUP($B$5,'Dados Gerais'!$D$5:$BJ$37,25)","v":0}]
{"$rows_left_out":110}
{"sheet":"5","index":8,"n_rows":119,"n_cols":8,"rows_kept":119,"cut":false,"hidden":false,"merged":[[1,1,1,5],[2,1,2,5],[4,1,4,2],[5,1,5,2],[7,1,7,3],[17,1,17,3],[106,1,106,3],[39,3,39,5],[46,1,46,3],[56,1,56,3],[68,3,68,5],[74,1,74,3],[83,1,83,3]]}
[]
[null,"PLANILHA DE ESTIMATIVA DE CUSTOS"]
[null,"Padrão IN 05/2017 e IN 07/2018 - MPDG"]
[]
[null,5,null,{"$f":"HLOOKUP($B$5,'Dados Gerais'!$D$5:$BJ$20,6)","v":"Analista de suporte técnico especializado em levantamento de requisitos, especificação e orçamento de contratações de microinformática"},"QUANTIDADE",{"$f":"HLOOKUP($B$5,'Dados Gerais'!$D$5:$BJ$20,10)","v":2}]
[null,"CCT",null,{"$f":"HLOOKUP($B$5,'Dados Gerais'!$D$5:$BJ$20,15)","v":"SINDPD/DF X SINDESEI/DF 2021/2022 Nº DF000608/2021"},"DATA-BASE",{"$f":"HLOOKUP($B$5,'Dados Gerais'!$D$5:$BJ$20,16)","v":44317}]
[]
[null,"MÓDULO 1 - COMPOSIÇÃO DA REMUNERAÇÃO",null,null,null,"Valor"]
[null,null,"A","Salário-Base",null,{"$f":"HLOOKUP($B$5,'Dados Gerais'!$D$5:$BJ$20,8)","v":5809.79}]
[null,null,"B","Adicional de Periculosidade",null,{"$f":"HLOOKUP($B$5,'Dados Gerais'!$D$5:$BJ$37,25)","v":0}]
{"$rows_left_out":110}
{"sheet":"6","index":9,"n_rows":119,"n_cols":8,"rows_kept":119,"cut":false,"hidden":false,"merged":[[17,1,17,3],[1,1,1,5],[2,1,2,5],[4,1,4,2],[5,1,5,2],[7,1,7,3],[106,1,106,3],[39,3,39,5],[46,1,46,3],[56,1,56,3],[68,3,68,5],[74,1,74,3],[83,1,83,3]]}
[]
[null,"PLANILHA DE ESTIMATIVA DE CUSTOS"]
[null,"Padrão IN 05/2017 e IN 07/2018 - MPDG"]
[]
[null,6,null,{"$f":"HLOOKUP($B$5,'Dados Gerais'!$D$5:$BJ$20,6)","v":"Analista de qualidade especializado em monitoramento e controle de qualidade de service desk"},"QUANTIDADE",{"$f":"HLOOKUP($B$5,'Dados Gerais'!$D$5:$BJ$20,10)","v":2}]
[null,"CCT",null,{"$f":"HLOOKUP($B$5,'Dados Gerais'!$D$5:$BJ$20,15)","v":"SINDPD/DF X SINDESEI/DF 2021/2022 Nº DF000608/2021"},"DATA-BASE",{"$f":"HLOOKUP($B$5,'Dados Gerais'!$D$5:$BJ$20,16)","v":44317}]
[]
[null,"MÓDULO 1 - COMPOSIÇÃO DA REMUNERAÇÃO",null,null,null,"Valor"]
[null,null,"A","Salário-Base",null,{"$f":"HLOOKUP($B$5,'Dados Gerais'!$D$5:$BJ$20,8)","v":4582.8500000000004}]
[null,null,"B","Adicional de Periculosidade",null,{"$f":"HLOOKUP($B$5,'Dados Gerais'!$D$5:$BJ$37,25)","v":0}]
{"$rows_left_out":110}
{"sheet":"7","index":10,"n_rows":119,"n_cols":8,"rows_kept":119,"cut":false,"hidden":false,"merged":[[7,1,7,3],[1,1,1,5],[2,1,2,5],[4,1,4,2],[5,1,5,2],[83,1,83,3],[106,1,106,3],[17,1,17,3],[39,3,39,5],[46,1,46,3],[56,1,56,3],[68,3,68,5],[74,1,74,3]]}
[]
[null,"PLANILHA DE ESTIMATIVA DE CUSTOS"]
[null,"Padrão IN 05/2017 e IN 07/2018 - MPDG"]
[]
[null,7,null,{"$f":"HLOOKUP($B$5,'Dados Gerais'!$D$5:$BJ$20,6)","v":"Líder de service desk"},"QUANTIDADE",{"$f":"HLOOKUP($B$5,'Dados Gerais'!$D$5:$BJ$20,10)","v":2}]
[null,"CCT",null,{"$f":"HLOOKUP($B$5,'Dados Gerais'!$D$5:$BJ$20,15)","v":"SINDPD/DF X SINDESEI/DF 2021/2022 Nº DF000608/2021"},"DATA-BASE",{"$f":"HLOOKUP($B$5,'Dados Gerais'!$D$5:$BJ$20,16)","v":44317}]
[]
[null,"MÓDULO 1 - COMPOSIÇÃO DA REMUNERAÇÃO",null,null,null,"Valor"]
[null,null,"A","Salário-Base",null,{"$f":"HLOOKUP($B$5,'Dados Gerais'!$D$5:$BJ$20,8)","v":6970.64}]
[null,null,"B","Adicional de Periculosidade",null,{"$f":"HLOOKUP($B$5,'Dados Gerais'!$D$5:$BJ$37,25)","v":0}]
{"$rows_left_out":110}
{"sheet":"Dados Gerais","index":11,"n_rows":118,"n_cols":62,"rows_kept":118,"cut":false,"hidden":false,"merged":[[2,1,2,2]]}
[]
[]
[null,"INFORMAÇÕES DE ENTRADA"]
[]
[null,null,null,1,2,3,4,5,6,7,9,10,11,12,13,14,15,16,17,18,19,20,21,22,23,24,25,26,27,28,29,30,31,32,33,34,35,36,37,38,39,40,41,42,43,44,45,46,47,48,49,50,51,52,53,54,55,56,57,58,59,60]
[null,"",null,"CARGO 1","CARGO 2","CARGO 3","CARGO 4","CARGO 5","CARGO 6","CARGO 7","CARGO 9","CARGO 10","CARGO 11","CARGO 12","CARGO 13","CARGO 14","CARGO 15","CARGO 16","CARGO 17","CARGO 18","CARGO 19","CARGO 20","CARGO 21","CARGO 22","CARGO 23","CARGO 24","CARGO 25","CARGO 26","CARGO 27","CARGO 28","CARGO 29","CARGO 30","CARGO 31","CARGO 32","CARGO 33","CARGO 34","CARGO 35","CARGO 36","CARGO 37","CARGO 38","CARGO 39","CARGO 40","CARGO 41","CARGO 42","CARGO 43","CARGO 44","CARGO 45","CARGO 46","CARGO 47","CARGO 48","CARGO 49","CARGO 50","CARGO 51","CARGO 52","CARGO 53","CARGO 54","CARGO 55","CARGO 56","CARGO 57","CARGO 58","CARGO 59","CARGO 60"]
[null,"INFORMAÇÕES BÁSICAS"]
[]
[null,"DESCRIÇÃO DOS POSTOS DE SERVIÇO"]
[null,null,null,"Analista de suporte técnico","Encarregado de suporte técnico","Analista de contratos especializado em gerenciamento de fornecedores e contratos de informática","Analista de suporte técnico especializado em gerenciamento de software de microinformática","Analista de suporte técnico especializado em levantamento de requisitos, especificação e orçamento de contratações de microinformática","Analista de qualidade especializado em monitoramento e controle de qualidade de service desk","Líder de service desk"]
{"$rows_left_out":109}
{"sheet":"Encargos Sociais","index":12,"n_rows":45,"n_cols":7,"rows_kept":45,"cut":false,"hidden":false,"merged":[[1,1,1,3],[2,1,2,4]]}
[]
[]
[null,"ENCARGOS SOCIAIS SOBRE A MÃO DE OBRA"]
[null,null,null,null,"Percentuais"]
[]
[null,"Referência:"]
[null,null,"SINAPI OUT/2018"]
[]
[null,"Categorias:"]
[null,null,"TODAS"]
{"$rows_left_out":36}
{"sheet":"BDI","index":13,"n_rows":26,"n_cols":7,"rows_kept":26,"cut":false,"hidden":false,"merged":[[1,1,1,3],[2,1,2,4]]}
[]
[]
[null,"COMPOSIÇÃO DA TAXA DE CUSTOS INDIRETOS, TRIBUTOS E LUCRO - BDI"]
[null,"APLICAÇÃO: MÃO DE OBRA, 13º, MATERIAIS, EPC E EQUIPAMENTO DE REGISTRO DE FREQUÊNCIA",null,null,"Percentuais"]
[]
[null,"Custos Indiretos da Contratada",null,null,{"$f":"SUM(E7:E8)","v":6.2799999999999995E-2}]
[null,null,"A","Administração Central (despesas de gestão da empresa, escritório e treinamento de seu pessoal, e eventuais como máscaras obrigatórias)",2.5999999999999999E-2,null,"* Nota 1 - O Somatório da Administração Central com o Lucro deve ser inferior a 12%"]
[null,null,"B","Seguros, Garantias e Riscos (o risco foi majorado considerando o modelo híbrido, com risco de redutores na fatura mensal)",{"$f":"3.48%+0.2%","v":3.6799999999999999E-2},null,"* Nota 2 - O risco previsto para o porte do contrato majorado em mais 0,20% devido ao não pagamento dos insumos componentes do custo do posto quando da ausência do mesmo."]
[]
[null,"Lucro",null,null,{"$f":"SUM(E11:E11)","v":0.04}]
{"$rows_left_out":17}
{"sheet":"Uniformes","index":14,"n_rows":28,"n_cols":130,"rows_kept":28,"cut":false,"hidden":true,"merged":[[9,1,9,3],[10,1,10,7],[6,3,6,7]]}
[null,null,"CÂMARA DOS DEPUTADOS"]
[null,null,"DEPARTAMENTO TÉCNICO"]
[null,null,"Coordenação de Planejamento e Gestão"]
[]
[null,null,"Data:",{"$f":"'Dados Gerais'!#REF!","v":{"$error":"#REF!"}}]
[null,null,"Processo:",{"$f":"'Dados Gerais'!#REF!","v":{"$error":"#REF!"}}]
[null,null,"Objeto:",{"$f":"'Dados Gerais'!#REF!","v":{"$error":"#REF!"}}]
[]
[]
[]
{"$rows_left_out":19}
{"sheet":"EPI","index":15,"n_rows":205,"n_cols":128,"rows_kept":205,"cut":false,"hidden":true,"merged":[[9,1,9,3],[10,1,10,5],[6,3,6,5]]}
[null,null,"CÂMARA DOS DEPUTADOS"]
[null,null,"DEPARTAMENTO TÉCNICO"]
[null,null,"Coordenação de Planejamento e Gestão"]
[]
[null,null,"Data:",{"$f":"'Dados Gerais'!#REF!","v":{"$error":"#REF!"}}]
[null,null,"Processo:",{"$f":"'Dados Gerais'!#REF!","v":{"$error":"#REF!"}}]
[null,null,"Objeto:",{"$f":"'Dados Gerais'!#REF!","v":{"$error":"#REF!"}}]
[]
[]
[]
{"$rows_left_out":196}
{"sheet":"SREP","index":16,"n_rows":74,"n_cols":15,"rows_kept":74,"cut":false,"hidden":false,"merged":[[1,1,1,3],[2,1,2,14]]}
[]
[]
[null,"SISTEMA DE REGISTRO ELETRÔNICO DE PRESENÇA - SREP"]
[]
[]
[null,null,"PAGAMENTO DA DEPRECIAÇÃO"]
[null,null,"ITEM","DESCRIÇÃO","QUANT ANUAL","CONTA SIAFI","VALOR DE AQ.","% RESIDUAL","VIDA ÚTIL","DEP. MENSAL","CUSTO TOTAL","BDI (%)","PREÇO TOTAL","FONTE","REFERÊNCIA"]
[]
[null,null,1,"Equipamento de Registro Eletrônico de Ponto, de parede, com teclado externo e leitor biométrico, em conformidade com a Portaria 1.510/2009 do MT",4,"12311.01.24\n(máquinas e equip\neletrônicos)",1661.4,0.1,10,{"$f":"G9*(1-H9)/(I9*12)","v":12.460500000000001},{"$f":"J9*E9","v":49.842000000000006},{"$f":"BDI!E26","v":0.26790000000000003},{"$f":"ROUND(K9*(1+L9),2)","v":63.19},"COTAÇÃO"]
[]
{"$rows_left_out":65}
{"sheet":"Não Rel - EPI","index":17,"n_rows":20,"n_cols":15,"rows_kept":20,"cut":false,"hidden":true,"merged":[[9,1,9,4],[10,1,10,11]]}
[null,null,"CÂMARA DOS DEPUTADOS"]
[null,null,"DEPARTAMENTO TÉCNICO"]
[null,null,"Coordenação de Planejamento e Gestão"]
[]
[null,null,"Data:",{"$f":"'Dados Gerais'!#REF!","v":{"$error":"#REF!"}}]
[null,null,"Processo:",{"$f":"'Dados Gerais'!#REF!","v":{"$error":"#REF!"}}]
[null,null,"Objeto:",{"$f":"'Dados Gerais'!#REF!","v":{"$error":"#REF!"}}]
[]
[]
[]
{"$rows_left_out":11}
{"sheet":"Equip Rel","index":18,"n_rows":80,"n_cols":136,"rows_kept":80,"cut":false,"hidden":true,"merged":[[9,1,9,3],[10,1,10,14]]}
[null,null,"CÂMARA DOS DEPUTADOS"]
[null,null,"DEPARTAMENTO TÉCNICO"]
[null,null,"Coordenação de Planejamento e Gestão"]
[]
[null,null,"Data:",{"$f":"'Dados Gerais'!#REF!","v":{"$error":"#REF!"}}]
[null,null,"Processo:",{"$f":"'Dados Gerais'!#REF!","v":{"$error":"#REF!"}}]
[null,null,"Objeto:",{"$f":"'Dados Gerais'!#REF!","v":{"$error":"#REF!"}}]
[]
[]
[]
{"$rows_left_out":71}
{"sheet":"Não Rel - Uniformes","index":19,"n_rows":49,"n_cols":14,"rows_kept":49,"cut":false,"hidden":false,"merged":[[1,1,1,4],[2,1,2,13]]}
[]
[]
[null,"UNIFORMES NÃO RELACIONADOS DIRETAMENTE A UM POSTO DE TRABALHO"]
[]
[]
[null,null,"ITEM","CÓDIGO","DESCRIÇÃO","QUANT SEMESTRAL","QUANT ANUAL","UNIDADE","CUSTO UNITÁRIO","CUSTO TOTAL","BDI (%)","PREÇO TOTAL","FONTE","REFERÊNCIA"]
[]
[null,null,1,"UNIF.01","Terno completo na cor azul noite, em microfibra",{"$f":"SUM('Dados Gerais'!$D$14:$J$14)*2","v":222},{"$f":"F8*2","v":444},"unid",294.95,{"$f":"I8*G8","v":130957.79999999999},{"$f":"BDI!E26","v":0.26790000000000003},{"$f":"ROUND(J8*(1+K8),2)","v":166041.39000000001},"Cotação"]
[null,null,2,"UNIF.02","Camisa na cor branca, 100% algodão",{"$f":"SUM('Dados Gerais'!$D$14:$J$14)*5","v":555},{"$f":"F9*2","v":1110},"unid",76.674000000000007,{"$f":"I9*G9","v":85108.140000000014},{"$f":"K8","v":0.26790000000000003},{"$f":"ROUND(J9*(1+K9),2)","v":107908.61},"Cotação"]
[null,null,3,"UNIF.03","Gravata preta",{"$f":"SUM('Dados Gerais'!$D$14:$J$14)*1","v":111},222,"unid",26.802500000000002,5950.1550000000007,{"$f":"K9","v":0.26790000000000003},7544.2,"Cotação"]
{"$rows_left_out":40}
{"sheet":"Não Rel - Ferram.Depr","index":20,"n_rows":71,"n_cols":17,"rows_kept":71,"cut":false,"hidden":false,"merged":[[1,1,1,3],[2,1,2,14],[60,3,61,3]]}
[]
[]
[null,"EQUIPAMENTOS NÃO RELACIONADOS DIRETAMENTE A UM POSTO DE TRABALHO - PAGAMENTO DA DEPRECIAÇÃO / MANUTENÇÃO"]
[]
[]
[null,null,"PAGAMENTO DA DEPRECIAÇÃO"]
[null,null,"ITEM","DESCRIÇÃO","QUANT ANUAL","CONTA SIAFI","VALOR DE AQ.","% RESIDUAL","VIDA ÚTIL","DEP. MENSAL","CUSTO TOTAL","BDI (%)","PREÇO TOTAL","FONTE","REFERÊNCIA"]
[]
[null,null,1,"Headset com microfone - modelo de referencia Elgin F11-1NSRJ",88,"12311.01.24",155.91500000000002,0.1,10,{"$f":"G9*(1-H9)/(I9*12)","v":1.1693625000000003},{"$f":"J9*E9","v":102.90390000000002},{"$f":"BDI!$E$26","v":0.26790000000000003},{"$f":"ROUND(K9*(1+L9),2)","v":130.47},"COTAÇÃO",null,null,41]
[null,null,2,"HD externo - 1 Tb ou superior - marca de referencia Seagate",20,"12311.01.24",383,0.1,10,2.8725000000000001,57.45,{"$f":"BDI!$E$26","v":0.26790000000000003},72.84,"COTAÇÃO",null,null,41]
{"$rows_left_out":62}
{"sheet":"Not. Demanda","index":21,"n_rows":49,"n_cols":8,"rows_kept":49,"cut":false,"hidden":false,"merged":[[1,1,1,3],[2,1,2,7]]}
[]
[]
[null,"ADICIONAL NOTURNO SOB DEMANDA"]
[]
[]
[null,null,"CATEGORIAS",null,null,null,"HORAS / MÊS","% NOTURNA"]
[]
[null,null,4,{"$f":"HLOOKUP($C8,'Dados Gerais'!$D$5:$BJ$10,6)","v":"Analista de suporte técnico especializado em gerenciamento de software de microinformática"},null,null,{"$f":"2*0.242*22","v":10.648},0.2]
[null,null,5,{"$f":"HLOOKUP($C9,'Dados Gerais'!$D$5:$BJ$10,6)","v":"Analista de suporte técnico especializado em levantamento de requisitos, especificação e orçamento de contratações de microinformática"},null,null,{"$f":"2*0.242*22","v":10.648},0.2]
[]
{"$rows_left_out":40}
{"sheet":"Não Rel - Mat Cons Durável","index":22,"n_rows":43,"n_cols":14,"rows_kept":43,"cut":false,"hidden":true,"merged":[[9,1,9,4],[10,1,10,13]]}
[null,null,"CÂMARA DOS DEPUTADOS"]
[null,null,"DEPARTAMENTO TÉCNICO"]
[null,null,"Coordenação de Planejamento e Gestão"]
[]
[null,null,"Data:",{"$f":"'Dados Gerais'!#REF!","v":{"$error":"#REF!"}}]
[null,null,"Processo:",{"$f":"'Dados Gerais'!#REF!","v":{"$error":"#REF!"}}]
[null,null,"Objeto:",{"$f":"'Dados Gerais'!#REF!","v":{"$error":"#REF!"}}]
[]
[]
[]
{"$rows_left_out":34}
{"sheet":"Não Rel - Serviços","index":23,"n_rows":19,"n_cols":13,"rows_kept":19,"cut":false,"hidden":true,"merged":[[9,1,9,4],[10,1,10,12]]}
[null,null,"CÂMARA DOS DEPUTADOS"]
[null,null,"DEPARTAMENTO TÉCNICO"]
[null,null,"Coordenação de Planejamento e Gestão"]
[]
[null,null,"Data:",{"$f":"'Dados Gerais'!#REF!","v":{"$error":"#REF!"}}]
[null,null,"Processo:",{"$f":"'Dados Gerais'!#REF!","v":{"$error":"#REF!"}}]
[null,null,"Objeto:",{"$f":"'Dados Gerais'!#REF!","v":{"$error":"#REF!"}}]
[]
[]
[]
{"$rows_left_out":10}
{"sheet":"Mat Cons","index":24,"n_rows":28,"n_cols":128,"rows_kept":28,"cut":false,"hidden":true,"merged":[[9,1,9,3],[10,1,10,5]]}
[null,null,"CÂMARA DOS DEPUTADOS"]
[null,null,"DEPARTAMENTO TÉCNICO"]
[null,null,"Coordenação de Planejamento e Gestão"]
[]
[null,null,"Data:",{"$f":"'Dados Gerais'!#REF!","v":{"$error":"#REF!"}}]
[null,null,"Processo:",{"$f":"'Dados Gerais'!#REF!","v":{"$error":"#REF!"}}]
[null,null,"Objeto:",{"$f":"'Dados Gerais'!#REF!","v":{"$error":"#REF!"}}]
[]
[]
[]
{"$rows_left_out":19}
{"sheet":"Mat Perm","index":25,"n_rows":113,"n_cols":136,"rows_kept":113,"cut":false,"hidden":true,"merged":[[9,1,9,3],[10,1,10,14]]}
[null,null,"CÂMARA DOS DEPUTADOS"]
[null,null,"DEPARTAMENTO TÉCNICO"]
[null,null,"Coordenação de Planejamento e Gestão"]
[]
[null,null,"Data:",{"$f":"'Dados Gerais'!#REF!","v":{"$error":"#REF!"}}]
[null,null,"Processo:",{"$f":"'Dados Gerais'!#REF!","v":{"$error":"#REF!"}}]
[null,null,"Objeto:",{"$f":"'Dados Gerais'!#REF!","v":{"$error":"#REF!"}}]
[]
[]
[]
{"$rows_left_out":103}