{"text_format":"1","workbook":"xlsx","n_sheets":35,"sheets":["GUIA PARA PREENCHIMENTO","MODELO PROPOSTA","Remunerações"," RESUMO","1","2","3","4","5","6","7","8","9","10","11","12","Dados Gerais","Encargos Sociais","BDI","Uniformes","EPI","Equip Rel","Mat Cons","Mat Perm","SREP","Não Rel - EPI","Não Rel - Depr","Uniformes - SOB DEMANDA","Not. Demanda","SOBREAVISO","plano de saúde","Horas extras_Demanda","Não Rel - Mat Consumo","Não Rel - Mat Cons Durável","Não Rel - Serviços"],"not_rendered":{"charts":0,"images":9,"macros":1,"external_links":0,"defined_names":47,"comments":2,"pivot_tables":0},"unopened":[],"bounds":{"document_bytes":16777216,"sheet_cells":100000,"rows_first":2000,"rows_last":500,"rows_between":2000,"halvings":0,"cell_chars":16384,"cell_head_chars":4096},"cells_cut":0,"cells_raw":0,"read":"whole","date_system":"1900"}

{"sheet":"GUIA PARA PREENCHIMENTO","index":0,"n_rows":5,"n_cols":1,"rows_kept":5,"cut":false,"hidden":false,"merged":[]}
["GUIA PARA PREENCHIMENTO"]
[]
["1 - Preencher apenas as guias azuis:"]
[]
["2 - Recomendamos preencher somente as células com fundo azul claro. As demais possuem fórmulas e sugerimos não alterá-las."]

{"sheet":"MODELO PROPOSTA","index":1,"n_rows":61,"n_cols":2,"rows_kept":61,"cut":false,"hidden":false,"merged":[[9,1,9,9],[1,1,1,9],[4,1,4,9],[6,1,6,9],[7,1,7,9],[8,1,8,9],[25,1,25,4],[25,5,25,9],[10,1,10,9],[11,1,11,9],[12,1,12,9],[14,1,14,9],[15,1,15,9],[16,1,16,2],[17,1,18,9],[19,1,19,9],[21,1,21,9],[22,1,22,9],[23,1,23,9],[26,5,26,9],[28,1,28,4],[28,5,28,9],[29,1,29,4],[29,5,29,9],[27,1,27,4],[27,5,27,9],[26,1,26,4],[30,1,30,4],[30,5,30,9],[31,1,31,4],[31,5,31,9],[33,1,33,9],[34,6,34,10],[35,1,35,9],[36,1,36,9],[37,1,37,9],[38,1,38,9],[40,1,40,9],[42,1,42,9],[43,1,43,9],[44,1,44,9],[51,1,51,4],[51,5,51,9],[50,1,50,4],[50,5,50,9],[46,1,46,9],[48,1,48,9],[49,1,49,4],[49,5,49,9],[52,1,52,9],[55,1,55,9],[56,1,56,9],[57,1,57,9],[60,1,60,9]]}
[]
[null,"MODELO DA PROPOSTA COMPLETA"]
[]
[null,"."]
[null,"I – FORMALIZAÇÃO"]
[]
[null,"PREGÃO ELETRÔNICO N. 103/22"]
[null,"OBJETO: Prestação de serviços continuados, com dedicação exclusiva de profissionais, por empresa especializada na área de apoio à infraestrutura de TI, pelo período de 12 (doze) meses."]
[null,"LICITANTE: _____________________________________________________"]
[null,"CNPJ: ________________________________________________________"]
[null,"ENDEREÇO COMPLETO: _________________________________________"]
[null,"TELEFONE:_____________________________________________________"]
[null,"E-MAIL: ________________________________________________________"]
[]
[null,"Apresentamos nossa proposta para o item único da presente licitação, de acordo com as disposições do Edital."]
[null,"Decorre do conteúdo da presente proposta a explicitação do seguinte PREÇO DE JULGAMENTO (GLOBAL ANUAL) PARA O ITEM:"]
[null,{"$f":"' RESUMO'!H106","v":19856348.207410537}]
[null,{"$f":"Extenso_Valor(B17)","v":"dezenove milhões, oitocentos e cinquenta e seis mil, trezentos e quarenta e oito reais e vinte e um centavos"}]
[]
[null,"(por extenso)"]
[]
[null,"No valor proposto estão incluídos todos os custos e todas as despesas, diretas e indiretas, para a execução dos serviços objeto da licitação, em conformidade com as especificações e demais condições e exigências constantes do Edital."]
[null,"Informamos que eventuais rubricas dispostas em Acordo ou Convenção Coletiva de Trabalho que não se relacionem ao custo direto da venda do serviço, tais como “Participação nos Resultados” e “Abono substitutivo de Participação nos Resultados”, serão consideradas nos custos indiretos da proposta."]
[null,"O prazo de validade da presente proposta é de ______ (por extenso) dias. (observado o disposto no Título 11 do Edital)."]
[]
[null,"Convenção coletiva de trabalho ou a norma coletiva a que estamos obrigados:"]
[null,"Data-Base:"]
[null,"Número do Registro SRT:"]
[null,"Regime de tributação da empresa:"]
[null,"Empresa é beneficiada pela desoneração da folha de pagamento instituída pela Lei n. 12.546, de 2001, alterada pela Lei n. 13.161, de 2015?"]
[null,"Empresa adere ao PAT (Programa de Alimentação do Trabalhador)?"]
[null,"(Se adere ao PAT): Os valores do auxílio-alimentação apresentados na presente proposta correspondem somente aos efetivamente pagos pela empresa aos empregados?"]
[]
[null,"DECLARAÇÕES"]
[]
[null,"A SEREM PRESTADAS SOMENTE NA HIPÓTESE DE LICITANTE MICROEMPRESA OU EMPRESA DE PEQUENO PORTE, EM CONFORMIDADE COM OS ARTIGOS 17, 18, 30 E 31 DA LEI COMPLEMENTAR N. 123, de 2006, E O ACÓRDÃO TCU 2798/2010-PLENÁRIO"]
[null,"Declaramos que:"]
[null,"a)   em se tratando dos serviços vedados descritos no artigo 17 da Lei Complementar n. 123, de 2006, notadamente os descritos no inciso XII (cessão ou locação de mão de obra), ressalvados os serviços listados nos parágrafos 5o-B a 5o-E do artigo 18 da referida Lei, a proposta apresentada não contempla qualquer benefício tributário referente ao SIMPLES NACIONAL, conforme os subitens 5.7 e 5.8 do Edital;"]
[null,"b)   na hipótese de contratação desta Microempresa ou Empresa de Pequeno Porte inscrita no SIMPLES NACIONAL e executora de atividade vedada, ficamos sujeitos à exclusão obrigatória no SIMPLES NACIONAL a contar do mês seguinte ao da contratação, em consequência do que dispõem o artigo 17, inciso XII e o artigo 31, inciso II da Lei Complementar n, 123, de 2006, devendo entregar à Câmara dos Deputados, à título de comprovação, cópia de ofício – com comprovante de entrega e recebimento, que comunique a assinatura do contrato de prestação de serviços mediante cessão de mão de obra e encaminhado pela contratada à Receita Federal do Brasil até o último dia útil do mês subsequente ao da contratação, consoante artigo 30, § 1º, inciso II da Lei Complementar n. 123, de 2006."]
[]
[null,"A SEREM PRESTADAS SOMENTE NA HIPÓTESE DE LICITANTE BENEFICIADA PELA DESONERAÇÃO DA FOLHA DE PAGAMENTO INSTITUÍDA PELA LEI N. 12.546, DE 2011, ALTERADA PELA LEI N. 13.161, DE 2015. "]
[]
[null,"Declaramos, sob as penas da Lei, que:"]
[null,"a)   recolhemos a contribuição previdenciária incidente sobre o valor da receita bruta, em substituição às contribuições previdenciárias incidentes sobre a folha de pagamento, previstas nos incisos I e III do caput do artigo 22 da Lei n. 8.212, de 24 de julho de 1991, na forma do caput do artigo 7º (ou 8º) da Lei n. 12.546, de 14 de dezembro de 2011, alterada pela Lei n. 13.161, de 31 de agosto de 2015;"]
[null,"b)   temos ciência que nossa manifestação, conforme alínea “a” anterior, será remetida à Receita Federal do Brasil e que, em caso de constatação de falsidade, estará sujeita às sanções administrativas cabíveis, sem prejuízo do encaminhamento dos documentos ao Ministério Público para apuração de eventual responsabilidade criminal desta declarante."]
[]
[null,"É OBRIGATÓRIA A COMPROVAÇÃO A QUE SE REFERE O SUBITEM 5.9.4 DO TÍTULO 5 DO EDITAL."]
[]
[null,"DADOS PARA ASSINATURA DO CONTRATO"]
[null,"Nome do signatário"]
[null,"Cargo"]
[null,"Qualificação\n(CPF, naturalidade e domicílio)"]
[null,"OBS.: O signatário deve possuir poderes de administração estabelecidos em contrato social e/ou possuir procuração com poderes para assinar contratos em nome da empresa. \nA documentação comprobatória deverá ser encaminhada quando da assinatura do contrato."]
[]
[]
[null,"Brasília,     de                     de 2022."]
[]
[null,"Assinatura do representante legal da empresa"]
[]
[]
[null,"Nome do representante legal da empresa"]

{"sheet":"Remunerações","index":2,"n_rows":18,"n_cols":13,"rows_kept":18,"cut":false,"hidden":false,"merged":[[0,1,0,10]]}
[null,"QUADRO DE REMUNERAÇÕES"]
[]
[null,null,"ITEM","POSTO DE TRABALHO","QUANTIDADE","SALÁRIO","ADICIONAL DE PERICULOSIDADE","ADICIONAL DE INSALUBRIDADE","ADICIONAL NOTURNO","OUTROS","SALÁRIO COM ADICIONAIS"]
[null,null,null,"POSTO DE TRABALHO - EQUIPE DE TRABALHO"]
[null,null,1,{"$f":"HLOOKUP($C5,'Dados Gerais'!$D$5:$O$68,6)","v":"TÉCNICO DE APOIO A OPERAÇÕES EM DATA CENTER (JORNADAS DE 7 ÀS 13H E DE 13 ÀS 19H)"},{"$f":"HLOOKUP($C5,'Dados Gerais'!$D$5:$O$68,10)","v":6},{"$f":"HLOOKUP($C5,'Dados Gerais'!$D$5:$O$68,8)","v":2627.81},{"$f":"HLOOKUP($C5,'Dados Gerais'!$D$5:$O$68,25)","v":0},{"$f":"HLOOKUP($C5,'Dados Gerais'!$D$5:$O$68,31)","v":0},{"$f":"HLOOKUP($C5,'Dados Gerais'!$D$5:$O$68,46)","v":0},{"$f":"HLOOKUP($C5,'Dados Gerais'!$D$5:$O$68,33)","v":0},{"$f":"SUM(F5:J5)","v":2627.81},null,{"$f":"E5*K5","v":15766.86}]
[null,null,2,{"$f":"HLOOKUP($C6,'Dados Gerais'!$D$5:$O$68,6)","v":"TÉCNICO DE APOIO A OPERAÇÕES EM DATA CENTER (JORNADA DAS 19 À 1H)"},{"$f":"HLOOKUP($C6,'Dados Gerais'!$D$5:$O$68,10)","v":3},{"$f":"HLOOKUP($C6,'Dados Gerais'!$D$5:$O$68,8)","v":2627.81},{"$f":"HLOOKUP($C6,'Dados Gerais'!$D$5:$O$68,25)","v":0},{"$f":"HLOOKUP($C6,'Dados Gerais'!$D$5:$O$68,31)","v":0},{"$f":"HLOOKUP($C6,'Dados Gerais'!$D$5:$O$68,46)","v":227.74},{"$f":"HLOOKUP($C6,'Dados Gerais'!$D$5:$O$68,33)","v":0},{"$f":"SUM(F6:J6)","v":2855.55},null,{"$f":"E6*K6","v":8566.6500000000015}]
[null,null,3,{"$f":"HLOOKUP($C7,'Dados Gerais'!$D$5:$O$68,6)","v":"TÉCNICO DE APOIO A OPERAÇÕES EM DATA CENTER (JORNADA DA 1H ÀS 7H)"},{"$f":"HLOOKUP($C7,'Dados Gerais'!$D$5:$O$68,10)","v":3},{"$f":"HLOOKUP($C7,'Dados Gerais'!$D$5:$O$68,8)","v":2627.81},{"$f":"HLOOKUP($C7,'Dados Gerais'!$D$5:$O$68,25)","v":0},{"$f":"HLOOKUP($C7,'Dados Gerais'!$D$5:$O$68,31)","v":0},{"$f":"HLOOKUP($C7,'Dados Gerais'!$D$5:$O$68,46)","v":379.57},{"$f":"HLOOKUP($C7,'Dados Gerais'!$D$5:$O$68,33)","v":0},3007.38,null,9022.14]
[null,null,4,{"$f":"HLOOKUP($C8,'Dados Gerais'!$D$5:$O$68,6)","v":"TÉCNICO DE APOIO AO MONITORAMENTO DA INFRAESTRUTURA (JORNADAS DE 7 ÀS 13H E DE 13 ÀS 19H)"},{"$f":"HLOOKUP($C8,'Dados Gerais'!$D$5:$O$68,10)","v":6},{"$f":"HLOOKUP($C8,'Dados Gerais'!$D$5:$O$68,8)","v":2627.81},{"$f":"HLOOKUP($C8,'Dados Gerais'!$D$5:$O$68,25)","v":0},{"$f":"HLOOKUP($C8,'Dados Gerais'!$D$5:$O$68,31)","v":0},{"$f":"HLOOKUP($C8,'Dados Gerais'!$D$5:$O$68,46)","v":0},{"$f":"HLOOKUP($C8,'Dados Gerais'!$D$5:$O$68,33)","v":0},2627.81,null,15766.86]
[null,null,5,{"$f":"HLOOKUP($C9,'Dados Gerais'!$D$5:$O$68,6)","v":"TÉCNICO DE APOIO AO MONITORAMENTO DA INFRAESTRUTURA (JORNADA DAS 19 À 1H)"},{"$f":"HLOOKUP($C9,'Dados Gerais'!$D$5:$O$68,10)","v":3},{"$f":"HLOOKUP($C9,'Dados Gerais'!$D$5:$O$68,8)","v":2627.81},{"$f":"HLOOKUP($C9,'Dados Gerais'!$D$5:$O$68,25)","v":0},{"$f":"HLOOKUP($C9,'Dados Gerais'!$D$5:$O$68,31)","v":0},{"$f":"HLOOKUP($C9,'Dados Gerais'!$D$5:$O$68,46)","v":227.74},{"$f":"HLOOKUP($C9,'Dados Gerais'!$D$5:$O$68,33)","v":0},2855.55,null,8566.6500000000015]
[null,null,6,{"$f":"HLOOKUP($C10,'Dados Gerais'!$D$5:$O$68,6)","v":"TÉCNICO DE APOIO AO MONITORAMENTO DA INFRAESTRUTURA (JORNADA DA 1H ÀS 7H)"},{"$f":"HLOOKUP($C10,'Dados Gerais'!$D$5:$O$68,10)","v":3},{"$f":"HLOOKUP($C10,'Dados Gerais'!$D$5:$O$68,8)","v":2627.81},{"$f":"HLOOKUP($C10,'Dados Gerais'!$D$5:$O$68,25)","v":0},{"$f":"HLOOKUP($C10,'Dados Gerais'!$D$5:$O$68,31)","v":0},{"$f":"HLOOKUP($C10,'Dados Gerais'!$D$5:$O$68,46)","v":379.57},{"$f":"HLOOKUP($C10,'Dados Gerais'!$D$5:$O$68,33)","v":0},{"$f":"SUM(F10:J10)","v":3007.38},null,9022.14]
[null,null,7,{"$f":"HLOOKUP($C11,'Dados Gerais'!$D$5:$O$68,6)","v":"TÉCNICO INSTALADOR DE CABEAMENTO"},{"$f":"HLOOKUP($C11,'Dados Gerais'!$D$5:$O$68,10)","v":7},{"$f":"HLOOKUP($C11,'Dados Gerais'!$D$5:$O$68,8)","v":2314.46},{"$f":"HLOOKUP($C11,'Dados Gerais'!$D$5:$O$68,25)","v":0},{"$f":"HLOOKUP($C11,'Dados Gerais'!$D$5:$O$68,31)","v":0},{"$f":"HLOOKUP($C11,'Dados Gerais'!$D$5:$O$68,46)","v":0},{"$f":"HLOOKUP($C11,'Dados Gerais'!$D$5:$O$68,33)","v":0},2314.46,null,16201.220000000001]
[null,null,8,{"$f":"HLOOKUP($C12,'Dados Gerais'!$D$5:$O$68,6)","v":"TÉCNICO DE MANUTENÇÃO DE INFRAESTRUTURA DE REDE"},{"$f":"HLOOKUP($C12,'Dados Gerais'!$D$5:$O$68,10)","v":8},{"$f":"HLOOKUP($C12,'Dados Gerais'!$D$5:$O$68,8)","v":3130.93},{"$f":"HLOOKUP($C12,'Dados Gerais'!$D$5:$O$68,25)","v":0},{"$f":"HLOOKUP($C12,'Dados Gerais'!$D$5:$O$68,31)","v":0},{"$f":"HLOOKUP($C12,'Dados Gerais'!$D$5:$O$68,46)","v":0},{"$f":"HLOOKUP($C12,'Dados Gerais'!$D$5:$O$68,33)","v":0},{"$f":"SUM(F12:J12)","v":3130.93},null,25047.439999999999]
[null,null,9,{"$f":"HLOOKUP($C13,'Dados Gerais'!$D$5:$O$68,6)","v":"ANALISTA DE INFRAESTRUTURA DE TI PLENO"},{"$f":"HLOOKUP($C13,'Dados Gerais'!$D$5:$O$68,10)","v":6},{"$f":"HLOOKUP($C13,'Dados Gerais'!$D$5:$O$68,8)","v":6192.84},{"$f":"HLOOKUP($C13,'Dados Gerais'!$D$5:$O$68,25)","v":0},{"$f":"HLOOKUP($C13,'Dados Gerais'!$D$5:$O$68,31)","v":0},{"$f":"HLOOKUP($C13,'Dados Gerais'!$D$5:$O$68,46)","v":0},{"$f":"HLOOKUP($C13,'Dados Gerais'!$D$5:$O$68,33)","v":0},6192.84,null,37157.040000000001]
[null,null,10,{"$f":"HLOOKUP($C14,'Dados Gerais'!$D$5:$O$68,6)","v":"ANALISTA DE INFRAESTRUTURA DE TI SÊNIOR"},{"$f":"HLOOKUP($C14,'Dados Gerais'!$D$5:$O$68,10)","v":26},{"$f":"HLOOKUP($C14,'Dados Gerais'!$D$5:$O$68,8)","v":8113.11},{"$f":"HLOOKUP($C14,'Dados Gerais'!$D$5:$O$68,25)","v":0},{"$f":"HLOOKUP($C14,'Dados Gerais'!$D$5:$O$68,31)","v":0},{"$f":"HLOOKUP($C14,'Dados Gerais'!$D$5:$O$68,46)","v":0},{"$f":"HLOOKUP($C14,'Dados Gerais'!$D$5:$O$68,33)","v":0},8113.11,null,210940.86]
[null,null,11,{"$f":"HLOOKUP($C15,'Dados Gerais'!$D$5:$O$68,6)","v":"ANALISTA DE INFRAESTRUTURA DE TI MASTER"},{"$f":"HLOOKUP($C15,'Dados Gerais'!$D$5:$O$68,10)","v":26},{"$f":"HLOOKUP($C15,'Dados Gerais'!$D$5:$O$68,8)","v":10366.92},{"$f":"HLOOKUP($C15,'Dados Gerais'!$D$5:$O$68,25)","v":0},{"$f":"HLOOKUP($C15,'Dados Gerais'!$D$5:$O$68,31)","v":0},{"$f":"HLOOKUP($C15,'Dados Gerais'!$D$5:$O$68,46)","v":0},{"$f":"HLOOKUP($C15,'Dados Gerais'!$D$5:$O$68,33)","v":0},10366.92,null,269539.92]
[null,null,12,{"$f":"HLOOKUP($C16,'Dados Gerais'!$D$5:$O$68,6)","v":"SUPERVISOR TÉCNICO"},{"$f":"HLOOKUP($C16,'Dados Gerais'!$D$5:$O$68,10)","v":3},{"$f":"HLOOKUP($C16,'Dados Gerais'!$D$5:$O$68,8)","v":13944.34},{"$f":"HLOOKUP($C16,'Dados Gerais'!$D$5:$O$68,25)","v":0},{"$f":"HLOOKUP($C16,'Dados Gerais'!$D$5:$O$68,31)","v":0},{"$f":"HLOOKUP($C16,'Dados Gerais'!$D$5:$O$68,46)","v":0},{"$f":"HLOOKUP($C16,'Dados Gerais'!$D$5:$O$68,33)","v":0},13944.34,null,41833.020000000004]
[null,null,null,null,null,null,null,null,null,null,null,null,0]
[null,null,null,"TOTAL DE POSTOS",{"$f":"SUM(E5:E17)","v":100}]

{"sheet":" RESUMO","index":3,"n_rows":112,"n_cols":12,"rows_kept":112,"cut":false,"hidden":false,"merged":[[103,3,103,7],[76,3,76,7],[90,3,90,7],[99,3,99,7],[2,1,2,8],[42,1,42,8],[22,1,22,8],[86,3,86,7]]}
[]
[]
[null,"RESUMO  - TOTAIS MENSAIS - FATURA ORDINÁRIA (SEM O 13º E SEM OS ITENS SOB DEMANDA)"]
[]
[]
[null,null,"ITEM","POSTO DE TRABALHO","QUANTIDADE","PREÇO UNIT       (SEM O 13º)","DESTAQUE DO 13º","PREÇO POR EMPREGADO","PREÇO TOTAL (MENSAL)"]
[null,null,1,{"$f":"HLOOKUP(C7,'Dados Gerais'!$D$5:$BK$10,6)","v":"TÉCNICO DE APOIO A OPERAÇÕES EM DATA CENTER (JORNADAS DE 7 ÀS 13H E DE 13 ÀS 19H)"},{"$f":"HLOOKUP(C7,'Dados Gerais'!$D$5:$BK$14,10)","v":6},{"$f":"'1'!$E$116","v":7069.036975},0,{"$f":"G7+F7","v":7069.036975},{"$f":"H7*E7","v":42414.221850000002}]
[null,null,2,{"$f":"HLOOKUP(C8,'Dados Gerais'!$D$5:$BK$10,6)","v":"TÉCNICO DE APOIO A OPERAÇÕES EM DATA CENTER (JORNADA DAS 19 À 1H)"},{"$f":"HLOOKUP(C8,'Dados Gerais'!$D$5:$BK$14,10)","v":3},{"$f":"'2'!$E$116","v":7528.5541869999997},0,7528.5541869999997,22585.662560999997]
[null,null,3,{"$f":"HLOOKUP(C9,'Dados Gerais'!$D$5:$BK$10,6)","v":"TÉCNICO DE APOIO A OPERAÇÕES EM DATA CENTER (JORNADA DA 1H ÀS 7H)"},{"$f":"HLOOKUP(C9,'Dados Gerais'!$D$5:$BK$14,10)","v":3},{"$f":"'3'!$E$116","v":7834.873892999999},0,7834.873892999999,23504.621678999996]
[null,null,4,{"$f":"HLOOKUP(C10,'Dados Gerais'!$D$5:$BK$10,6)","v":"TÉCNICO DE APOIO AO MONITORAMENTO DA INFRAESTRUTURA (JORNADAS DE 7 ÀS 13H E DE 13 ÀS 19H)"},{"$f":"HLOOKUP(C10,'Dados Gerais'!$D$5:$BK$14,10)","v":6},{"$f":"'4'!$E$116","v":7069.036975},0,7069.036975,42414.221850000002]
[null,null,5,{"$f":"HLOOKUP(C11,'Dados Gerais'!$D$5:$BK$10,6)","v":"TÉCNICO DE APOIO AO MONITORAMENTO DA INFRAESTRUTURA (JORNADA DAS 19 À 1H)"},{"$f":"HLOOKUP(C11,'Dados Gerais'!$D$5:$BK$14,10)","v":3},{"$f":"'5'!$E$116","v":7528.5541869999997},0,7528.5541869999997,22585.662560999997]
[null,null,6,{"$f":"HLOOKUP(C12,'Dados Gerais'!$D$5:$BK$10,6)","v":"TÉCNICO DE APOIO AO MONITORAMENTO DA INFRAESTRUTURA (JORNADA DA 1H ÀS 7H)"},{"$f":"HLOOKUP(C12,'Dados Gerais'!$D$5:$BK$14,10)","v":3},{"$f":"'6'!$E$116","v":7834.873892999999},0,7834.873892999999,23504.621678999996]
[null,null,7,{"$f":"HLOOKUP(C13,'Dados Gerais'!$D$5:$BK$10,6)","v":"TÉCNICO INSTALADOR DE CABEAMENTO"},{"$f":"HLOOKUP(C13,'Dados Gerais'!$D$5:$BK$14,10)","v":7},{"$f":"'7'!$E$116","v":6920.8975219999975},0,6920.8975219999975,48446.282653999981]
[null,null,8,{"$f":"HLOOKUP(C14,'Dados Gerais'!$D$5:$BK$10,6)","v":"TÉCNICO DE MANUTENÇÃO DE INFRAESTRUTURA DE REDE"},{"$f":"HLOOKUP(C14,'Dados Gerais'!$D$5:$BK$14,10)","v":8},{"$f":"'8'!$E$116","v":8329.1699260000005},0,{"$f":"G14+F14","v":8329.1699260000005},{"$f":"H14*E14","v":66633.359408000004}]
[null,null,9,{"$f":"HLOOKUP(C15,'Dados Gerais'!$D$5:$BK$10,6)","v":"ANALISTA DE INFRAESTRUTURA DE TI PLENO"},{"$f":"HLOOKUP(C15,'Dados Gerais'!$D$5:$BK$14,10)","v":6},{"$f":"'9'!$E$116","v":13775.977599999998},0,13775.977599999998,82655.86559999999]
[null,null,10,{"$f":"HLOOKUP(C16,'Dados Gerais'!$D$5:$BK$10,6)","v":"ANALISTA DE INFRAESTRUTURA DE TI SÊNIOR"},{"$f":"HLOOKUP(C16,'Dados Gerais'!$D$5:$BK$14,10)","v":26},{"$f":"'10'!$E$116","v":17650.521504},0,{"$f":"G16+F16","v":17650.521504},{"$f":"H16*E16","v":458913.55910399999}]
[null,null,11,{"$f":"HLOOKUP(C17,'Dados Gerais'!$D$5:$BK$10,6)","v":"ANALISTA DE INFRAESTRUTURA DE TI MASTER"},{"$f":"HLOOKUP(C17,'Dados Gerais'!$D$5:$BK$14,10)","v":26},{"$f":"'11'!$E$116","v":22198.062578999998},0,22198.062578999998,577149.62705399992]
[null,null,12,{"$f":"HLOOKUP(C18,'Dados Gerais'!$D$5:$BK$10,6)","v":"SUPERVISOR TÉCNICO"},{"$f":"HLOOKUP(C18,'Dados Gerais'!$D$5:$BK$14,10)","v":3},{"$f":"'12'!$E$116","v":29416.293291000002},0,29416.293291000002,88248.879872999998]
[]
[null,null,null,"TOTAL MENSAL - SALÁRIOS",null,null,null,null,{"$f":"SUM(I7:I19)","v":1499056.5858729999}]
[]
[]
[null,"RESUMO - TOTAIS MENSAIS - DESTAQUE DO 13º SALÁRIO"]
[]
[]
[null,null,"ITEM","POSTO DE TRABALHO","QUANTIDADE","PREÇO UNIT       (SEM O 13º)","DESTAQUE DO 13º","PREÇO POR EMPREGADO","PREÇO TOTAL (MENSAL)"]
[null,null,1,{"$f":"HLOOKUP(C27,'Dados Gerais'!$D$5:$BK$10,6)","v":"TÉCNICO DE APOIO A OPERAÇÕES EM DATA CENTER (JORNADAS DE 7 ÀS 13H E DE 13 ÀS 19H)"},{"$f":"HLOOKUP(C27,'Dados Gerais'!$D$5:$BK$14,10)","v":6},0,{"$f":"'1'!$E$117","v":390.40000000000003},{"$f":"G27+F27","v":390.40000000000003},{"$f":"H27*E27","v":2342.4}]
[null,null,2,{"$f":"HLOOKUP(C28,'Dados Gerais'!$D$5:$BK$10,6)","v":"TÉCNICO DE APOIO A OPERAÇÕES EM DATA CENTER (JORNADA DAS 19 À 1H)"},{"$f":"HLOOKUP(C28,'Dados Gerais'!$D$5:$BK$14,10)","v":3},0,{"$f":"'2'!$E$117","v":424.22999999999996},{"$f":"G28+F28","v":424.22999999999996},1272.6899999999998]
[null,null,3,{"$f":"HLOOKUP(C29,'Dados Gerais'!$D$5:$BK$10,6)","v":"TÉCNICO DE APOIO A OPERAÇÕES EM DATA CENTER (JORNADA DA 1H ÀS 7H)"},{"$f":"HLOOKUP(C29,'Dados Gerais'!$D$5:$BK$14,10)","v":3},0,{"$f":"'3'!$E$117","v":446.8},446.8,1340.4]
[null,null,4,{"$f":"HLOOKUP(C30,'Dados Gerais'!$D$5:$BK$10,6)","v":"TÉCNICO DE APOIO AO MONITORAMENTO DA INFRAESTRUTURA (JORNADAS DE 7 ÀS 13H E DE 13 ÀS 19H)"},{"$f":"HLOOKUP(C30,'Dados Gerais'!$D$5:$BK$14,10)","v":6},0,{"$f":"'4'!$E$117","v":390.40000000000003},390.40000000000003,2342.4]
[null,null,5,{"$f":"HLOOKUP(C31,'Dados Gerais'!$D$5:$BK$10,6)","v":"TÉCNICO DE APOIO AO MONITORAMENTO DA INFRAESTRUTURA (JORNADA DAS 19 À 1H)"},{"$f":"HLOOKUP(C31,'Dados Gerais'!$D$5:$BK$14,10)","v":3},0,{"$f":"'5'!$E$117","v":424.22999999999996},424.22999999999996,1272.6899999999998]
[null,null,6,{"$f":"HLOOKUP(C32,'Dados Gerais'!$D$5:$BK$10,6)","v":"TÉCNICO DE APOIO AO MONITORAMENTO DA INFRAESTRUTURA (JORNADA DA 1H ÀS 7H)"},{"$f":"HLOOKUP(C32,'Dados Gerais'!$D$5:$BK$14,10)","v":3},0,{"$f":"'6'!$E$117","v":446.8},446.8,1340.4]
[null,null,7,{"$f":"HLOOKUP(C33,'Dados Gerais'!$D$5:$BK$10,6)","v":"TÉCNICO INSTALADOR DE CABEAMENTO"},{"$f":"HLOOKUP(C33,'Dados Gerais'!$D$5:$BK$14,10)","v":7},0,{"$f":"'7'!$E$117","v":343.84},{"$f":"G33+F33","v":343.84},2406.8799999999997]
[null,null,8,{"$f":"HLOOKUP(C34,'Dados Gerais'!$D$5:$BK$10,6)","v":"TÉCNICO DE MANUTENÇÃO DE INFRAESTRUTURA DE REDE"},{"$f":"HLOOKUP(C34,'Dados Gerais'!$D$5:$BK$14,10)","v":8},0,{"$f":"'8'!$E$117","v":465.15000000000009},{"$f":"G34+F34","v":465.15000000000009},{"$f":"H34*E34","v":3721.2000000000007}]
[null,null,9,{"$f":"HLOOKUP(C35,'Dados Gerais'!$D$5:$BK$10,6)","v":"ANALISTA DE INFRAESTRUTURA DE TI PLENO"},{"$f":"HLOOKUP(C35,'Dados Gerais'!$D$5:$BK$14,10)","v":6},0,{"$f":"'9'!$E$117","v":920.04000000000008},{"$f":"G35+F35","v":920.04000000000008},5520.2400000000007]
[null,null,10,{"$f":"HLOOKUP(C36,'Dados Gerais'!$D$5:$BK$10,6)","v":"ANALISTA DE INFRAESTRUTURA DE TI SÊNIOR"},{"$f":"HLOOKUP(C36,'Dados Gerais'!$D$5:$BK$14,10)","v":26},0,{"$f":"'10'!$E$117","v":1205.3200000000002},1205.3200000000002,31338.320000000003]
[null,null,11,{"$f":"HLOOKUP(C37,'Dados Gerais'!$D$5:$BK$10,6)","v":"ANALISTA DE INFRAESTRUTURA DE TI MASTER"},{"$f":"HLOOKUP(C37,'Dados Gerais'!$D$5:$BK$14,10)","v":26},0,{"$f":"'11'!$E$117","v":1540.1699999999998},1540.1699999999998,40044.42]
[null,null,12,{"$f":"HLOOKUP(C38,'Dados Gerais'!$D$5:$BK$10,6)","v":"SUPERVISOR TÉCNICO"},{"$f":"HLOOKUP(C38,'Dados Gerais'!$D$5:$BK$14,10)","v":3},0,{"$f":"'12'!$E$117","v":2071.65},2071.65,6214.9500000000007]
[]
[null,null,null,"TOTAL MENSAL - DESTAQUE DO 13º",null,null,null,null,{"$f":"SUM(I27:I39)","v":99156.99}]
[]
[]
[null,"RESUMO  - TOTAIS MENSAIS - FATURA ORDINÁRIA TOTAL"]
[]
[]
[null,null,"ITEM","POSTO DE TRABALHO","QUANTIDADE","PREÇO UNIT       (SEM O 13º)","DESTAQUE DO 13º","PREÇO POR EMPREGADO","PREÇO TOTAL (MENSAL)"]
[null,null,1,{"$f":"HLOOKUP(C47,'Dados Gerais'!$D$5:$BK$10,6)","v":"TÉCNICO DE APOIO A OPERAÇÕES EM DATA CENTER (JORNADAS DE 7 ÀS 13H E DE 13 ÀS 19H)"},{"$f":"HLOOKUP(C47,'Dados Gerais'!$D$5:$BK$14,10)","v":6},{"$f":"F7","v":7069.036975},{"$f":"G27","v":390.40000000000003},{"$f":"G47+F47","v":7459.4369749999996},{"$f":"H47*E47","v":44756.621849999996},null,{"$f":"I47/$I$60","v":2.8004155718394753E-2},{"$f":"$I$75*K47","v":1581.733749916101}]
[null,null,2,{"$f":"HLOOKUP(C48,'Dados Gerais'!$D$5:$BK$10,6)","v":"TÉCNICO DE APOIO A OPERAÇÕES EM DATA CENTER (JORNADA DAS 19 À 1H)"},{"$f":"HLOOKUP(C48,'Dados Gerais'!$D$5:$BK$14,10)","v":3},{"$f":"F8","v":7528.5541869999997},{"$f":"G28","v":424.22999999999996},7952.7841869999993,23858.352561,null,1.4928137841632171E-2,843.17269497253051]
[null,null,3,{"$f":"HLOOKUP(C49,'Dados Gerais'!$D$5:$BK$10,6)","v":"TÉCNICO DE APOIO A OPERAÇÕES EM DATA CENTER (JORNADA DA 1H ÀS 7H)"},{"$f":"HLOOKUP(C49,'Dados Gerais'!$D$5:$BK$14,10)","v":3},7834.873892999999,446.8,8281.6738929999992,24845.021678999998,null,1.5545495329326546E-2,878.04234731517147]
[null,null,4,{"$f":"HLOOKUP(C50,'Dados Gerais'!$D$5:$BK$10,6)","v":"TÉCNICO DE APOIO AO MONITORAMENTO DA INFRAESTRUTURA (JORNADAS DE 7 ÀS 13H E DE 13 ÀS 19H)"},{"$f":"HLOOKUP(C50,'Dados Gerais'!$D$5:$BK$14,10)","v":6},7069.036975,390.40000000000003,7459.4369749999996,44756.621849999996,null,2.8004155718394753E-2,1581.733749916101]
[null,null,5,{"$f":"HLOOKUP(C51,'Dados Gerais'!$D$5:$BK$10,6)","v":"TÉCNICO DE APOIO AO MONITORAMENTO DA INFRAESTRUTURA (JORNADA DAS 19 À 1H)"},{"$f":"HLOOKUP(C51,'Dados Gerais'!$D$5:$BK$14,10)","v":3},7528.5541869999997,424.22999999999996,7952.7841869999993,23858.352561,null,1.4928137841632171E-2,843.17269497253051]
[null,null,6,{"$f":"HLOOKUP(C52,'Dados Gerais'!$D$5:$BK$10,6)","v":"TÉCNICO DE APOIO AO MONITORAMENTO DA INFRAESTRUTURA (JORNADA DA 1H ÀS 7H)"},{"$f":"HLOOKUP(C52,'Dados Gerais'!$D$5:$BK$14,10)","v":3},7834.873892999999,446.8,8281.6738929999992,24845.021678999998,null,1.5545495329326546E-2,878.04234731517147]
[null,null,7,{"$f":"HLOOKUP(C53,'Dados Gerais'!$D$5:$BK$10,6)","v":"TÉCNICO INSTALADOR DE CABEAMENTO"},{"$f":"HLOOKUP(C53,'Dados Gerais'!$D$5:$BK$14,10)","v":7},6920.8975219999975,343.84,7264.7375219999976,50853.162653999985,null,3.1818752776031335E-2,1797.1902331990864]
[null,null,8,{"$f":"HLOOKUP(C54,'Dados Gerais'!$D$5:$BK$10,6)","v":"TÉCNICO DE MANUTENÇÃO DE INFRAESTRUTURA DE REDE"},{"$f":"HLOOKUP(C54,'Dados Gerais'!$D$5:$BK$14,10)","v":8},8329.1699260000005,465.15000000000009,{"$f":"G54+F54","v":8794.3199260000001},{"$f":"H54*E54","v":70354.559408000001},null,4.4020749460578129E-2,2486.3847287015687]
[null,null,9,{"$f":"HLOOKUP(C55,'Dados Gerais'!$D$5:$BK$10,6)","v":"ANALISTA DE INFRAESTRUTURA DE TI PLENO"},{"$f":"HLOOKUP(C55,'Dados Gerais'!$D$5:$BK$14,10)","v":6},13775.977599999998,920.04000000000008,14696.017599999999,88176.105599999995,null,5.5171665997039938E-2,3116.2120016814029]
[null,null,10,{"$f":"HLOOKUP(C56,'Dados Gerais'!$D$5:$BK$10,6)","v":"ANALISTA DE INFRAESTRUTURA DE TI SÊNIOR"},{"$f":"HLOOKUP(C56,'Dados Gerais'!$D$5:$BK$14,10)","v":26},17650.521504,1205.3200000000002,18855.841504,490251.87910399999,null,0.30674991534608093,17325.881871457306]
[null,null,11,{"$f":"HLOOKUP(C57,'Dados Gerais'!$D$5:$BK$10,6)","v":"ANALISTA DE INFRAESTRUTURA DE TI MASTER"},{"$f":"HLOOKUP(C57,'Dados Gerais'!$D$5:$BK$14,10)","v":26},22198.062578999998,1540.1699999999998,23738.232578999996,617194.04705399985,null,0.38617745235762185,21812.116601302827]
[null,null,12,{"$f":"HLOOKUP(C58,'Dados Gerais'!$D$5:$BK$10,6)","v":"SUPERVISOR TÉCNICO"},{"$f":"HLOOKUP(C58,'Dados Gerais'!$D$5:$BK$14,10)","v":3},29416.293291000002,2071.65,{"$f":"G58+F58","v":31487.943291000003},{"$f":"H58*E58","v":94463.82987300001},null,5.9105886283940853E-2,3338.425057128321]
[]
[null,null,null,"TOTAL MENSAL - SALÁRIOS",null,null,null,null,{"$f":"SUM(I47:I59)","v":1598213.5758729998}]
[]
[null,null,"ITEM","DESCRIÇÃO",null,null,null,null,"PREÇO TOTAL (MENSAL)"]
[null,null,"EQUIP","EQUIPAMENTOS NÃO RELACIONADOS DIRETAMENTE A UM POSTO DE TRABALHO",null,null,null,null,0]
[null,null,"HEXTRA","HORAS EXTRAS (SOB DEMANDA)",null,null,null,null,{"$f":"'Horas extras_Demanda'!G76","v":0}]
[null,null,"HNOT","ADICIONAL DE HORAS NOTURNAS (SOB DEMANDA)",null,null,null,null,{"$f":"'Not. Demanda'!G48","v":2325.5015504227204}]
[null,null,"SOBREAV","HORAS DE SOBREAVISO (SOB DEMANDA)",null,null,null,null,{"$f":"SOBREAVISO!G42","v":50384.771527455399}]
[null,null,"SREP","SISTEMA DE REGISTRO ELETRÔNICO DE PRESENÇA - SREP",null,null,null,null,0]
[null,null,"UNIFORMES - SOB DEMANDA","UNIFORMES (SOB DEMANDA)",null,null,null,null,{"$f":"'Uniformes - SOB DEMANDA'!K17","v":399.81666666666666}]
[null,null,"EPI - N.REL","EQUIPAMENTOS DE PROTEÇÃO INDIVIDUAL NÃO RELACIONADOS DIRETAMENTE A UM POSTO DE TRABALHO",null,null,null,null,{"$f":"'Não Rel - EPI'!K19","v":863.72833333333335}]
[null,null,"FERR - N.REL","FERRAMENTAS NÃO RELACIONADAS DIRETAMENTE A UM POSTO DE TRABALHO",null,null,null,null,{"$f":"'Não Rel - Depr'!M65","v":2508.2900000000004}]
[null,null,"MAT SOB DEMANDA","MATERIAIS NÃO RELACIONADOS DIRETAMENTE A UM POSTO DE TRABALHO - AQUISIÇÃO SOB DEMANDA",null,null,null,null,{"$f":"'Não Rel - Mat Consumo'!L56","v":0}]
[null,null,"MAT CONS DURAVEL SOB DEMANDA","MATERIAIS DE CONSUMO DURÁVEL NÃO RELACIONADOS DIRETAMENTE A UM POSTO DE TRABALHO - AQUISIÇÃO SOB DEMANDA",null,null,null,null,{"$f":"'Não Rel - Mat Cons Durável'!L42","v":0}]
[null,null,"EQ SOB DEMANDA","SERVIÇOS NÃO RELACIONADOS DIRETAMENTE A UM POSTO DE TRABALHO - AQUISIÇÃO SOB DEMANDA",null,null,null,null,{"$f":"'Não Rel - Serviços'!K18","v":0}]
[]
[null,null,null,"TOTAL MENSAL - OUTROS ITENS",null,null,null,null,{"$f":"SUM(I63:I74)","v":56482.108077878118},null,{"$f":"(I75+I60)*12","v":19856348.207410537}]
[]
[null,null,null,"TOTAL MENSAL  - ITENS ORDINÁRIOS"]
[null,null,null,"DESCRIÇÃO",null,null,null,"VALOR"]
[null,null,null,"Postos de Trabalho - Inclusive 13º Salário",null,null,null,{"$f":"I60","v":1598213.5758729998}]
[null,null,null,"Adicional de Horas Noturnas",null,null,null,0]
[null,null,null,"Sistema de Registro Eletrônico de Presença - SREP",null,null,null,0]
[null,null,null,"Equipamentos de Proteção Individual não relacionados diretamente a um posto de trabalho",null,null,null,{"$f":"I69","v":863.72833333333335}]
[null,null,null,"Ferramentas não relacionadas diretamente a um posto de trabalho",null,null,null,{"$f":"I70","v":2508.2900000000004}]
[]
[null,null,null,null,null,null,"TOTAL MENSAL DA CONTRATAÇÃO - ITENS ORDINÁRIOS",{"$f":"SUM(H79:H84)","v":1601585.5942063332}]
[]
[null,null,null,"TOTAL ANUAL  - ITENS ORDINÁRIOS"]
[]
[null,null,null,null,null,null,"12 x TOTAL MENSAL",{"$f":"H85*12","v":19219027.130475998}]
[]
[null,null,null,"TOTAL MENSAL  - ITENS SOB DEMANDA"]
[null,null,null,"DESCRIÇÃO",null,null,null,"VALOR"]
[null,null,null,"HORAS EXTRAS (SOB DEMANDA)",null,null,null,{"$f":"I64","v":0}]
[null,null,null,"UNIFORMES (SOB DEMANDA)",null,null,null,399.81666666666666]
[null,null,null,"ADICIONAL DE HORAS NOTURNAS (SOB DEMANDA)",null,null,null,2325.5015504227204]
[null,null,null,"HORAS DE SOBREAVISO (SOB DEMANDA)",null,null,null,50384.771527455399]
[]
[null,null,null,null,null,null,"TOTAL MENSAL DA CONTRATAÇÃO - ITENS SOB DEMANDA",{"$f":"SUM(H93:H97)","v":53110.089744544784}]
[]
[null,null,null,"TOTAL ANUAL  - ITENS SOB DEMANDA"]
[]
[null,null,null,null,null,null,"12 x TOTAL MENSAL",{"$f":"H98*12","v":637321.07693453738}]
[]
[null,null,null,"TOTAL ANUAL GLOBAL DA CONTRATAÇÃO"]
[]
[null,null,null,null,null,null,null,{"$f":"$H$102+$H$89","v":19856348.207410537}]
[]
[]
[]
[]
[]
[null,null,null,{"$f":"Extenso_Valor(H112)","v":"um milhão, seiscentos e cinquenta e quatro mil, seiscentos e noventa e cinco reais e sessenta e oito centavos"},null,null,null,{"$f":"H85+H98","v":1654695.683950878}]

{"sheet":"1","index":4,"n_rows":119,"n_cols":8,"rows_kept":119,"cut":false,"hidden":false,"merged":[[106,1,106,3],[1,1,1,5],[2,1,2,5],[7,1,7,3],[17,1,17,3],[4,1,4,2],[46,1,46,3],[56,1,56,3],[74,1,74,3],[83,1,83,3],[5,1,5,2],[39,3,39,5],[68,3,68,5]]}
[]
[null,"PLANILHA DE ESTIMATIVA DE CUSTOS"]
[null,"Padrão IN 05/2017 e IN 07/2018 - MPDG"]
[]
[null,1,null,{"$f":"HLOOKUP($B$5,'Dados Gerais'!$D$5:$BK$20,6)","v":"TÉCNICO DE APOIO A OPERAÇÕES EM DATA CENTER (JORNADAS DE 7 ÀS 13H E DE 13 ÀS 19H)"},"QUANTIDADE",{"$f":"HLOOKUP($B$5,'Dados Gerais'!$D$5:$BK$20,10)","v":6}]
[null,"CCT",null,{"$f":"HLOOKUP($B$5,'Dados Gerais'!$D$5:$BK$20,15)","v":"SINDPD/DF X SINDESEI/DF 2021/2022 Nº DF000608/2021"},"DATA-BASE",{"$f":"'Dados Gerais'!F20","v":"2021-05-01"}]
[]
[null,"MÓDULO 1 - COMPOSIÇÃO DA REMUNERAÇÃO",null,null,null,"Valor"]
[null,null,"A","Salário-Base",null,{"$f":"HLOOKUP($B$5,'Dados Gerais'!$D$5:$BK$20,8)","v":2627.81}]
[null,null,"B","Adicional de Periculosidade",null,{"$f":"HLOOKUP($B$5,'Dados Gerais'!$D$5:$BK$37,25)","v":0}]
[null,null,"C","Adicional de Insalubridade",null,{"$f":"HLOOKUP($B$5,'Dados Gerais'!$D$5:$BK$37,31)","v":0}]
[null,null,"D","Adicional Noturno",null,{"$f":"HLOOKUP($B$5,'Dados Gerais'!$D$5:$BK$50,46)","v":0},null,"* Nota 1 - O Módulo 1 refere-se ao valor mensal devido ao empregado pela prestação do serviço no período de 12 meses."]
[null,null,"E","Adicional de Hora Extra",null,{"$f":"HLOOKUP($B$5,'Dados Gerais'!$D$5:$BK$67,63)","v":0},null,"* Nota 2 - O adicional de hora extra no feriado trabalhado foi suprimido pela Lei 13.467/17"]
[null,null,"F","Outros (especificar)",null,{"$f":"HLOOKUP($B$5,'Dados Gerais'!$D$5:$BK$59,33)","v":0},null,"* Nota 3 - ART. 7º, § 2º, DA LEI Nº 605/49.Sendo mensalista o obreiro, o adicional noturno pago de forma fixa já é considerado integrado para os efeitos do pagamento do repouso semanal remunerado, nos termos do art. 7º, § 2º, da Lei nº 605/49."]
[]
[null,null,null,"TOTAL DA REMUNERAÇÃO",null,{"$f":"SUM(F9:F14)","v":2627.81}]
[]
[null,"MÓDULO 2 - ENCARGOS E BENEFÍCIOS ANUAIS, MENSAIS E DIÁRIOS",null,null,"Percentuais","Valor"]
[null,"Submódulo 2.1 - 13º Salário, Férias e Adicional de Férias"]
[null,null,"A","13º Salário - Calculado no Módulo 7 - Destacado",0,{"$f":"ROUND(E20*F$16,2)","v":0},null,"* Nota 1 - Provisiona-se, mensalmente, o proporcional a 1/11 dos valores referentes a gratificação natalina, férias e adicional de férias."]
[null,null,"B","Adicional de Férias",{"$f":"'Encargos Sociais'!E30","v":3.03030303030303E-2},{"$f":"ROUND(E21*F$16,2)","v":79.63},null,"* Nota 2 - O adicional de férias contido no Submódulo 2.1 corresponde a 1/3 da remuneração que, por sua vez, é dividida por 11 contome Nota 1."]
[]
[null,"Submódulo 2.2 - Encargos Previdenciários (GPS), Fundo de Garantia por Tempo de Serviço (FGTS) e Outras Contribuições"]
[null,null,"A","INSS (art. 22, inciso I, Lei nº 8.212/91)",{"$f":"'Encargos Sociais'!E13","v":0.2},{"$f":"ROUND(E24*($F$16+$F$41+$F$73),2)","v":599.79999999999995}]
[null,null,"B","Salário Educação (art. 3º, inciso I, Decreto nº 87.043/82)",{"$f":"'Encargos Sociais'!E14","v":2.5000000000000001E-2},{"$f":"ROUND(E25*($F$16+$F$41+$F$73),2)","v":74.97}]
[null,null,"C","SAT/RAT (art. 22, II, Lei 8.212/91 e Anexo V, Decreto 6.042/07) - Enquadramento 8211-3/00",{"$f":"'Encargos Sociais'!E15","v":0.01},29.99]
[null,null,"D","SESC ou SESI (art. 30, Lei nº 8.036/90 e art. 1º, Lei 8.154/90)",{"$f":"'Encargos Sociais'!E16","v":1.4999999999999999E-2},44.98]
[null,null,"E","SENAI ou SENAC (Decreto nº 2.318/86)",{"$f":"'Encargos Sociais'!E17","v":0.01},29.99]
[null,null,"F","SEBRAE (§ 3º, art. 8º, Lei 8.029/90, alterada pela Lei nº 8.154/90)",{"$f":"'Encargos Sociais'!E18","v":6.0000000000000001E-3},17.989999999999998]
[null,null,"G","INCRA (art. 1º, I, Decreto Lei 1.146/70 e Lei 7.787, de 30/06/89)",{"$f":"'Encargos Sociais'!E19","v":2E-3},6,null,"* Nota 1 - Os percentuais dos encargos previdenciários, do FGTS e demais contribuições são estabelecidos por legislação vigente."]
[null,null,"H","FGTS (Lei Complementar nº 110/01 e art. 30, Lei nº 8.036/90)",{"$f":"'Encargos Sociais'!E20","v":0.08},239.92,null,"* Nota 2 - O SAT, a depender do grau de risco do serviço, irá variar entre 1%, para risco leve, de 2%, para risco médio, e de 3% para risco grave."]
[null,null,"I","SECONCI (Convenções Coletivas de Trabalho da construção)",{"$f":"'Encargos Sociais'!E21","v":0},0,null,"* Nota 3 - Os percentuais do Submódulo 2.2 incidem sobre o Módulo 1 e o Submódulo 2.1."]
[]
[null,"Submódulo 2.3 - Benefícios Mensais e Diários"]
[null,null,"A","Auxílio Transporte",null,{"$f":"HLOOKUP($B$5,'Dados Gerais'!$D$5:$BK$93,82)","v":199.88000000000002}]
[null,null,"B","Auxílio Alimentação",null,{"$f":"HLOOKUP($B$5,'Dados Gerais'!$D$5:$BK$93,89)","v":910}]
[null,null,"C","Assistência Médica e Familiar",null,{"$f":"HLOOKUP($B$5,'Dados Gerais'!$D$5:$BK$101,97)","v":285.5}]
[null,null,"D","Outros (Seguro de vida e auxílio funeral e auxílio odontológico)",null,{"$f":"HLOOKUP($B$5,'Dados Gerais'!$D$5:$BK$118,114)","v":12.36},null,"* Nota 1 - O valor informado deverá ser o custo real do benefício (descontado o valor eventualmente pago pelo empregado)."]
[null,null,null,null,null,null,null,"* Nota 2 - Observar a previsão dos benefícios contidos em Acordos, Convenções e Dissídios Coletivos de Trabalho e o disposto no art. 6º da IN 5/2017"]
[null,null,null,"QUADRO-RESUMO DO MÓDULO 2"]
[null,null,null,"2.1 - 13º Salário, Férias e Adicional de Férias - 13º Destacado - Calculado no Módulo 7 ",{"$f":"SUM(E20:E21)","v":3.03030303030303E-2},{"$f":"F20+F21","v":79.63}]
[null,null,null,"2.2 - Encargos Previdenciários (GPS), Fundo de Garantia por Tempo de Serviço (FGTS) e Contribuições",{"$f":"SUM(E24:E32)","v":0.34800000000000003},{"$f":"SUM(F24:F32)","v":1043.6400000000001}]
[null,null,null,"2.3 - Benefícios Mensais e Diários",null,{"$f":"SUM(F35:F38)","v":1407.74}]
[]
[null,null,null,"TOTAL DOS ENCARGOS E BENEFÍCIOS",null,{"$f":"SUM(F41:F43)","v":2531.0100000000002}]
[]
[null,"MÓDULO 3 - PREVISÃO PARA RESCISÃO",null,null,"Percentuais","Valor"]
[null,null,"A","Aviso Prévio Indenizado (Art. 7º, inciso XXI, da CF/1988 e arts. 477, 487, §1º, e 491 da CLT)",{"$f":"'Encargos Sociais'!E35","v":8.3333333333333332E-3},{"$f":"ROUND(E48*($F$16+$F$59),2)","v":23.89}]
[null,null,"B","Incidência do FGTS sobre o Aviso Prévio Indenizado (Súmula 305 TST)",{"$f":"'Encargos Sociais'!E36","v":6.6666666666666664E-4},{"$f":"ROUND(E49*($F$16+$F$59),2)","v":1.91},null,"* Nota 1 - Adotou-se os parâmetros do estudo do STF (http://www.stf.jus.br/arquivo/cms/sobrestfestudosci/anexo/encargos_sociais_03102007.pdf), onde 5% do pessoal é demitido pelo empregador no decurso do contrato (para estes, considerou-se o aviso prévio indenizado). Desprezou-se as demissões por justa causa e os pedidos de demissão."]
[null,null,"C","Multa do FGTS e Contribuição Social sobre o Aviso Prévio Indenizado (Art. 18, §1º, da Lei 8.036/1990 e art. 1º da LC nº 110/2001)",{"$f":"'Encargos Sociais'!E37","v":7.7170666666666644E-3},22.12,null,"* Nota 2 - No cálculo do percentual, considerou-se 36 dias, correspondendo à metade da duração média dos contratos (2 anos)"]
[null,null,"D","Aviso Prévio Trabalhado (Art. 488, parágrafo único, CLT)",{"$f":"'Encargos Sociais'!E38","v":1.2037037037037035E-2},34.51,null,"* Nota 3 - Incide sobre a Remuneração + 13º salário (1/12) + Férias (1/12) + Adicional de Férias (1/36) x 50% multa (40% para o empregado e 10% de contribuição social) x 8% FGTS"]
[null,null,"E","Incidência de GPS, FGTS e outras contribuições sobre o Aviso Prévio Trabalhado",{"$f":"'Encargos Sociais'!E39","v":4.1888888888888878E-3},12.01,null,"* Nota 4 - Os 95% restantes do cálculo, a um prazo médio de contrato de 4 anos. Assim, calcula-se 7 dias para o 1º ano de contrato e mais 3 dias para os 3 anos seguintes."]
[null,null,"F","Multa do FGTS e Contribuição Social sobre o Aviso Prévio Trabalhado",{"$f":"'Encargos Sociais'!E40","v":3.0505155555555549E-2},87.45]
[]
[null,null,null,"TOTAL DE PREVISÃO PARA RESCISÃO",null,{"$f":"SUM(F48:F53)","v":181.89000000000001}]
[]
[null,"MÓDULO 4 - CUSTO DO PROFISSIONAL AUSENTE",null,null,"Percentuais","Valor"]
[null,"Submódulo 4.1 - Ausências Legais"]
[null,null,"A","Férias (Arts. 129 e 130, inc. I, da CLT)",{"$f":"'Encargos Sociais'!E24","v":9.0909090909090912E-2},{"$f":"ROUND(E59*$F$16,2)","v":238.89},null,"* Nota 1 - As alíneas “A” a “F” referem-se somente ao custo que será pago ao repositor pelos dias \ntrabalhados quando da necessidade de substituir a mão de obra alocada na prestação do serviço."]
[null,null,"B","Ausências Legais (Arts. 131 e 473 da CLT)",{"$f":"'Encargos Sociais'!E25","v":7.9365079365079361E-3},20.86,null,"* Nota 2 - Adotou-se a estimativa do SINAPI de 2 dias por ano."]
[null,null,"C","Licença-Paternidade (Art. 7º, XIX, e art. 10, §1º, do ADCT, CF/1988 e Art. 1º, II, da Lei 11.770/2008)",{"$f":"'Encargos Sociais'!E26","v":8.2777777777777776E-4},2.1800000000000002,null,"* Nota 3 - Utilizada a proporção de 50% para homens, 5 dias de afastamento, e a probabilidade de um trabalhador requerer a Licença Paternidade em 5,22%, conforme SINAPI (citando dados da PNAD 2015)"]
[null,null,"D","Ausência por Acidente de Trabalho (Art. 131, III, da CLT)",{"$f":"'Encargos Sociais'!E27","v":8.541666666666667E-4},2.2400000000000002,null,"* Nota 4 - Utilzada a estatística de 1,96% dos contribuintes beneficiados com a emissão do auxílio, conforme Anuário Estatístico da Previdência Social. Afastamento de 15 dias a cargo da empresa."]
[null,null,"E","Afastamento Maternidade (Art. 71 da Lei nº 8.213/1991)",{"$f":"'Encargos Sociais'!E28","v":3.2925925925925922E-3},8.65,null,"* Nota 5 - Utilizada a proporção de 50% para mulheres, 180 dias de afastamento, e a probabilidade de uma trabalhadora requerer a Licença Maternidade em 4,91%, conforme SINAPI (citando dados do IBGE 2016)"]
[null,null,"F","Auxílio Enfermidade - Doença (Art. 59 da Lei nº 8.213/1991)",{"$f":"'Encargos Sociais'!E29","v":7.1222222222222225E-3},18.72,null,"* Nota 6 - Utilizada a estatística de 3,37% dos contribuintes beneficiados com o auxílio, conforme Anuário Estatístico da Previdência Social de 2015 (acrescidos de 2 dias ao ano, para os quais o trabalhador nem requer o benefício da Previdência - conforme SINAPI)"]
[]
[null,"Submódulo 4.2 - Intrajornada"]
[null,null,"A","Intervalo para repouso ou alimentação",{"$f":"'Encargos Sociais'!E32","v":0},{"$f":"ROUND(E67*$F$16,2)","v":0}]
[]
[null,null,null,"QUADRO-RESUMO DO MÓDULO 4",null,"Valor"]
[null,null,null,"4.1 - Ausências Legais",{"$f":"SUM(E59:E64)","v":0.11094235810485811},{"$f":"ROUND(E70*$F$16,2)","v":291.54000000000002}]
[null,null,null,"4.2 - Intrajornada",{"$f":"E67","v":0},{"$f":"ROUND(E71*$F$16,2)","v":0}]
[]
[null,null,null,"TOTAL DE PREVISÃO PARA RESCISÃO E INTERVALO INTRAJORNADA",null,{"$f":"SUM(F70:F71)","v":291.54000000000002}]
[]
[null,"MÓDULO 5 - INSUMOS DIVERSOS",null,null,null,"Valor"]
[null,null,"A","Uniformes - aquisição",null,{"$f":"ROUND(HLOOKUP($B$5,Uniformes!K6:DZ172,3)/12,2)","v":0}]
[null,null,"B","Materiais de consumo relacionados ao posto - aquisição",null,{"$f":"ROUND(HLOOKUP(B5,'Mat Cons'!I11:DX13,3)/12,2)","v":0}]
[null,null,"C","Materiais permanentes relacionados ao posto - remuneração da sua depreciação / manutenção",null,{"$f":"HLOOKUP(B5,'Mat Perm'!Q11:EF13,3)","v":0}]
[null,null,"D","Equipamentos relacionados ao posto - remuneração da sua depreciação / manutenção",null,{"$f":"HLOOKUP(B5,'Equip Rel'!Q11:EF13,3)","v":0}]
[null,null,"E","Equipamentos de Proteção Individual - EPI - aquisição",null,{"$f":"ROUND(HLOOKUP(B5,EPI!I3:DX37,3)/12,2)","v":0}]
[]
[null,null,null,"TOTAL DE INSUMOS DIVERSOS",null,{"$f":"SUM(F76:F81)","v":0},null,"* Nota - Valores mensais por empregado"]
[]
[null,"MÓDULO 6 - CUSTOS INDIRETOS, TRIBUTOS E LUCRO - BDI",null,null,"Percentuais","Valor"]
[null,null,"A","Custos Indiretos",{"$f":"BDI!E6","v":5.8400000000000001E-2}]
[null,null,"A.1","Administração Central",{"$f":"BDI!E7","v":2.1600000000000001E-2}]
[null,null,"A.2","Seguros, Garantias e Riscos",{"$f":"BDI!E8","v":3.6799999999999999E-2}]
[null,null,"B","Lucro",{"$f":"BDI!E10","v":3.3399999999999999E-2}]
[null,null,"C","Tributos",{"$f":"SUM(E90:E91)","v":0.124}]
[null,null,"C.1","Tributos Federais (COFINS, PIS e CPRB)",{"$f":"BDI!E18","v":7.3999999999999996E-2}]
[null,null,"C.2","Tributos Distritais (ISS)",{"$f":"BDI!E23","v":0.05},null,null,"* Nota - Utilizou-se o indicado pelo Sindicato da Arquitetura e da Engenharia (Sinaenco, 2008, p. 22), que adota um percentual redutor de 20% no cálculo dos custos tributários relativos às contribuições PIS e COFINS"]
[null,null,"D","Despesas Financeiras",{"$f":"BDI!E13","v":5.2519605742542552E-3}]
[]
[null,null,null,"TOTAL DE BDI",{"$f":"BDI!E26","v":0.25509999999999999},{"$f":"E94*E102","v":1436.786975}]
[]
[null,null,null,"QUADRO-RESUMO DO CUSTO MENSAL POR EMPREGADO - SEM O 13º","Valor"]
[null,null,null,"Módulo 1 - Composição da Remuneração",{"$f":"F16","v":2627.81}]
[null,null,null,"Módulo 2 - Encargos e Benefícios Anuais, Mensais e Diários",{"$f":"F45","v":2531.0100000000002}]
[null,null,null,"Módulo 3 - Provisão para Rescisão",{"$f":"F55","v":181.89000000000001}]
[null,null,null,"Módulo 4 - Custo de Reposição do Profissional Ausente",{"$f":"F73","v":291.54000000000002}]
[null,null,null,"Módulo 5 - Insumos Diversos",{"$f":"F82","v":0}]
[null,null,null,"SUBTOTAL (A+B+C+D+E)",{"$f":"SUM(E97:E101)","v":5632.25}]
[null,null,null,"Módulo 6 - Custos Indiretos, Tributos e Lucro",{"$f":"F94","v":1436.786975}]
[]
[null,null,null,"TOTAL DO POSTO",{"$f":"SUM(E102:E103)","v":7069.036975}]
[]
[null,"MÓDULO 7 - DESTAQUE DO MÓDULO 2 - 13º SALÁRIO",null,null,"Percentuais","Valor"]
[null,null,"A","13º Salário",{"$f":"'Encargos Sociais'!E31","v":8.3333333333333329E-2},{"$f":"ROUND(E108*F$16,2)","v":218.98}]
[null,null,"B","Encargos Sociais sobre o 13º Salário - Taxa calculada no SUBMÓDULO 2.2",{"$f":"SUM($E$24:$E$32)","v":0.34800000000000003},{"$f":"ROUND(E109*$F$108,2)","v":76.209999999999994},null,"* Nota 1 - Provisiona-se, mensalmente, o proporcional a 1/12 dos valores referentes a gratificação natalina e adicional de férias."]
[null,null,"C","Reincidência de férias sobre o 13º Salário",{"$f":"E59","v":9.0909090909090912E-2},{"$f":"ROUND(E110*$F$108,2)","v":19.91}]
[null,null,"D","BDI sobre o 13º Salário - Taxa calculada no MÓDULO 6",{"$f":"E94","v":0.25509999999999999},{"$f":"ROUND(E111*($F$108+$F$109),2)","v":75.3}]
[]
[null,null,null,"TOTAL DO DESTAQUE DO 13º SALÁRIO",null,{"$f":"SUM(F108:F111)","v":390.40000000000003}]
[]
[null,null,null,"QUADRO-RESUMO DO CUSTO MENSAL POR EMPREGADO","Valor"]
[null,null,null,"Custo total - sem o 13º Salário",{"$f":"E105","v":7069.036975}]
[null,null,null,"Destaque do 13º Salário (valor mensal)",{"$f":"F113","v":390.40000000000003}]
[]
[null,null,null,"TOTAL DO POSTO",{"$f":"E116+E117","v":7459.4369749999996}]

{"sheet":"2","index":5,"n_rows":119,"n_cols":8,"rows_kept":119,"cut":false,"hidden":false,"merged":[[106,1,106,3],[39,3,39,5],[46,1,46,3],[56,1,56,3],[68,3,68,5],[74,1,74,3],[83,1,83,3],[17,1,17,3],[1,1,1,5],[2,1,2,5],[4,1,4,2],[5,1,5,2],[7,1,7,3]]}
[]
[null,"PLANILHA DE ESTIMATIVA DE CUSTOS"]
[null,"Padrão IN 05/2017 e IN 07/2018 - MPDG"]
[]
[null,2,null,{"$f":"HLOOKUP($B$5,'Dados Gerais'!$D$5:$BK$20,6)","v":"TÉCNICO DE APOIO A OPERAÇÕES EM DATA CENTER (JORNADA DAS 19 À 1H)"},"QUANTIDADE",{"$f":"HLOOKUP($B$5,'Dados Gerais'!$D$5:$BK$20,10)","v":3}]
[null,"CCT",null,{"$f":"HLOOKUP($B$5,'Dados Gerais'!$D$5:$BK$20,15)","v":"SINDPD/DF X SINDESEI/DF 2021/2022 Nº DF000608/2021"},"DATA-BASE",{"$f":"'Dados Gerais'!F20","v":"2021-05-01"}]
[]
[null,"MÓDULO 1 - COMPOSIÇÃO DA REMUNERAÇÃO",null,null,null,"Valor"]
[null,null,"A","Salário-Base",null,{"$f":"HLOOKUP($B$5,'Dados Gerais'!$D$5:$BK$20,8)","v":2627.81}]
[null,null,"B","Adicional de Periculosidade",null,{"$f":"HLOOKUP($B$5,'Dados Gerais'!$D$5:$BK$37,25)","v":0}]
[null,null,"C","Adicional de Insalubridade",null,{"$f":"HLOOKUP($B$5,'Dados Gerais'!$D$5:$BK$37,31)","v":0}]
[null,null,"D","Adicional Noturno",null,{"$f":"HLOOKUP($B$5,'Dados Gerais'!$D$5:$BK$50,46)","v":227.74},null,"* Nota 1 - O Módulo 1 refere-se ao valor mensal devido ao empregado pela prestação do serviço no período de 12 meses."]
[null,null,"E","Adicional de Hora Extra",null,{"$f":"HLOOKUP($B$5,'Dados Gerais'!$D$5:$BK$67,63)","v":0},null,"* Nota 2 - O adicional de hora extra no feriado trabalhado foi suprimido pela Lei 13.467/17"]
[null,null,"F","Outros (especificar)",null,{"$f":"HLOOKUP($B$5,'Dados Gerais'!$D$5:$BK$59,33)","v":0},null,"* Nota 3 - ART. 7º, § 2º, DA LEI Nº 605/49.Sendo mensalista o obreiro, o adicional noturno pago de forma fixa já é considerado integrado para os efeitos do pagamento do repouso semanal remunerado, nos termos do art. 7º, § 2º, da Lei nº 605/49."]
[]
[null,null,null,"TOTAL DA REMUNERAÇÃO",null,{"$f":"SUM(F9:F14)","v":2855.55}]
[]
[null,"MÓDULO 2 - ENCARGOS E BENEFÍCIOS ANUAIS, MENSAIS E DIÁRIOS",null,null,"Percentuais","Valor"]
[null,"Submódulo 2.1 - 13º Salário, Férias e Adicional de Férias"]
[null,null,"A","13º Salário - Calculado no Módulo 7 - Destacado",0,{"$f":"ROUND(E20*F$16,2)","v":0},null,"* Nota 1 - Provisiona-se, mensalmente, o proporcional a 1/11 dos valores referentes a gratificação natalina, férias e adicional de férias."]
[null,null,"B","Adicional de Férias",{"$f":"'Encargos Sociais'!E30","v":3.03030303030303E-2},{"$f":"ROUND(E21*F$16,2)","v":86.53},null,"* Nota 2 - O adicional de férias contido no Submódulo 2.1 corresponde a 1/3 da remuneração que, por sua vez, é dividida por 11 contome Nota 1."]
[]
[null,"Submódulo 2.2 - Encargos Previdenciários (GPS), Fundo de Garantia por Tempo de Serviço (FGTS) e Outras Contribuições"]
[null,null,"A","INSS (art. 22, inciso I, Lei nº 8.212/91)",{"$f":"'Encargos Sociais'!E13","v":0.2},{"$f":"ROUND(E24*($F$16+$F$41+$F$73),2)","v":651.78}]
[null,null,"B","Salário Educação (art. 3º, inciso I, Decreto nº 87.043/82)",{"$f":"'Encargos Sociais'!E14","v":2.5000000000000001E-2},{"$f":"ROUND(E25*($F$16+$F$41+$F$73),2)","v":81.47}]
[null,null,"C","SAT/RAT (art. 22, II, Lei 8.212/91 e Anexo V, Decreto 6.042/07) - Enquadramento 8211-3/00",{"$f":"'Encargos Sociais'!E15","v":0.01},32.590000000000003]
[null,null,"D","SESC ou SESI (art. 30, Lei nº 8.036/90 e art. 1º, Lei 8.154/90)",{"$f":"'Encargos Sociais'!E16","v":1.4999999999999999E-2},48.88]
[null,null,"E","SENAI ou SENAC (Decreto nº 2.318/86)",{"$f":"'Encargos Sociais'!E17","v":0.01},32.590000000000003]
[null,null,"F","SEBRAE (§ 3º, art. 8º, Lei 8.029/90, alterada pela Lei nº 8.154/90)",{"$f":"'Encargos Sociais'!E18","v":6.0000000000000001E-3},19.55]
[null,null,"G","INCRA (art. 1º, I, Decreto Lei 1.146/70 e Lei 7.787, de 30/06/89)",{"$f":"'Encargos Sociais'!E19","v":2E-3},6.52,null,"* Nota 1 - Os percentuais dos encargos previdenciários, do FGTS e demais contribuições são estabelecidos por legislação vigente."]
[null,null,"H","FGTS (Lei Complementar nº 110/01 e art. 30, Lei nº 8.036/90)",{"$f":"'Encargos Sociais'!E20","v":0.08},260.70999999999998,null,"* Nota 2 - O SAT, a depender do grau de risco do serviço, irá variar entre 1%, para risco leve, de 2%, para risco médio, e de 3% para risco grave."]
[null,null,"I","SECONCI (Convenções Coletivas de Trabalho da construção)",{"$f":"'Encargos Sociais'!E21","v":0},0,null,"* Nota 3 - Os percentuais do Submódulo 2.2 incidem sobre o Módulo 1 e o Submódulo 2.1."]
[]
[null,"Submódulo 2.3 - Benefícios Mensais e Diários"]
[null,null,"A","Auxílio Transporte",null,{"$f":"HLOOKUP($B$5,'Dados Gerais'!$D$5:$BK$93,82)","v":199.88000000000002}]
[null,null,"B","Auxílio Alimentação",null,{"$f":"HLOOKUP($B$5,'Dados Gerais'!$D$5:$BK$93,89)","v":910}]
[null,null,"C","Assistência Médica e Familiar",null,{"$f":"HLOOKUP($B$5,'Dados Gerais'!$D$5:$BK$101,97)","v":285.5}]
[null,null,"D","Outros (Seguro de vida e auxílio funeral e auxílio odontológico)",null,{"$f":"HLOOKUP($B$5,'Dados Gerais'!$D$5:$BK$118,114)","v":12.36},null,"* Nota 1 - O valor informado deverá ser o custo real do benefício (descontado o valor eventualmente pago pelo empregado)."]
[null,null,null,null,null,null,null,"* Nota 2 - Observar a previsão dos benefícios contidos em Acordos, Convenções e Dissídios Coletivos de Trabalho e o disposto no art. 6º da IN 5/2017"]
[null,null,null,"QUADRO-RESUMO DO MÓDULO 2"]
[null,null,null,"2.1 - 13º Salário, Férias e Adicional de Férias - 13º Destacado - Calculado no Módulo 7 ",{"$f":"SUM(E20:E21)","v":3.03030303030303E-2},{"$f":"F20+F21","v":86.53}]
[null,null,null,"2.2 - Encargos Previdenciários (GPS), Fundo de Garantia por Tempo de Serviço (FGTS) e Contribuições",{"$f":"SUM(E24:E32)","v":0.34800000000000003},{"$f":"SUM(F24:F32)","v":1134.0899999999999}]
[null,null,null,"2.3 - Benefícios Mensais e Diários",null,{"$f":"SUM(F35:F38)","v":1407.74}]
[]
[null,null,null,"TOTAL DOS ENCARGOS E BENEFÍCIOS",null,{"$f":"SUM(F41:F43)","v":2628.3599999999997}]
[]
[null,"MÓDULO 3 - PREVISÃO PARA RESCISÃO",null,null,"Percentuais","Valor"]
[null,null,"A","Aviso Prévio Indenizado (Art. 7º, inciso XXI, da CF/1988 e arts. 477, 487, §1º, e 491 da CLT)",{"$f":"'Encargos Sociais'!E35","v":8.3333333333333332E-3},{"$f":"ROUND(E48*($F$16+$F$59),2)","v":25.96}]
[null,null,"B","Incidência do FGTS sobre o Aviso Prévio Indenizado (Súmula 305 TST)",{"$f":"'Encargos Sociais'!E36","v":6.6666666666666664E-4},{"$f":"ROUND(E49*($F$16+$F$59),2)","v":2.08},null,"* Nota 1 - Adotou-se os parâmetros do estudo do STF (http://www.stf.jus.br/arquivo/cms/sobrestfestudosci/anexo/encargos_sociais_03102007.pdf), onde 5% do pessoal é demitido pelo empregador no decurso do contrato (para estes, considerou-se o aviso prévio indenizado). Desprezou-se as demissões por justa causa e os pedidos de demissão."]
[null,null,"C","Multa do FGTS e Contribuição Social sobre o Aviso Prévio Indenizado (Art. 18, §1º, da Lei 8.036/1990 e art. 1º da LC nº 110/2001)",{"$f":"'Encargos Sociais'!E37","v":7.7170666666666644E-3},24.04,null,"* Nota 2 - No cálculo do percentual, considerou-se 36 dias, correspondendo à metade da duração média dos contratos (2 anos)"]
[null,null,"D","Aviso Prévio Trabalhado (Art. 488, parágrafo único, CLT)",{"$f":"'Encargos Sociais'!E38","v":1.2037037037037035E-2},37.5,null,"* Nota 3 - Incide sobre a Remuneração + 13º salário (1/12) + Férias (1/12) + Adicional de Férias (1/36) x 50% multa (40% para o empregado e 10% de contribuição social) x 8% FGTS"]
[null,null,"E","Incidência de GPS, FGTS e outras contribuições sobre o Aviso Prévio Trabalhado",{"$f":"'Encargos Sociais'!E39","v":4.1888888888888878E-3},13.05,null,"* Nota 4 - Os 95% restantes do cálculo, a um prazo médio de contrato de 4 anos. Assim, calcula-se 7 dias para o 1º ano de contrato e mais 3 dias para os 3 anos seguintes."]
[null,null,"F","Multa do FGTS e Contribuição Social sobre o Aviso Prévio Trabalhado",{"$f":"'Encargos Sociais'!E40","v":3.0505155555555549E-2},95.03]
[]
[null,null,null,"TOTAL DE PREVISÃO PARA RESCISÃO",null,{"$f":"SUM(F48:F53)","v":197.66}]
[]
[null,"MÓDULO 4 - CUSTO DO PROFISSIONAL AUSENTE",null,null,"Percentuais","Valor"]
[null,"Submódulo 4.1 - Ausências Legais"]
[null,null,"A","Férias (Arts. 129 e 130, inc. I, da CLT)",{"$f":"'Encargos Sociais'!E24","v":9.0909090909090912E-2},{"$f":"ROUND(E59*$F$16,2)","v":259.60000000000002},null,"* Nota 1 - As alíneas “A” a “F” referem-se somente ao custo que será pago ao repositor pelos dias \ntrabalhados quando da necessidade de substituir a mão de obra alocada na prestação do serviço."]
[null,null,"B","Ausências Legais (Arts. 131 e 473 da CLT)",{"$f":"'Encargos Sociais'!E25","v":7.9365079365079361E-3},22.66,null,"* Nota 2 - Adotou-se a estimativa do SINAPI de 2 dias por ano."]
[null,null,"C","Licença-Paternidade (Art. 7º, XIX, e art. 10, §1º, do ADCT, CF/1988 e Art. 1º, II, da Lei 11.770/2008)",{"$f":"'Encargos Sociais'!E26","v":8.2777777777777776E-4},2.36,null,"* Nota 3 - Utilizada a proporção de 50% para homens, 5 dias de afastamento, e a probabilidade de um trabalhador requerer a Licença Paternidade em 5,22%, conforme SINAPI (citando dados da PNAD 2015)"]
[null,null,"D","Ausência por Acidente de Trabalho (Art. 131, III, da CLT)",{"$f":"'Encargos Sociais'!E27","v":8.541666666666667E-4},2.44,null,"* Nota 4 - Utilzada a estatística de 1,96% dos contribuintes beneficiados com a emissão do auxílio, conforme Anuário Estatístico da Previdência Social. Afastamento de 15 dias a cargo da empresa."]
[null,null,"E","Afastamento Maternidade (Art. 71 da Lei nº 8.213/1991)",{"$f":"'Encargos Sociais'!E28","v":3.2925925925925922E-3},9.4,null,"* Nota 5 - Utilizada a proporção de 50% para mulheres, 180 dias de afastamento, e a probabilidade de uma trabalhadora requerer a Licença Maternidade em 4,91%, conforme SINAPI (citando dados do IBGE 2016)"]
[null,null,"F","Auxílio Enfermidade - Doença (Art. 59 da Lei nº 8.213/1991)",{"$f":"'Encargos Sociais'!E29","v":7.1222222222222225E-3},20.34,null,"* Nota 6 - Utilizada a estatística de 3,37% dos contribuintes beneficiados com o auxílio, conforme Anuário Estatístico da Previdência Social de 2015 (acrescidos de 2 dias ao ano, para os quais o trabalhador nem requer o benefício da Previdência - conforme SINAPI)"]
[]
[null,"Submódulo 4.2 - Intrajornada"]
[null,null,"A","Intervalo para repouso ou alimentação",{"$f":"'Encargos Sociais'!E32","v":0},{"$f":"ROUND(E67*$F$16,2)","v":0}]
[]
[null,null,null,"QUADRO-RESUMO DO MÓDULO 4",null,"Valor"]
[null,null,null,"4.1 - Ausências Legais",{"$f":"SUM(E59:E64)","v":0.11094235810485811},{"$f":"ROUND(E70*$F$16,2)","v":316.8}]
[null,null,null,"4.2 - Intrajornada",{"$f":"E67","v":0},{"$f":"ROUND(E71*$F$16,2)","v":0}]
[]
[null,null,null,"TOTAL DE PREVISÃO PARA RESCISÃO E INTERVALO INTRAJORNADA",null,{"$f":"SUM(F70:F71)","v":316.8}]
[]
[null,"MÓDULO 5 - INSUMOS DIVERSOS",null,null,null,"Valor"]
[null,null,"A","Uniformes - aquisição",null,{"$f":"ROUND(HLOOKUP($B$5,Uniformes!K6:DZ172,3)/12,2)","v":0}]
[null,null,"B","Materiais de consumo relacionados ao posto - aquisição",null,{"$f":"ROUND(HLOOKUP(B5,'Mat Cons'!I11:DX13,3)/12,2)","v":0}]
[null,null,"C","Materiais permanentes relacionados ao posto - remuneração da sua depreciação / manutenção",null,{"$f":"HLOOKUP(B5,'Mat Perm'!Q11:EF13,3)","v":0}]
[null,null,"D","Equipamentos relacionados ao posto - remuneração da sua depreciação / manutenção",null,{"$f":"HLOOKUP(B5,'Equip Rel'!Q11:EF13,3)","v":0}]
[null,null,"E","Equipamentos de Proteção Individual - EPI - aquisição",null,{"$f":"ROUND(HLOOKUP(B5,EPI!I3:DX37,3)/12,2)","v":0}]
[]
[null,null,null,"TOTAL DE INSUMOS DIVERSOS",null,{"$f":"SUM(F76:F81)","v":0},null,"* Nota - Valores mensais por empregado"]
[]
[null,"MÓDULO 6 - CUSTOS INDIRETOS, TRIBUTOS E LUCRO - BDI",null,null,"Percentuais","Valor"]
[null,null,"A","Custos Indiretos",{"$f":"BDI!E6","v":5.8400000000000001E-2}]
[null,null,"A.1","Administração Central",{"$f":"BDI!E7","v":2.1600000000000001E-2}]
[null,null,"A.2","Seguros, Garantias e Riscos",{"$f":"BDI!E8","v":3.6799999999999999E-2}]
[null,null,"B","Lucro",{"$f":"BDI!E10","v":3.3399999999999999E-2}]
[null,null,"C","Tributos",{"$f":"SUM(E90:E91)","v":0.124}]
[null,null,"C.1","Tributos Federais (COFINS, PIS e CPRB)",{"$f":"BDI!E18","v":7.3999999999999996E-2}]
[null,null,"C.2","Tributos Distritais (ISS)",{"$f":"BDI!E23","v":0.05},null,null,"* Nota - Utilizou-se o indicado pelo Sindicato da Arquitetura e da Engenharia (Sinaenco, 2008, p. 22), que adota um percentual redutor de 20% no cálculo dos custos tributários relativos às contribuições PIS e COFINS"]
[null,null,"D","Despesas Financeiras",{"$f":"BDI!E13","v":5.2519605742542552E-3}]
[]
[null,null,null,"TOTAL DE BDI",{"$f":"BDI!E26","v":0.25509999999999999},{"$f":"E94*E102","v":1530.1841869999998}]
[]
[null,null,null,"QUADRO-RESUMO DO CUSTO MENSAL POR EMPREGADO - SEM O 13º","Valor"]
[null,null,null,"Módulo 1 - Composição da Remuneração",{"$f":"F16","v":2855.55}]
[null,null,null,"Módulo 2 - Encargos e Benefícios Anuais, Mensais e Diários",{"$f":"F45","v":2628.3599999999997}]
[null,null,null,"Módulo 3 - Provisão para Rescisão",{"$f":"F55","v":197.66}]
[null,null,null,"Módulo 4 - Custo de Reposição do Profissional Ausente",{"$f":"F73","v":316.8}]
[null,null,null,"Módulo 5 - Insumos Diversos",{"$f":"F82","v":0}]
[null,null,null,"SUBTOTAL (A+B+C+D+E)",{"$f":"SUM(E97:E101)","v":5998.37}]
[null,null,null,"Módulo 6 - Custos Indiretos, Tributos e Lucro",{"$f":"F94","v":1530.1841869999998}]
[]
[null,null,null,"TOTAL DO POSTO",{"$f":"SUM(E102:E103)","v":7528.5541869999997}]
[]
[null,"MÓDULO 7 - DESTAQUE DO MÓDULO 2 - 13º SALÁRIO",null,null,"Percentuais","Valor"]
[null,null,"A","13º Salário",{"$f":"'Encargos Sociais'!E31","v":8.3333333333333329E-2},{"$f":"ROUND(E108*F$16,2)","v":237.96}]
[null,null,"B","Encargos Sociais sobre o 13º Salário - Taxa calculada no SUBMÓDULO 2.2",{"$f":"SUM($E$24:$E$32)","v":0.34800000000000003},{"$f":"ROUND(E109*$F$108,2)","v":82.81},null,"* Nota 1 - Provisiona-se, mensalmente, o proporcional a 1/12 dos valores referentes a gratificação natalina e adicional de férias."]
[null,null,"C","Reincidência de férias sobre o 13º Salário",{"$f":"E59","v":9.0909090909090912E-2},{"$f":"ROUND(E110*$F$108,2)","v":21.63}]
[null,null,"D","BDI sobre o 13º Salário - Taxa calculada no MÓDULO 6",{"$f":"E94","v":0.25509999999999999},{"$f":"ROUND(E111*($F$108+$F$109),2)","v":81.83}]
[]
[null,null,null,"TOTAL DO DESTAQUE DO 13º SALÁRIO",null,{"$f":"SUM(F108:F111)","v":424.22999999999996}]
[]
[null,null,null,"QUADRO-RESUMO DO CUSTO MENSAL POR EMPREGADO","Valor"]
[null,null,null,"Custo total - sem o 13º Salário",{"$f":"E105","v":7528.5541869999997}]
[null,null,null,"Destaque do 13º Salário (valor mensal)",{"$f":"F113","v":424.22999999999996}]
[]
[null,null,null,"TOTAL DO POSTO",{"$f":"E116+E117","v":7952.7841869999993}]

{"sheet":"3","index":6,"n_rows":119,"n_cols":8,"rows_kept":119,"cut":false,"hidden":false,"merged":[[106,1,106,3],[39,3,39,5],[46,1,46,3],[56,1,56,3],[68,3,68,5],[74,1,74,3],[83,1,83,3],[17,1,17,3],[1,1,1,5],[2,1,2,5],[4,1,4,2],[5,1,5,2],[7,1,7,3]]}
[]
[null,"PLANILHA DE ESTIMATIVA DE CUSTOS"]
[null,"Padrão IN 05/2017 e IN 07/2018 - MPDG"]
[]
[null,3,null,{"$f":"HLOOKUP($B$5,'Dados Gerais'!$D$5:$BK$20,6)","v":"TÉCNICO DE APOIO A OPERAÇÕES EM DATA CENTER (JORNADA DA 1H ÀS 7H)"},"QUANTIDADE",{"$f":"HLOOKUP($B$5,'Dados Gerais'!$D$5:$BK$20,10)","v":3}]
[null,"CCT",null,{"$f":"HLOOKUP($B$5,'Dados Gerais'!$D$5:$BK$20,15)","v":"SINDPD/DF X SINDESEI/DF 2021/2022 Nº DF000608/2021"},"DATA-BASE",{"$f":"'Dados Gerais'!F20","v":"2021-05-01"}]
[]
[null,"MÓDULO 1 - COMPOSIÇÃO DA REMUNERAÇÃO",null,null,null,"Valor"]
[null,null,"A","Salário-Base",null,{"$f":"HLOOKUP($B$5,'Dados Gerais'!$D$5:$BK$20,8)","v":2627.81}]
[null,null,"B","Adicional de Periculosidade",null,{"$f":"HLOOKUP($B$5,'Dados Gerais'!$D$5:$BK$37,25)","v":0}]
[null,null,"C","Adicional de Insalubridade",null,{"$f":"HLOOKUP($B$5,'Dados Gerais'!$D$5:$BK$37,31)","v":0}]
[null,null,"D","Adicional Noturno",null,{"$f":"HLOOKUP($B$5,'Dados Gerais'!$D$5:$BK$50,46)","v":379.57},null,"* Nota 1 - O Módulo 1 refere-se ao valor mensal devido ao empregado pela prestação do serviço no período de 12 meses."]
[null,null,"E","Adicional de Hora Extra",null,{"$f":"HLOOKUP($B$5,'Dados Gerais'!$D$5:$BK$67,63)","v":0},null,"* Nota 2 - O adicional de hora extra no feriado trabalhado foi suprimido pela Lei 13.467/17"]
[null,null,"F","Outros (especificar)",null,{"$f":"HLOOKUP($B$5,'Dados Gerais'!$D$5:$BK$59,33)","v":0},null,"* Nota 3 - ART. 7º, § 2º, DA LEI Nº 605/49.Sendo mensalista o obreiro, o adicional noturno pago de forma fixa já é considerado integrado para os efeitos do pagamento do repouso semanal remunerado, nos termos do art. 7º, § 2º, da Lei nº 605/49."]
[]
[null,null,null,"TOTAL DA REMUNERAÇÃO",null,{"$f":"SUM(F9:F14)","v":3007.38}]
[]
[null,"MÓDULO 2 - ENCARGOS E BENEFÍCIOS ANUAIS, MENSAIS E DIÁRIOS",null,null,"Percentuais","Valor"]
[null,"Submódulo 2.1 - 13º Salário, Férias e Adicional de Férias"]
[null,null,"A","13º Salário - Calculado no Módulo 7 - Destacado",0,{"$f":"ROUND(E20*F$16,2)","v":0},null,"* Nota 1 - Provisiona-se, mensalmente, o proporcional a 1/11 dos valores referentes a gratificação natalina, férias e adicional de férias."]
[null,null,"B","Adicional de Férias",{"$f":"'Encargos Sociais'!E30","v":3.03030303030303E-2},{"$f":"ROUND(E21*F$16,2)","v":91.13},null,"* Nota 2 - O adicional de férias contido no Submódulo 2.1 corresponde a 1/3 da remuneração que, por sua vez, é dividida por 11 contome Nota 1."]
[]
[null,"Submódulo 2.2 - Encargos Previdenciários (GPS), Fundo de Garantia por Tempo de Serviço (FGTS) e Outras Contribuições"]
[null,null,"A","INSS (art. 22, inciso I, Lei nº 8.212/91)",{"$f":"'Encargos Sociais'!E13","v":0.2},{"$f":"ROUND(E24*($F$16+$F$41+$F$73),2)","v":686.43}]
[null,null,"B","Salário Educação (art. 3º, inciso I, Decreto nº 87.043/82)",{"$f":"'Encargos Sociais'!E14","v":2.5000000000000001E-2},{"$f":"ROUND(E25*($F$16+$F$41+$F$73),2)","v":85.8}]
[null,null,"C","SAT/RAT (art. 22, II, Lei 8.212/91 e Anexo V, Decreto 6.042/07) - Enquadramento 8211-3/00",{"$f":"'Encargos Sociais'!E15","v":0.01},34.32]
[null,null,"D","SESC ou SESI (art. 30, Lei nº 8.036/90 e art. 1º, Lei 8.154/90)",{"$f":"'Encargos Sociais'!E16","v":1.4999999999999999E-2},51.48]
[null,null,"E","SENAI ou SENAC (Decreto nº 2.318/86)",{"$f":"'Encargos Sociais'!E17","v":0.01},34.32]
[null,null,"F","SEBRAE (§ 3º, art. 8º, Lei 8.029/90, alterada pela Lei nº 8.154/90)",{"$f":"'Encargos Sociais'!E18","v":6.0000000000000001E-3},20.59]
[null,null,"G","INCRA (art. 1º, I, Decreto Lei 1.146/70 e Lei 7.787, de 30/06/89)",{"$f":"'Encargos Sociais'!E19","v":2E-3},6.86,null,"* Nota 1 - Os percentuais dos encargos previdenciários, do FGTS e demais contribuições são estabelecidos por legislação vigente."]
[null,null,"H","FGTS (Lei Complementar nº 110/01 e art. 30, Lei nº 8.036/90)",{"$f":"'Encargos Sociais'!E20","v":0.08},274.57,null,"* Nota 2 - O SAT, a depender do grau de risco do serviço, irá variar entre 1%, para risco leve, de 2%, para risco médio, e de 3% para risco grave."]
[null,null,"I","SECONCI (Convenções Coletivas de Trabalho da construção)",{"$f":"'Encargos Sociais'!E21","v":0},0,null,"* Nota 3 - Os percentuais do Submódulo 2.2 incidem sobre o Módulo 1 e o Submódulo 2.1."]
[]
[null,"Submódulo 2.3 - Benefícios Mensais e Diários"]
[null,null,"A","Auxílio Transporte",null,{"$f":"HLOOKUP($B$5,'Dados Gerais'!$D$5:$BK$93,82)","v":199.88000000000002}]
[null,null,"B","Auxílio Alimentação",null,{"$f":"HLOOKUP($B$5,'Dados Gerais'!$D$5:$BK$93,89)","v":910}]
[null,null,"C","Assistência Médica e Familiar",null,{"$f":"HLOOKUP($B$5,'Dados Gerais'!$D$5:$BK$101,97)","v":285.5}]
[null,null,"D","Outros (Seguro de vida e auxílio funeral e auxílio odontológico)",null,{"$f":"HLOOKUP($B$5,'Dados Gerais'!$D$5:$BK$118,114)","v":12.36},null,"* Nota 1 - O valor informado deverá ser o custo real do benefício (descontado o valor eventualmente pago pelo empregado)."]
[null,null,null,null,null,null,null,"* Nota 2 - Observar a previsão dos benefícios contidos em Acordos, Convenções e Dissídios Coletivos de Trabalho e o disposto no art. 6º da IN 5/2017"]
[null,null,null,"QUADRO-RESUMO DO MÓDULO 2"]
[null,null,null,"2.1 - 13º Salário, Férias e Adicional de Férias - 13º Destacado - Calculado no Módulo 7 ",{"$f":"SUM(E20:E21)","v":3.03030303030303E-2},{"$f":"F20+F21","v":91.13}]
[null,null,null,"2.2 - Encargos Previdenciários (GPS), Fundo de Garantia por Tempo de Serviço (FGTS) e Contribuições",{"$f":"SUM(E24:E32)","v":0.34800000000000003},{"$f":"SUM(F24:F32)","v":1194.3700000000001}]
[null,null,null,"2.3 - Benefícios Mensais e Diários",null,{"$f":"SUM(F35:F38)","v":1407.74}]
[]
[null,null,null,"TOTAL DOS ENCARGOS E BENEFÍCIOS",null,{"$f":"SUM(F41:F43)","v":2693.24}]
[]
[null,"MÓDULO 3 - PREVISÃO PARA RESCISÃO",null,null,"Percentuais","Valor"]
[null,null,"A","Aviso Prévio Indenizado (Art. 7º, inciso XXI, da CF/1988 e arts. 477, 487, §1º, e 491 da CLT)",{"$f":"'Encargos Sociais'!E35","v":8.3333333333333332E-3},{"$f":"ROUND(E48*($F$16+$F$59),2)","v":27.34}]
[null,null,"B","Incidência do FGTS sobre o Aviso Prévio Indenizado (Súmula 305 TST)",{"$f":"'Encargos Sociais'!E36","v":6.6666666666666664E-4},{"$f":"ROUND(E49*($F$16+$F$59),2)","v":2.19},null,"* Nota 1 - Adotou-se os parâmetros do estudo do STF (http://www.stf.jus.br/arquivo/cms/sobrestfestudosci/anexo/encargos_sociais_03102007.pdf), onde 5% do pessoal é demitido pelo empregador no decurso do contrato (para estes, considerou-se o aviso prévio indenizado). Desprezou-se as demissões por justa causa e os pedidos de demissão."]
[null,null,"C","Multa do FGTS e Contribuição Social sobre o Aviso Prévio Indenizado (Art. 18, §1º, da Lei 8.036/1990 e art. 1º da LC nº 110/2001)",{"$f":"'Encargos Sociais'!E37","v":7.7170666666666644E-3},25.32,null,"* Nota 2 - No cálculo do percentual, considerou-se 36 dias, correspondendo à metade da duração média dos contratos (2 anos)"]
[null,null,"D","Aviso Prévio Trabalhado (Art. 488, parágrafo único, CLT)",{"$f":"'Encargos Sociais'!E38","v":1.2037037037037035E-2},39.49,null,"* Nota 3 - Incide sobre a Remuneração + 13º salário (1/12) + Férias (1/12) + Adicional de Férias (1/36) x 50% multa (40% para o empregado e 10% de contribuição social) x 8% FGTS"]
[null,null,"E","Incidência de GPS, FGTS e outras contribuições sobre o Aviso Prévio Trabalhado",{"$f":"'Encargos Sociais'!E39","v":4.1888888888888878E-3},13.74,null,"* Nota 4 - Os 95% restantes do cálculo, a um prazo médio de contrato de 4 anos. Assim, calcula-se 7 dias para o 1º ano de contrato e mais 3 dias para os 3 anos seguintes."]
[null,null,"F","Multa do FGTS e Contribuição Social sobre o Aviso Prévio Trabalhado",{"$f":"'Encargos Sociais'!E40","v":3.0505155555555549E-2},100.08]
[]
[null,null,null,"TOTAL DE PREVISÃO PARA RESCISÃO",null,{"$f":"SUM(F48:F53)","v":208.16}]
[]
[null,"MÓDULO 4 - CUSTO DO PROFISSIONAL AUSENTE",null,null,"Percentuais","Valor"]
[null,"Submódulo 4.1 - Ausências Legais"]
[null,null,"A","Férias (Arts. 129 e 130, inc. I, da CLT)",{"$f":"'Encargos Sociais'!E24","v":9.0909090909090912E-2},{"$f":"ROUND(E59*$F$16,2)","v":273.39999999999998},null,"* Nota 1 - As alíneas “A” a “F” referem-se somente ao custo que será pago ao repositor pelos dias \ntrabalhados quando da necessidade de substituir a mão de obra alocada na prestação do serviço."]
[null,null,"B","Ausências Legais (Arts. 131 e 473 da CLT)",{"$f":"'Encargos Sociais'!E25","v":7.9365079365079361E-3},23.87,null,"* Nota 2 - Adotou-se a estimativa do SINAPI de 2 dias por ano."]
[null,null,"C","Licença-Paternidade (Art. 7º, XIX, e art. 10, §1º, do ADCT, CF/1988 e Art. 1º, II, da Lei 11.770/2008)",{"$f":"'Encargos Sociais'!E26","v":8.2777777777777776E-4},2.4900000000000002,null,"* Nota 3 - Utilizada a proporção de 50% para homens, 5 dias de afastamento, e a probabilidade de um trabalhador requerer a Licença Paternidade em 5,22%, conforme SINAPI (citando dados da PNAD 2015)"]
[null,null,"D","Ausência por Acidente de Trabalho (Art. 131, III, da CLT)",{"$f":"'Encargos Sociais'!E27","v":8.541666666666667E-4},2.57,null,"* Nota 4 - Utilzada a estatística de 1,96% dos contribuintes beneficiados com a emissão do auxílio, conforme Anuário Estatístico da Previdência Social. Afastamento de 15 dias a cargo da empresa."]
[null,null,"E","Afastamento Maternidade (Art. 71 da Lei nº 8.213/1991)",{"$f":"'Encargos Sociais'!E28","v":3.2925925925925922E-3},9.9,null,"* Nota 5 - Utilizada a proporção de 50% para mulheres, 180 dias de afastamento, e a probabilidade de uma trabalhadora requerer a Licença Maternidade em 4,91%, conforme SINAPI (citando dados do IBGE 2016)"]
[null,null,"F","Auxílio Enfermidade - Doença (Art. 59 da Lei nº 8.213/1991)",{"$f":"'Encargos Sociais'!E29","v":7.1222222222222225E-3},21.42,null,"* Nota 6 - Utilizada a estatística de 3,37% dos contribuintes beneficiados com o auxílio, conforme Anuário Estatístico da Previdência Social de 2015 (acrescidos de 2 dias ao ano, para os quais o trabalhador nem requer o benefício da Previdência - conforme SINAPI)"]
[]
[null,"Submódulo 4.2 - Intrajornada"]
[null,null,"A","Intervalo para repouso ou alimentação",{"$f":"'Encargos Sociais'!E32","v":0},{"$f":"ROUND(E67*$F$16,2)","v":0}]
[]
[null,null,null,"QUADRO-RESUMO DO MÓDULO 4",null,"Valor"]
[null,null,null,"4.1 - Ausências Legais",{"$f":"SUM(E59:E64)","v":0.11094235810485811},{"$f":"ROUND(E70*$F$16,2)","v":333.65}]
[null,null,null,"4.2 - Intrajornada",{"$f":"E67","v":0},{"$f":"ROUND(E71*$F$16,2)","v":0}]
[]
[null,null,null,"TOTAL DE PREVISÃO PARA RESCISÃO E INTERVALO INTRAJORNADA",null,{"$f":"SUM(F70:F71)","v":333.65}]
[]
[null,"MÓDULO 5 - INSUMOS DIVERSOS",null,null,null,"Valor"]
[null,null,"A","Uniformes - aquisição",null,{"$f":"ROUND(HLOOKUP($B$5,Uniformes!K6:DZ172,3)/12,2)","v":0}]
[null,null,"B","Materiais de consumo relacionados ao posto - aquisição",null,{"$f":"ROUND(HLOOKUP(B5,'Mat Cons'!I11:DX13,3)/12,2)","v":0}]
[null,null,"C","Materiais permanentes relacionados ao posto - remuneração da sua depreciação / manutenção",null,{"$f":"HLOOKUP(B5,'Mat Perm'!Q11:EF13,3)","v":0}]
[null,null,"D","Equipamentos relacionados ao posto - remuneração da sua depreciação / manutenção",null,{"$f":"HLOOKUP(B5,'Equip Rel'!Q11:EF13,3)","v":0}]
[null,null,"E","Equipamentos de Proteção Individual - EPI - aquisição",null,{"$f":"ROUND(HLOOKUP(B5,EPI!I3:DX37,3)/12,2)","v":0}]
[]
[null,null,null,"TOTAL DE INSUMOS DIVERSOS",null,{"$f":"SUM(F76:F81)","v":0},null,"* Nota - Valores mensais por empregado"]
[]
[null,"MÓDULO 6 - CUSTOS INDIRETOS, TRIBUTOS E LUCRO - BDI",null,null,"Percentuais","Valor"]
[null,null,"A","Custos Indiretos",{"$f":"BDI!E6","v":5.8400000000000001E-2}]
[null,null,"A.1","Administração Central",{"$f":"BDI!E7","v":2.1600000000000001E-2}]
[null,null,"A.2","Seguros, Garantias e Riscos",{"$f":"BDI!E8","v":3.6799999999999999E-2}]
[null,null,"B","Lucro",{"$f":"BDI!E10","v":3.3399999999999999E-2}]
[null,null,"C","Tributos",{"$f":"SUM(E90:E91)","v":0.124}]
[null,null,"C.1","Tributos Federais (COFINS, PIS e CPRB)",{"$f":"BDI!E18","v":7.3999999999999996E-2}]
[null,null,"C.2","Tributos Distritais (ISS)",{"$f":"BDI!E23","v":0.05},null,null,"* Nota - Utilizou-se o indicado pelo Sindicato da Arquitetura e da Engenharia (Sinaenco, 2008, p. 22), que adota um percentual redutor de 20% no cálculo dos custos tributários relativos às contribuições PIS e COFINS"]
[null,null,"D","Despesas Financeiras",{"$f":"BDI!E13","v":5.2519605742542552E-3}]
[]
[null,null,null,"TOTAL DE BDI",{"$f":"BDI!E26","v":0.25509999999999999},{"$f":"E94*E102","v":1592.4438929999999}]
[]
[null,null,null,"QUADRO-RESUMO DO CUSTO MENSAL POR EMPREGADO - SEM O 13º","Valor"]
[null,null,null,"Módulo 1 - Composição da Remuneração",{"$f":"F16","v":3007.38}]
[null,null,null,"Módulo 2 - Encargos e Benefícios Anuais, Mensais e Diários",{"$f":"F45","v":2693.24}]
[null,null,null,"Módulo 3 - Provisão para Rescisão",{"$f":"F55","v":208.16}]
[null,null,null,"Módulo 4 - Custo de Reposição do Profissional Ausente",{"$f":"F73","v":333.65}]
[null,null,null,"Módulo 5 - Insumos Diversos",{"$f":"F82","v":0}]
[null,null,null,"SUBTOTAL (A+B+C+D+E)",{"$f":"SUM(E97:E101)","v":6242.4299999999994}]
[null,null,null,"Módulo 6 - Custos Indiretos, Tributos e Lucro",{"$f":"F94","v":1592.4438929999999}]
[]
[null,null,null,"TOTAL DO POSTO",{"$f":"SUM(E102:E103)","v":7834.873892999999}]
[]
[null,"MÓDULO 7 - DESTAQUE DO MÓDULO 2 - 13º SALÁRIO",null,null,"Percentuais","Valor"]
[null,null,"A","13º Salário",{"$f":"'Encargos Sociais'!E31","v":8.3333333333333329E-2},{"$f":"ROUND(E108*F$16,2)","v":250.62}]
[null,null,"B","Encargos Sociais sobre o 13º Salário - Taxa calculada no SUBMÓDULO 2.2",{"$f":"SUM($E$24:$E$32)","v":0.34800000000000003},{"$f":"ROUND(E109*$F$108,2)","v":87.22},null,"* Nota 1 - Provisiona-se, mensalmente, o proporcional a 1/12 dos valores referentes a gratificação natalina e adicional de férias."]
[null,null,"C","Reincidência de férias sobre o 13º Salário",{"$f":"E59","v":9.0909090909090912E-2},{"$f":"ROUND(E110*$F$108,2)","v":22.78}]
[null,null,"D","BDI sobre o 13º Salário - Taxa calculada no MÓDULO 6",{"$f":"E94","v":0.25509999999999999},{"$f":"ROUND(E111*($F$108+$F$109),2)","v":86.18}]
[]
[null,null,null,"TOTAL DO DESTAQUE DO 13º SALÁRIO",null,{"$f":"SUM(F108:F111)","v":446.8}]
[]
[null,null,null,"QUADRO-RESUMO DO CUSTO MENSAL POR EMPREGADO","Valor"]
[null,null,null,"Custo total - sem o 13º Salário",{"$f":"E105","v":7834.873892999999}]
[null,null,null,"Destaque do 13º Salário (valor mensal)",{"$f":"F113","v":446.8}]
[]
[null,null,null,"TOTAL DO POSTO",{"$f":"E116+E117","v":8281.6738929999992}]

{"sheet":"4","index":7,"n_rows":119,"n_cols":8,"rows_kept":119,"cut":false,"hidden":false,"merged":[[106,1,106,3],[39,3,39,5],[46,1,46,3],[56,1,56,3],[68,3,68,5],[74,1,74,3],[83,1,83,3],[17,1,17,3],[1,1,1,5],[2,1,2,5],[4,1,4,2],[5,1,5,2],[7,1,7,3]]}
[]
[null,"PLANILHA DE ESTIMATIVA DE CUSTOS"]
[null,"Padrão IN 05/2017 e IN 07/2018 - MPDG"]
[]
[null,4,null,{"$f":"HLOOKUP($B$5,'Dados Gerais'!$D$5:$BK$20,6)","v":"TÉCNICO DE APOIO AO MONITORAMENTO DA INFRAESTRUTURA (JORNADAS DE 7 ÀS 13H E DE 13 ÀS 19H)"},"QUANTIDADE",{"$f":"HLOOKUP($B$5,'Dados Gerais'!$D$5:$BK$20,10)","v":6}]
[null,"CCT",null,{"$f":"HLOOKUP($B$5,'Dados Gerais'!$D$5:$BK$20,15)","v":"SINDPD/DF X SINDESEI/DF 2021/2022 Nº DF000608/2021"},"DATA-BASE",{"$f":"'Dados Gerais'!F20","v":"2021-05-01"}]
[]
[null,"MÓDULO 1 - COMPOSIÇÃO DA REMUNERAÇÃO",null,null,null,"Valor"]
[null,null,"A","Salário-Base",null,{"$f":"HLOOKUP($B$5,'Dados Gerais'!$D$5:$BK$20,8)","v":2627.81}]
[null,null,"B","Adicional de Periculosidade",null,{"$f":"HLOOKUP($B$5,'Dados Gerais'!$D$5:$BK$37,25)","v":0}]
[null,null,"C","Adicional de Insalubridade",null,{"$f":"HLOOKUP($B$5,'Dados Gerais'!$D$5:$BK$37,31)","v":0}]
[null,null,"D","Adicional Noturno",null,{"$f":"HLOOKUP($B$5,'Dados Gerais'!$D$5:$BK$50,46)","v":0},null,"* Nota 1 - O Módulo 1 refere-se ao valor mensal devido ao empregado pela prestação do serviço no período de 12 meses."]
[null,null,"E","Adicional de Hora Extra",null,{"$f":"HLOOKUP($B$5,'Dados Gerais'!$D$5:$BK$67,63)","v":0},null,"* Nota 2 - O adicional de hora extra no feriado trabalhado foi suprimido pela Lei 13.467/17"]
[null,null,"F","Outros (especificar)",null,{"$f":"HLOOKUP($B$5,'Dados Gerais'!$D$5:$BK$59,33)","v":0},null,"* Nota 3 - ART. 7º, § 2º, DA LEI Nº 605/49.Sendo mensalista o obreiro, o adicional noturno pago de forma fixa já é considerado integrado para os efeitos do pagamento do repouso semanal remunerado, nos termos do art. 7º, § 2º, da Lei nº 605/49."]
[]
[null,null,null,"TOTAL DA REMUNERAÇÃO",null,{"$f":"SUM(F9:F14)","v":2627.81}]
[]
[null,"MÓDULO 2 - ENCARGOS E BENEFÍCIOS ANUAIS, MENSAIS E DIÁRIOS",null,null,"Percentuais","Valor"]
[null,"Submódulo 2.1 - 13º Salário, Férias e Adicional de Férias"]
[null,null,"A","13º Salário - Calculado no Módulo 7 - Destacado",0,{"$f":"ROUND(E20*F$16,2)","v":0},null,"* Nota 1 - Provisiona-se, mensalmente, o proporcional a 1/11 dos valores referentes a gratificação natalina, férias e adicional de férias."]
[null,null,"B","Adicional de Férias",{"$f":"'Encargos Sociais'!E30","v":3.03030303030303E-2},{"$f":"ROUND(E21*F$16,2)","v":79.63},null,"* Nota 2 - O adicional de férias contido no Submódulo 2.1 corresponde a 1/3 da remuneração que, por sua vez, é dividida por 11 contome Nota 1."]
[]
[null,"Submódulo 2.2 - Encargos Previdenciários (GPS), Fundo de Garantia por Tempo de Serviço (FGTS) e Outras Contribuições"]
[null,null,"A","INSS (art. 22, inciso I, Lei nº 8.212/91)",{"$f":"'Encargos Sociais'!E13","v":0.2},{"$f":"ROUND(E24*($F$16+$F$41+$F$73),2)","v":599.79999999999995}]
[null,null,"B","Salário Educação (art. 3º, inciso I, Decreto nº 87.043/82)",{"$f":"'Encargos Sociais'!E14","v":2.5000000000000001E-2},{"$f":"ROUND(E25*($F$16+$F$41+$F$73),2)","v":74.97}]
[null,null,"C","SAT/RAT (art. 22, II, Lei 8.212/91 e Anexo V, Decreto 6.042/07) - Enquadramento 8211-3/00",{"$f":"'Encargos Sociais'!E15","v":0.01},29.99]
[null,null,"D","SESC ou SESI (art. 30, Lei nº 8.036/90 e art. 1º, Lei 8.154/90)",{"$f":"'Encargos Sociais'!E16","v":1.4999999999999999E-2},44.98]
[null,null,"E","SENAI ou SENAC (Decreto nº 2.318/86)",{"$f":"'Encargos Sociais'!E17","v":0.01},29.99]
[null,null,"F","SEBRAE (§ 3º, art. 8º, Lei 8.029/90, alterada pela Lei nº 8.154/90)",{"$f":"'Encargos Sociais'!E18","v":6.0000000000000001E-3},17.989999999999998]
[null,null,"G","INCRA (art. 1º, I, Decreto Lei 1.146/70 e Lei 7.787, de 30/06/89)",{"$f":"'Encargos Sociais'!E19","v":2E-3},6,null,"* Nota 1 - Os percentuais dos encargos previdenciários, do FGTS e demais contribuições são estabelecidos por legislação vigente."]
[null,null,"H","FGTS (Lei Complementar nº 110/01 e art. 30, Lei nº 8.036/90)",{"$f":"'Encargos Sociais'!E20","v":0.08},239.92,null,"* Nota 2 - O SAT, a depender do grau de risco do serviço, irá variar entre 1%, para risco leve, de 2%, para risco médio, e de 3% para risco grave."]
[null,null,"I","SECONCI (Convenções Coletivas de Trabalho da construção)",{"$f":"'Encargos Sociais'!E21","v":0},0,null,"* Nota 3 - Os percentuais do Submódulo 2.2 incidem sobre o Módulo 1 e o Submódulo 2.1."]
[]
[null,"Submódulo 2.3 - Benefícios Mensais e Diários"]
[null,null,"A","Auxílio Transporte",null,{"$f":"HLOOKUP($B$5,'Dados Gerais'!$D$5:$BK$93,82)","v":199.88000000000002}]
[null,null,"B","Auxílio Alimentação",null,{"$f":"HLOOKUP($B$5,'Dados Gerais'!$D$5:$BK$93,89)","v":910}]
[null,null,"C","Assistência Médica e Familiar",null,{"$f":"HLOOKUP($B$5,'Dados Gerais'!$D$5:$BK$101,97)","v":285.5}]
[null,null,"D","Outros (Seguro de vida e auxílio funeral e auxílio odontológico)",null,{"$f":"HLOOKUP($B$5,'Dados Gerais'!$D$5:$BK$118,114)","v":12.36},null,"* Nota 1 - O valor informado deverá ser o custo real do benefício (descontado o valor eventualmente pago pelo empregado)."]
[null,null,null,null,null,null,null,"* Nota 2 - Observar a previsão dos benefícios contidos em Acordos, Convenções e Dissídios Coletivos de Trabalho e o disposto no art. 6º da IN 5/2017"]
[null,null,null,"QUADRO-RESUMO DO MÓDULO 2"]
[null,null,null,"2.1 - 13º Salário, Férias e Adicional de Férias - 13º Destacado - Calculado no Módulo 7 ",{"$f":"SUM(E20:E21)","v":3.03030303030303E-2},{"$f":"F20+F21","v":79.63}]
[null,null,null,"2.2 - Encargos Previdenciários (GPS), Fundo de Garantia por Tempo de Serviço (FGTS) e Contribuições",{"$f":"SUM(E24:E32)","v":0.34800000000000003},{"$f":"SUM(F24:F32)","v":1043.6400000000001}]
[null,null,null,"2.3 - Benefícios Mensais e Diários",null,{"$f":"SUM(F35:F38)","v":1407.74}]
[]
[null,null,null,"TOTAL DOS ENCARGOS E BENEFÍCIOS",null,{"$f":"SUM(F41:F43)","v":2531.0100000000002}]
[]
[null,"MÓDULO 3 - PREVISÃO PARA RESCISÃO",null,null,"Percentuais","Valor"]
[null,null,"A","Aviso Prévio Indenizado (Art. 7º, inciso XXI, da CF/1988 e arts. 477, 487, §1º, e 491 da CLT)",{"$f":"'Encargos Sociais'!E35","v":8.3333333333333332E-3},{"$f":"ROUND(E48*($F$16+$F$59),2)","v":23.89}]
[null,null,"B","Incidência do FGTS sobre o Aviso Prévio Indenizado (Súmula 305 TST)",{"$f":"'Encargos Sociais'!E36","v":6.6666666666666664E-4},{"$f":"ROUND(E49*($F$16+$F$59),2)","v":1.91},null,"* Nota 1 - Adotou-se os parâmetros do estudo do STF (http://www.stf.jus.br/arquivo/cms/sobrestfestudosci/anexo/encargos_sociais_03102007.pdf), onde 5% do pessoal é demitido pelo empregador no decurso do contrato (para estes, considerou-se o aviso prévio indenizado). Desprezou-se as demissões por justa causa e os pedidos de demissão."]
[null,null,"C","Multa do FGTS e Contribuição Social sobre o Aviso Prévio Indenizado (Art. 18, §1º, da Lei 8.036/1990 e art. 1º da LC nº 110/2001)",{"$f":"'Encargos Sociais'!E37","v":7.7170666666666644E-3},22.12,null,"* Nota 2 - No cálculo do percentual, considerou-se 36 dias, correspondendo à metade da duração média dos contratos (2 anos)"]
[null,null,"D","Aviso Prévio Trabalhado (Art. 488, parágrafo único, CLT)",{"$f":"'Encargos Sociais'!E38","v":1.2037037037037035E-2},34.51,null,"* Nota 3 - Incide sobre a Remuneração + 13º salário (1/12) + Férias (1/12) + Adicional de Férias (1/36) x 50% multa (40% para o empregado e 10% de contribuição social) x 8% FGTS"]
[null,null,"E","Incidência de GPS, FGTS e outras contribuições sobre o Aviso Prévio Trabalhado",{"$f":"'Encargos Sociais'!E39","v":4.1888888888888878E-3},12.01,null,"* Nota 4 - Os 95% restantes do cálculo, a um prazo médio de contrato de 4 anos. Assim, calcula-se 7 dias para o 1º ano de contrato e mais 3 dias para os 3 anos seguintes."]
[null,null,"F","Multa do FGTS e Contribuição Social sobre o Aviso Prévio Trabalhado",{"$f":"'Encargos Sociais'!E40","v":3.0505155555555549E-2},87.45]
[]
[null,null,null,"TOTAL DE PREVISÃO PARA RESCISÃO",null,{"$f":"SUM(F48:F53)","v":181.89000000000001}]
[]
[null,"MÓDULO 4 - CUSTO DO PROFISSIONAL AUSENTE",null,null,"Percentuais","Valor"]
[null,"Submódulo 4.1 - Ausências Legais"]
[null,null,"A","Férias (Arts. 129 e 130, inc. I, da CLT)",{"$f":"'Encargos Sociais'!E24","v":9.0909090909090912E-2},{"$f":"ROUND(E59*$F$16,2)","v":238.89},null,"* Nota 1 - As alíneas “A” a “F” referem-se somente ao custo que será pago ao repositor pelos dias \ntrabalhados quando da necessidade de substituir a mão de obra alocada na prestação do serviço."]
[null,null,"B","Ausências Legais (Arts. 131 e 473 da CLT)",{"$f":"'Encargos Sociais'!E25","v":7.9365079365079361E-3},20.86,null,"* Nota 2 - Adotou-se a estimativa do SINAPI de 2 dias por ano."]
[null,null,"C","Licença-Paternidade (Art. 7º, XIX, e art. 10, §1º, do ADCT, CF/1988 e Art. 1º, II, da Lei 11.770/2008)",{"$f":"'Encargos Sociais'!E26","v":8.2777777777777776E-4},2.1800000000000002,null,"* Nota 3 - Utilizada a proporção de 50% para homens, 5 dias de afastamento, e a probabilidade de um trabalhador requerer a Licença Paternidade em 5,22%, conforme SINAPI (citando dados da PNAD 2015)"]
[null,null,"D","Ausência por Acidente de Trabalho (Art. 131, III, da CLT)",{"$f":"'Encargos Sociais'!E27","v":8.541666666666667E-4},2.2400000000000002,null,"* Nota 4 - Utilzada a estatística de 1,96% dos contribuintes beneficiados com a emissão do auxílio, conforme Anuário Estatístico da Previdência Social. Afastamento de 15 dias a cargo da empresa."]
[null,null,"E","Afastamento Maternidade (Art. 71 da Lei nº 8.213/1991)",{"$f":"'Encargos Sociais'!E28","v":3.2925925925925922E-3},8.65,null,"* Nota 5 - Utilizada a proporção de 50% para mulheres, 180 dias de afastamento, e a probabilidade de uma trabalhadora requerer a Licença Maternidade em 4,91%, conforme SINAPI (citando dados do IBGE 2016)"]
[null,null,"F","Auxílio Enfermidade - Doença (Art. 59 da Lei nº 8.213/1991)",{"$f":"'Encargos Sociais'!E29","v":7.1222222222222225E-3},18.72,null,"* Nota 6 - Utilizada a estatística de 3,37% dos contribuintes beneficiados com o auxílio, conforme Anuário Estatístico da Previdência Social de 2015 (acrescidos de 2 dias ao ano, para os quais o trabalhador nem requer o benefício da Previdência - conforme SINAPI)"]
[]
[null,"Submódulo 4.2 - Intrajornada"]
[null,null,"A","Intervalo para repouso ou alimentação",{"$f":"'Encargos Sociais'!E32","v":0},{"$f":"ROUND(E67*$F$16,2)","v":0}]
[]
[null,null,null,"QUADRO-RESUMO DO MÓDULO 4",null,"Valor"]
[null,null,null,"4.1 - Ausências Legais",{"$f":"SUM(E59:E64)","v":0.11094235810485811},{"$f":"ROUND(E70*$F$16,2)","v":291.54000000000002}]
[null,null,null,"4.2 - Intrajornada",{"$f":"E67","v":0},{"$f":"ROUND(E71*$F$16,2)","v":0}]
[]
[null,null,null,"TOTAL DE PREVISÃO PARA RESCISÃO E INTERVALO INTRAJORNADA",null,{"$f":"SUM(F70:F71)","v":291.54000000000002}]
[]
[null,"MÓDULO 5 - INSUMOS DIVERSOS",null,null,null,"Valor"]
[null,null,"A","Uniformes - aquisição",null,{"$f":"ROUND(HLOOKUP($B$5,Uniformes!K6:DZ172,3)/12,2)","v":0}]
[null,null,"B","Materiais de consumo relacionados ao posto - aquisição",null,{"$f":"ROUND(HLOOKUP(B5,'Mat Cons'!I11:DX13,3)/12,2)","v":0}]
[null,null,"C","Materiais permanentes relacionados ao posto - remuneração da sua depreciação / manutenção",null,{"$f":"HLOOKUP(B5,'Mat Perm'!Q11:EF13,3)","v":0}]
[null,null,"D","Equipamentos relacionados ao posto - remuneração da sua depreciação / manutenção",null,{"$f":"HLOOKUP(B5,'Equip Rel'!Q11:EF13,3)","v":0}]
[null,null,"E","Equipamentos de Proteção Individual - EPI - aquisição",null,{"$f":"ROUND(HLOOKUP(B5,EPI!I3:DX37,3)/12,2)","v":0}]
[]
[null,null,null,"TOTAL DE INSUMOS DIVERSOS",null,{"$f":"SUM(F76:F81)","v":0},null,"* Nota - Valores mensais por empregado"]
[]
[null,"MÓDULO 6 - CUSTOS INDIRETOS, TRIBUTOS E LUCRO - BDI",null,null,"Percentuais","Valor"]
[null,null,"A","Custos Indiretos",{"$f":"BDI!E6","v":5.8400000000000001E-2}]
[null,null,"A.1","Administração Central",{"$f":"BDI!E7","v":2.1600000000000001E-2}]
[null,null,"A.2","Seguros, Garantias e Riscos",{"$f":"BDI!E8","v":3.6799999999999999E-2}]
[null,null,"B","Lucro",{"$f":"BDI!E10","v":3.3399999999999999E-2}]
[null,null,"C","Tributos",{"$f":"SUM(E90:E91)","v":0.124}]
[null,null,"C.1","Tributos Federais (COFINS, PIS e CPRB)",{"$f":"BDI!E18","v":7.3999999999999996E-2}]
[null,null,"C.2","Tributos Distritais (ISS)",{"$f":"BDI!E23","v":0.05},null,null,"* Nota - Utilizou-se o indicado pelo Sindicato da Arquitetura e da Engenharia (Sinaenco, 2008, p. 22), que adota um percentual redutor de 20% no cálculo dos custos tributários relativos às contribuições PIS e COFINS"]
[null,null,"D","Despesas Financeiras",{"$f":"BDI!E13","v":5.2519605742542552E-3}]
[]
[null,null,null,"TOTAL DE BDI",{"$f":"BDI!E26","v":0.25509999999999999},{"$f":"E94*E102","v":1436.786975}]
[]
[null,null,null,"QUADRO-RESUMO DO CUSTO MENSAL POR EMPREGADO - SEM O 13º","Valor"]
[null,null,null,"Módulo 1 - Composição da Remuneração",{"$f":"F16","v":2627.81}]
[null,null,null,"Módulo 2 - Encargos e Benefícios Anuais, Mensais e Diários",{"$f":"F45","v":2531.0100000000002}]
[null,null,null,"Módulo 3 - Provisão para Rescisão",{"$f":"F55","v":181.89000000000001}]
[null,null,null,"Módulo 4 - Custo de Reposição do Profissional Ausente",{"$f":"F73","v":291.54000000000002}]
[null,null,null,"Módulo 5 - Insumos Diversos",{"$f":"F82","v":0}]
[null,null,null,"SUBTOTAL (A+B+C+D+E)",{"$f":"SUM(E97:E101)","v":5632.25}]
[null,null,null,"Módulo 6 - Custos Indiretos, Tributos e Lucro",{"$f":"F94","v":1436.786975}]
[]
[null,null,null,"TOTAL DO POSTO",{"$f":"SUM(E102:E103)","v":7069.036975}]
[]
[null,"MÓDULO 7 - DESTAQUE DO MÓDULO 2 - 13º SALÁRIO",null,null,"Percentuais","Valor"]
[null,null,"A","13º Salário",{"$f":"'Encargos Sociais'!E31","v":8.3333333333333329E-2},{"$f":"ROUND(E108*F$16,2)","v":218.98}]
[null,null,"B","Encargos Sociais sobre o 13º Salário - Taxa calculada no SUBMÓDULO 2.2",{"$f":"SUM($E$24:$E$32)","v":0.34800000000000003},{"$f":"ROUND(E109*$F$108,2)","v":76.209999999999994},null,"* Nota 1 - Provisiona-se, mensalmente, o proporcional a 1/12 dos valores referentes a gratificação natalina e adicional de férias."]
[null,null,"C","Reincidência de férias sobre o 13º Salário",{"$f":"E59","v":9.0909090909090912E-2},{"$f":"ROUND(E110*$F$108,2)","v":19.91}]
[null,null,"D","BDI sobre o 13º Salário - Taxa calculada no MÓDULO 6",{"$f":"E94","v":0.25509999999999999},{"$f":"ROUND(E111*($F$108+$F$109),2)","v":75.3}]
[]
[null,null,null,"TOTAL DO DESTAQUE DO 13º SALÁRIO",null,{"$f":"SUM(F108:F111)","v":390.40000000000003}]
[]
[null,null,null,"QUADRO-RESUMO DO CUSTO MENSAL POR EMPREGADO","Valor"]
[null,null,null,"Custo total - sem o 13º Salário",{"$f":"E105","v":7069.036975}]
[null,null,null,"Destaque do 13º Salário (valor mensal)",{"$f":"F113","v":390.40000000000003}]
[]
[null,null,null,"TOTAL DO POSTO",{"$f":"E116+E117","v":7459.4369749999996}]

{"sheet":"5","index":8,"n_rows":119,"n_cols":8,"rows_kept":119,"cut":false,"hidden":false,"merged":[[106,1,106,3],[39,3,39,5],[46,1,46,3],[56,1,56,3],[68,3,68,5],[74,1,74,3],[83,1,83,3],[17,1,17,3],[1,1,1,5],[2,1,2,5],[4,1,4,2],[5,1,5,2],[7,1,7,3]]}
[]
[null,"PLANILHA DE ESTIMATIVA DE CUSTOS"]
[null,"Padrão IN 05/2017 e IN 07/2018 - MPDG"]
[]
[null,5,null,{"$f":"HLOOKUP($B$5,'Dados Gerais'!$D$5:$BK$20,6)","v":"TÉCNICO DE APOIO AO MONITORAMENTO DA INFRAESTRUTURA (JORNADA DAS 19 À 1H)"},"QUANTIDADE",{"$f":"HLOOKUP($B$5,'Dados Gerais'!$D$5:$BK$20,10)","v":3}]
[null,"CCT",null,{"$f":"HLOOKUP($B$5,'Dados Gerais'!$D$5:$BK$20,15)","v":"SINDPD/DF X SINDESEI/DF 2021/2022 Nº DF000608/2021"},"DATA-BASE",{"$f":"'Dados Gerais'!F20","v":"2021-05-01"}]
[]
[null,"MÓDULO 1 - COMPOSIÇÃO DA REMUNERAÇÃO",null,null,null,"Valor"]
[null,null,"A","Salário-Base",null,{"$f":"HLOOKUP($B$5,'Dados Gerais'!$D$5:$BK$20,8)","v":2627.81}]
[null,null,"B","Adicional de Periculosidade",null,{"$f":"HLOOKUP($B$5,'Dados Gerais'!$D$5:$BK$37,25)","v":0}]
[null,null,"C","Adicional de Insalubridade",null,{"$f":"HLOOKUP($B$5,'Dados Gerais'!$D$5:$BK$37,31)","v":0}]
[null,null,"D","Adicional Noturno",null,{"$f":"HLOOKUP($B$5,'Dados Gerais'!$D$5:$BK$50,46)","v":227.74},null,"* Nota 1 - O Módulo 1 refere-se ao valor mensal devido ao empregado pela prestação do serviço no período de 12 meses."]
[null,null,"E","Adicional de Hora Extra",null,{"$f":"HLOOKUP($B$5,'Dados Gerais'!$D$5:$BK$67,63)","v":0},null,"* Nota 2 - O adicional de hora extra no feriado trabalhado foi suprimido pela Lei 13.467/17"]
[null,null,"F","Outros (especificar)",null,{"$f":"HLOOKUP($B$5,'Dados Gerais'!$D$5:$BK$59,33)","v":0},null,"* Nota 3 - ART. 7º, § 2º, DA LEI Nº 605/49.Sendo mensalista o obreiro, o adicional noturno pago de forma fixa já é considerado integrado para os efeitos do pagamento do repouso semanal remunerado, nos termos do art. 7º, § 2º, da Lei nº 605/49."]
[]
[null,null,null,"TOTAL DA REMUNERAÇÃO",null,{"$f":"SUM(F9:F14)","v":2855.55}]
[]
[null,"MÓDULO 2 - ENCARGOS E BENEFÍCIOS ANUAIS, MENSAIS E DIÁRIOS",null,null,"Percentuais","Valor"]
[null,"Submódulo 2.1 - 13º Salário, Férias e Adicional de Férias"]
[null,null,"A","13º Salário - Calculado no Módulo 7 - Destacado",0,{"$f":"ROUND(E20*F$16,2)","v":0},null,"* Nota 1 - Provisiona-se, mensalmente, o proporcional a 1/11 dos valores referentes a gratificação natalina, férias e adicional de férias."]
[null,null,"B","Adicional de Férias",{"$f":"'Encargos Sociais'!E30","v":3.03030303030303E-2},{"$f":"ROUND(E21*F$16,2)","v":86.53},null,"* Nota 2 - O adicional de férias contido no Submódulo 2.1 corresponde a 1/3 da remuneração que, por sua vez, é dividida por 11 contome Nota 1."]
[]
[null,"Submódulo 2.2 - Encargos Previdenciários (GPS), Fundo de Garantia por Tempo de Serviço (FGTS) e Outras Contribuições"]
[null,null,"A","INSS (art. 22, inciso I, Lei nº 8.212/91)",{"$f":"'Encargos Sociais'!E13","v":0.2},{"$f":"ROUND(E24*($F$16+$F$41+$F$73),2)","v":651.78}]
[null,null,"B","Salário Educação (art. 3º, inciso I, Decreto nº 87.043/82)",{"$f":"'Encargos Sociais'!E14","v":2.5000000000000001E-2},{"$f":"ROUND(E25*($F$16+$F$41+$F$73),2)","v":81.47}]
[null,null,"C","SAT/RAT (art. 22, II, Lei 8.212/91 e Anexo V, Decreto 6.042/07) - Enquadramento 8211-3/00",{"$f":"'Encargos Sociais'!E15","v":0.01},32.590000000000003]
[null,null,"D","SESC ou SESI (art. 30, Lei nº 8.036/90 e art. 1º, Lei 8.154/90)",{"$f":"'Encargos Sociais'!E16","v":1.4999999999999999E-2},48.88]
[null,null,"E","SENAI ou SENAC (Decreto nº 2.318/86)",{"$f":"'Encargos Sociais'!E17","v":0.01},32.590000000000003]
[null,null,"F","SEBRAE (§ 3º, art. 8º, Lei 8.029/90, alterada pela Lei nº 8.154/90)",{"$f":"'Encargos Sociais'!E18","v":6.0000000000000001E-3},19.55]
[null,null,"G","INCRA (art. 1º, I, Decreto Lei 1.146/70 e Lei 7.787, de 30/06/89)",{"$f":"'Encargos Sociais'!E19","v":2E-3},6.52,null,"* Nota 1 - Os percentuais dos encargos previdenciários, do FGTS e demais contribuições são estabelecidos por legislação vigente."]
[null,null,"H","FGTS (Lei Complementar nº 110/01 e art. 30, Lei nº 8.036/90)",{"$f":"'Encargos Sociais'!E20","v":0.08},260.70999999999998,null,"* Nota 2 - O SAT, a depender do grau de risco do serviço, irá variar entre 1%, para risco leve, de 2%, para risco médio, e de 3% para risco grave."]
[null,null,"I","SECONCI (Convenções Coletivas de Trabalho da construção)",{"$f":"'Encargos Sociais'!E21","v":0},0,null,"* Nota 3 - Os percentuais do Submódulo 2.2 incidem sobre o Módulo 1 e o Submódulo 2.1."]
[]
[null,"Submódulo 2.3 - Benefícios Mensais e Diários"]
[null,null,"A","Auxílio Transporte",null,{"$f":"HLOOKUP($B$5,'Dados Gerais'!$D$5:$BK$93,82)","v":199.88000000000002}]
[null,null,"B","Auxílio Alimentação",null,{"$f":"HLOOKUP($B$5,'Dados Gerais'!$D$5:$BK$93,89)","v":910}]
[null,null,"C","Assistência Médica e Familiar",null,{"$f":"HLOOKUP($B$5,'Dados Gerais'!$D$5:$BK$101,97)","v":285.5}]
[null,null,"D","Outros (Seguro de vida e auxílio funeral e auxílio odontológico)",null,{"$f":"HLOOKUP($B$5,'Dados Gerais'!$D$5:$BK$118,114)","v":12.36},null,"* Nota 1 - O valor informado deverá ser o custo real do benefício (descontado o valor eventualmente pago pelo empregado)."]
[null,null,null,null,null,null,null,"* Nota 2 - Observar a previsão dos benefícios contidos em Acordos, Convenções e Dissídios Coletivos de Trabalho e o disposto no art. 6º da IN 5/2017"]
[null,null,null,"QUADRO-RESUMO DO MÓDULO 2"]
[null,null,null,"2.1 - 13º Salário, Férias e Adicional de Férias - 13º Destacado - Calculado no Módulo 7 ",{"$f":"SUM(E20:E21)","v":3.03030303030303E-2},{"$f":"F20+F21","v":86.53}]
[null,null,null,"2.2 - Encargos Previdenciários (GPS), Fundo de Garantia por Tempo de Serviço (FGTS) e Contribuições",{"$f":"SUM(E24:E32)","v":0.34800000000000003},{"$f":"SUM(F24:F32)","v":1134.0899999999999}]
[null,null,null,"2.3 - Benefícios Mensais e Diários",null,{"$f":"SUM(F35:F38)","v":1407.74}]
[]
[null,null,null,"TOTAL DOS ENCARGOS E BENEFÍCIOS",null,{"$f":"SUM(F41:F43)","v":2628.3599999999997}]
[]
[null,"MÓDULO 3 - PREVISÃO PARA RESCISÃO",null,null,"Percentuais","Valor"]
[null,null,"A","Aviso Prévio Indenizado (Art. 7º, inciso XXI, da CF/1988 e arts. 477, 487, §1º, e 491 da CLT)",{"$f":"'Encargos Sociais'!E35","v":8.3333333333333332E-3},{"$f":"ROUND(E48*($F$16+$F$59),2)","v":25.96}]
[null,null,"B","Incidência do FGTS sobre o Aviso Prévio Indenizado (Súmula 305 TST)",{"$f":"'Encargos Sociais'!E36","v":6.6666666666666664E-4},{"$f":"ROUND(E49*($F$16+$F$59),2)","v":2.08},null,"* Nota 1 - Adotou-se os parâmetros do estudo do STF (http://www.stf.jus.br/arquivo/cms/sobrestfestudosci/anexo/encargos_sociais_03102007.pdf), onde 5% do pessoal é demitido pelo empregador no decurso do contrato (para estes, considerou-se o aviso prévio indenizado). Desprezou-se as demissões por justa causa e os pedidos de demissão."]
[null,null,"C","Multa do FGTS e Contribuição Social sobre o Aviso Prévio Indenizado (Art. 18, §1º, da Lei 8.036/1990 e art. 1º da LC nº 110/2001)",{"$f":"'Encargos Sociais'!E37","v":7.7170666666666644E-3},24.04,null,"* Nota 2 - No cálculo do percentual, considerou-se 36 dias, correspondendo à metade da duração média dos contratos (2 anos)"]
[null,null,"D","Aviso Prévio Trabalhado (Art. 488, parágrafo único, CLT)",{"$f":"'Encargos Sociais'!E38","v":1.2037037037037035E-2},37.5,null,"* Nota 3 - Incide sobre a Remuneração + 13º salário (1/12) + Férias (1/12) + Adicional de Férias (1/36) x 50% multa (40% para o empregado e 10% de contribuição social) x 8% FGTS"]
[null,null,"E","Incidência de GPS, FGTS e outras contribuições sobre o Aviso Prévio Trabalhado",{"$f":"'Encargos Sociais'!E39","v":4.1888888888888878E-3},13.05,null,"* Nota 4 - Os 95% restantes do cálculo, a um prazo médio de contrato de 4 anos. Assim, calcula-se 7 dias para o 1º ano de contrato e mais 3 dias para os 3 anos seguintes."]
[null,null,"F","Multa do FGTS e Contribuição Social sobre o Aviso Prévio Trabalhado",{"$f":"'Encargos Sociais'!E40","v":3.0505155555555549E-2},95.03]
[]
[null,null,null,"TOTAL DE PREVISÃO PARA RESCISÃO",null,{"$f":"SUM(F48:F53)","v":197.66}]
[]
[null,"MÓDULO 4 - CUSTO DO PROFISSIONAL AUSENTE",null,null,"Percentuais","Valor"]
[null,"Submódulo 4.1 - Ausências Legais"]
[null,null,"A","Férias (Arts. 129 e 130, inc. I, da CLT)",{"$f":"'Encargos Sociais'!E24","v":9.0909090909090912E-2},{"$f":"ROUND(E59*$F$16,2)","v":259.60000000000002},null,"* Nota 1 - As alíneas “A” a “F” referem-se somente ao custo que será pago ao repositor pelos dias \ntrabalhados quando da necessidade de substituir a mão de obra alocada na prestação do serviço."]
[null,null,"B","Ausências Legais (Arts. 131 e 473 da CLT)",{"$f":"'Encargos Sociais'!E25","v":7.9365079365079361E-3},22.66,null,"* Nota 2 - Adotou-se a estimativa do SINAPI de 2 dias por ano."]
[null,null,"C","Licença-Paternidade (Art. 7º, XIX, e art. 10, §1º, do ADCT, CF/1988 e Art. 1º, II, da Lei 11.770/2008)",{"$f":"'Encargos Sociais'!E26","v":8.2777777777777776E-4},2.36,null,"* Nota 3 - Utilizada a proporção de 50% para homens, 5 dias de afastamento, e a probabilidade de um trabalhador requerer a Licença Paternidade em 5,22%, conforme SINAPI (citando dados da PNAD 2015)"]
[null,null,"D","Ausência por Acidente de Trabalho (Art. 131, III, da CLT)",{"$f":"'Encargos Sociais'!E27","v":8.541666666666667E-4},2.44,null,"* Nota 4 - Utilzada a estatística de 1,96% dos contribuintes beneficiados com a emissão do auxílio, conforme Anuário Estatístico da Previdência Social. Afastamento de 15 dias a cargo da empresa."]
[null,null,"E","Afastamento Maternidade (Art. 71 da Lei nº 8.213/1991)",{"$f":"'Encargos Sociais'!E28","v":3.2925925925925922E-3},9.4,null,"* Nota 5 - Utilizada a proporção de 50% para mulheres, 180 dias de afastamento, e a probabilidade de uma trabalhadora requerer a Licença Maternidade em 4,91%, conforme SINAPI (citando dados do IBGE 2016)"]
[null,null,"F","Auxílio Enfermidade - Doença (Art. 59 da Lei nº 8.213/1991)",{"$f":"'Encargos Sociais'!E29","v":7.1222222222222225E-3},20.34,null,"* Nota 6 - Utilizada a estatística de 3,37% dos contribuintes beneficiados com o auxílio, conforme Anuário Estatístico da Previdência Social de 2015 (acrescidos de 2 dias ao ano, para os quais o trabalhador nem requer o benefício da Previdência - conforme SINAPI)"]
[]
[null,"Submódulo 4.2 - Intrajornada"]
[null,null,"A","Intervalo para repouso ou alimentação",{"$f":"'Encargos Sociais'!E32","v":0},{"$f":"ROUND(E67*$F$16,2)","v":0}]
[]
[null,null,null,"QUADRO-RESUMO DO MÓDULO 4",null,"Valor"]
[null,null,null,"4.1 - Ausências Legais",{"$f":"SUM(E59:E64)","v":0.11094235810485811},{"$f":"ROUND(E70*$F$16,2)","v":316.8}]
[null,null,null,"4.2 - Intrajornada",{"$f":"E67","v":0},{"$f":"ROUND(E71*$F$16,2)","v":0}]
[]
[null,null,null,"TOTAL DE PREVISÃO PARA RESCISÃO E INTERVALO INTRAJORNADA",null,{"$f":"SUM(F70:F71)","v":316.8}]
[]
[null,"MÓDULO 5 - INSUMOS DIVERSOS",null,null,null,"Valor"]
[null,null,"A","Uniformes - aquisição",null,{"$f":"ROUND(HLOOKUP($B$5,Uniformes!K6:DZ172,3)/12,2)","v":0}]
[null,null,"B","Materiais de consumo relacionados ao posto - aquisição",null,{"$f":"ROUND(HLOOKUP(B5,'Mat Cons'!I11:DX13,3)/12,2)","v":0}]
[null,null,"C","Materiais permanentes relacionados ao posto - remuneração da sua depreciação / manutenção",null,{"$f":"HLOOKUP(B5,'Mat Perm'!Q11:EF13,3)","v":0}]
[null,null,"D","Equipamentos relacionados ao posto - remuneração da sua depreciação / manutenção",null,{"$f":"HLOOKUP(B5,'Equip Rel'!Q11:EF13,3)","v":0}]
[null,null,"E","Equipamentos de Proteção Individual - EPI - aquisição",null,{"$f":"ROUND(HLOOKUP(B5,EPI!I3:DX37,3)/12,2)","v":0}]
[]
[null,null,null,"TOTAL DE INSUMOS DIVERSOS",null,{"$f":"SUM(F76:F81)","v":0},null,"* Nota - Valores mensais por empregado"]
[]
[null,"MÓDULO 6 - CUSTOS INDIRETOS, TRIBUTOS E LUCRO - BDI",null,null,"Percentuais","Valor"]
[null,null,"A","Custos Indiretos",{"$f":"BDI!E6","v":5.8400000000000001E-2}]
[null,null,"A.1","Administração Central",{"$f":"BDI!E7","v":2.1600000000000001E-2}]
[null,null,"A.2","Seguros, Garantias e Riscos",{"$f":"BDI!E8","v":3.6799999999999999E-2}]
[null,null,"B","Lucro",{"$f":"BDI!E10","v":3.3399999999999999E-2}]
[null,null,"C","Tributos",{"$f":"SUM(E90:E91)","v":0.124}]
[null,null,"C.1","Tributos Federais (COFINS, PIS e CPRB)",{"$f":"BDI!E18","v":7.3999999999999996E-2}]
[null,null,"C.2","Tributos Distritais (ISS)",{"$f":"BDI!E23","v":0.05},null,null,"* Nota - Utilizou-se o indicado pelo Sindicato da Arquitetura e da Engenharia (Sinaenco, 2008, p. 22), que adota um percentual redutor de 20% no cálculo dos custos tributários relativos às contribuições PIS e COFINS"]
[null,null,"D","Despesas Financeiras",{"$f":"BDI!E13","v":5.2519605742542552E-3}]
[]
[null,null,null,"TOTAL DE BDI",{"$f":"BDI!E26","v":0.25509999999999999},{"$f":"E94*E102","v":1530.1841869999998}]
[]
[null,null,null,"QUADRO-RESUMO DO CUSTO MENSAL POR EMPREGADO - SEM O 13º","Valor"]
[null,null,null,"Módulo 1 - Composição da Remuneração",{"$f":"F16","v":2855.55}]
[null,null,null,"Módulo 2 - Encargos e Benefícios Anuais, Mensais e Diários",{"$f":"F45","v":2628.3599999999997}]
[null,null,null,"Módulo 3 - Provisão para Rescisão",{"$f":"F55","v":197.66}]
[null,null,null,"Módulo 4 - Custo de Reposição do Profissional Ausente",{"$f":"F73","v":316.8}]
[null,null,null,"Módulo 5 - Insumos Diversos",{"$f":"F82","v":0}]
[null,null,null,"SUBTOTAL (A+B+C+D+E)",{"$f":"SUM(E97:E101)","v":5998.37}]
[null,null,null,"Módulo 6 - Custos Indiretos, Tributos e Lucro",{"$f":"F94","v":1530.1841869999998}]
[]
[null,null,null,"TOTAL DO POSTO",{"$f":"SUM(E102:E103)","v":7528.5541869999997}]
[]
[null,"MÓDULO 7 - DESTAQUE DO MÓDULO 2 - 13º SALÁRIO",null,null,"Percentuais","Valor"]
[null,null,"A","13º Salário",{"$f":"'Encargos Sociais'!E31","v":8.3333333333333329E-2},{"$f":"ROUND(E108*F$16,2)","v":237.96}]
[null,null,"B","Encargos Sociais sobre o 13º Salário - Taxa calculada no SUBMÓDULO 2.2",{"$f":"SUM($E$24:$E$32)","v":0.34800000000000003},{"$f":"ROUND(E109*$F$108,2)","v":82.81},null,"* Nota 1 - Provisiona-se, mensalmente, o proporcional a 1/12 dos valores referentes a gratificação natalina e adicional de férias."]
[null,null,"C","Reincidência de férias sobre o 13º Salário",{"$f":"E59","v":9.0909090909090912E-2},{"$f":"ROUND(E110*$F$108,2)","v":21.63}]
[null,null,"D","BDI sobre o 13º Salário - Taxa calculada no MÓDULO 6",{"$f":"E94","v":0.25509999999999999},{"$f":"ROUND(E111*($F$108+$F$109),2)","v":81.83}]
[]
[null,null,null,"TOTAL DO DESTAQUE DO 13º SALÁRIO",null,{"$f":"SUM(F108:F111)","v":424.22999999999996}]
[]
[null,null,null,"QUADRO-RESUMO DO CUSTO MENSAL POR EMPREGADO","Valor"]
[null,null,null,"Custo total - sem o 13º Salário",{"$f":"E105","v":7528.5541869999997}]
[null,null,null,"Destaque do 13º Salário (valor mensal)",{"$f":"F113","v":424.22999999999996}]
[]
[null,null,null,"TOTAL DO POSTO",{"$f":"E116+E117","v":7952.7841869999993}]

{"sheet":"6","index":9,"n_rows":119,"n_cols":8,"rows_kept":119,"cut":false,"hidden":false,"merged":[[106,1,106,3],[39,3,39,5],[46,1,46,3],[56,1,56,3],[68,3,68,5],[74,1,74,3],[83,1,83,3],[17,1,17,3],[1,1,1,5],[2,1,2,5],[4,1,4,2],[5,1,5,2],[7,1,7,3]]}
[]
[null,"PLANILHA DE ESTIMATIVA DE CUSTOS"]
[null,"Padrão IN 05/2017 e IN 07/2018 - MPDG"]
[]
[null,6,null,{"$f":"HLOOKUP($B$5,'Dados Gerais'!$D$5:$BK$20,6)","v":"TÉCNICO DE APOIO AO MONITORAMENTO DA INFRAESTRUTURA (JORNADA DA 1H ÀS 7H)"},"QUANTIDADE",{"$f":"HLOOKUP($B$5,'Dados Gerais'!$D$5:$BK$20,10)","v":3}]
[null,"CCT",null,{"$f":"HLOOKUP($B$5,'Dados Gerais'!$D$5:$BK$20,15)","v":"SINDPD/DF X SINDESEI/DF 2021/2022 Nº DF000608/2021"},"DATA-BASE",{"$f":"'Dados Gerais'!F20","v":"2021-05-01"}]
[]
[null,"MÓDULO 1 - COMPOSIÇÃO DA REMUNERAÇÃO",null,null,null,"Valor"]
[null,null,"A","Salário-Base",null,{"$f":"HLOOKUP($B$5,'Dados Gerais'!$D$5:$BK$20,8)","v":2627.81}]
[null,null,"B","Adicional de Periculosidade",null,{"$f":"HLOOKUP($B$5,'Dados Gerais'!$D$5:$BK$37,25)","v":0}]
[null,null,"C","Adicional de Insalubridade",null,{"$f":"HLOOKUP($B$5,'Dados Gerais'!$D$5:$BK$37,31)","v":0}]
[null,null,"D","Adicional Noturno",null,{"$f":"HLOOKUP($B$5,'Dados Gerais'!$D$5:$BK$50,46)","v":379.57},null,"* Nota 1 - O Módulo 1 refere-se ao valor mensal devido ao empregado pela prestação do serviço no período de 12 meses."]
[null,null,"E","Adicional de Hora Extra",null,{"$f":"HLOOKUP($B$5,'Dados Gerais'!$D$5:$BK$67,63)","v":0},null,"* Nota 2 - O adicional de hora extra no feriado trabalhado foi suprimido pela Lei 13.467/17"]
[null,null,"F","Outros (especificar)",null,{"$f":"HLOOKUP($B$5,'Dados Gerais'!$D$5:$BK$59,33)","v":0},null,"* Nota 3 - ART. 7º, § 2º, DA LEI Nº 605/49.Sendo mensalista o obreiro, o adicional noturno pago de forma fixa já é considerado integrado para os efeitos do pagamento do repouso semanal remunerado, nos termos do art. 7º, § 2º, da Lei nº 605/49."]
[]
[null,null,null,"TOTAL DA REMUNERAÇÃO",null,{"$f":"SUM(F9:F14)","v":3007.38}]
[]
[null,"MÓDULO 2 - ENCARGOS E BENEFÍCIOS ANUAIS, MENSAIS E DIÁRIOS",null,null,"Percentuais","Valor"]
[null,"Submódulo 2.1 - 13º Salário, Férias e Adicional de Férias"]
[null,null,"A","13º Salário - Calculado no Módulo 7 - Destacado",0,{"$f":"ROUND(E20*F$16,2)","v":0},null,"* Nota 1 - Provisiona-se, mensalmente, o proporcional a 1/11 dos valores referentes a gratificação natalina, férias e adicional de férias."]
[null,null,"B","Adicional de Férias",{"$f":"'Encargos Sociais'!E30","v":3.03030303030303E-2},{"$f":"ROUND(E21*F$16,2)","v":91.13},null,"* Nota 2 - O adicional de férias contido no Submódulo 2.1 corresponde a 1/3 da remuneração que, por sua vez, é dividida por 11 contome Nota 1."]
[]
[null,"Submódulo 2.2 - Encargos Previdenciários (GPS), Fundo de Garantia por Tempo de Serviço (FGTS) e Outras Contribuições"]
[null,null,"A","INSS (art. 22, inciso I, Lei nº 8.212/91)",{"$f":"'Encargos Sociais'!E13","v":0.2},{"$f":"ROUND(E24*($F$16+$F$41+$F$73),2)","v":686.43}]
[null,null,"B","Salário Educação (art. 3º, inciso I, Decreto nº 87.043/82)",{"$f":"'Encargos Sociais'!E14","v":2.5000000000000001E-2},{"$f":"ROUND(E25*($F$16+$F$41+$F$73),2)","v":85.8}]
[null,null,"C","SAT/RAT (art. 22, II, Lei 8.212/91 e Anexo V, Decreto 6.042/07) - Enquadramento 8211-3/00",{"$f":"'Encargos Sociais'!E15","v":0.01},34.32]
[null,null,"D","SESC ou SESI (art. 30, Lei nº 8.036/90 e art. 1º, Lei 8.154/90)",{"$f":"'Encargos Sociais'!E16","v":1.4999999999999999E-2},51.48]
[null,null,"E","SENAI ou SENAC (Decreto nº 2.318/86)",{"$f":"'Encargos Sociais'!E17","v":0.01},34.32]
[null,null,"F","SEBRAE (§ 3º, art. 8º, Lei 8.029/90, alterada pela Lei nº 8.154/90)",{"$f":"'Encargos Sociais'!E18","v":6.0000000000000001E-3},20.59]
[null,null,"G","INCRA (art. 1º, I, Decreto Lei 1.146/70 e Lei 7.787, de 30/06/89)",{"$f":"'Encargos Sociais'!E19","v":2E-3},6.86,null,"* Nota 1 - Os percentuais dos encargos previdenciários, do FGTS e demais contribuições são estabelecidos por legislação vigente."]
[null,null,"H","FGTS (Lei Complementar nº 110/01 e art. 30, Lei nº 8.036/90)",{"$f":"'Encargos Sociais'!E20","v":0.08},274.57,null,"* Nota 2 - O SAT, a depender do grau de risco do serviço, irá variar entre 1%, para risco leve, de 2%, para risco médio, e de 3% para risco grave."]
[null,null,"I","SECONCI (Convenções Coletivas de Trabalho da construção)",{"$f":"'Encargos Sociais'!E21","v":0},0,null,"* Nota 3 - Os percentuais do Submódulo 2.2 incidem sobre o Módulo 1 e o Submódulo 2.1."]
[]
[null,"Submódulo 2.3 - Benefícios Mensais e Diários"]
[null,null,"A","Auxílio Transporte",null,{"$f":"HLOOKUP($B$5,'Dados Gerais'!$D$5:$BK$93,82)","v":199.88000000000002}]
[null,null,"B","Auxílio Alimentação",null,{"$f":"HLOOKUP($B$5,'Dados Gerais'!$D$5:$BK$93,89)","v":910}]
[null,null,"C","Assistência Médica e Familiar",null,{"$f":"HLOOKUP($B$5,'Dados Gerais'!$D$5:$BK$101,97)","v":285.5}]
[null,null,"D","Outros (Seguro de vida e auxílio funeral e auxílio odontológico)",null,{"$f":"HLOOKUP($B$5,'Dados Gerais'!$D$5:$BK$118,114)","v":12.36},null,"* Nota 1 - O valor informado deverá ser o custo real do benefício (descontado o valor eventualmente pago pelo empregado)."]
[null,null,null,null,null,null,null,"* Nota 2 - Observar a previsão dos benefícios contidos em Acordos, Convenções e Dissídios Coletivos de Trabalho e o disposto no art. 6º da IN 5/2017"]
[null,null,null,"QUADRO-RESUMO DO MÓDULO 2"]
[null,null,null,"2.1 - 13º Salário, Férias e Adicional de Férias - 13º Destacado - Calculado no Módulo 7 ",{"$f":"SUM(E20:E21)","v":3.03030303030303E-2},{"$f":"F20+F21","v":91.13}]
[null,null,null,"2.2 - Encargos Previdenciários (GPS), Fundo de Garantia por Tempo de Serviço (FGTS) e Contribuições",{"$f":"SUM(E24:E32)","v":0.34800000000000003},{"$f":"SUM(F24:F32)","v":1194.3700000000001}]
[null,null,null,"2.3 - Benefícios Mensais e Diários",null,{"$f":"SUM(F35:F38)","v":1407.74}]
[]
[null,null,null,"TOTAL DOS ENCARGOS E BENEFÍCIOS",null,{"$f":"SUM(F41:F43)","v":2693.24}]
[]
[null,"MÓDULO 3 - PREVISÃO PARA RESCISÃO",null,null,"Percentuais","Valor"]
[null,null,"A","Aviso Prévio Indenizado (Art. 7º, inciso XXI, da CF/1988 e arts. 477, 487, §1º, e 491 da CLT)",{"$f":"'Encargos Sociais'!E35","v":8.3333333333333332E-3},{"$f":"ROUND(E48*($F$16+$F$59),2)","v":27.34}]
[null,null,"B","Incidência do FGTS sobre o Aviso Prévio Indenizado (Súmula 305 TST)",{"$f":"'Encargos Sociais'!E36","v":6.6666666666666664E-4},{"$f":"ROUND(E49*($F$16+$F$59),2)","v":2.19},null,"* Nota 1 - Adotou-se os parâmetros do estudo do STF (http://www.stf.jus.br/arquivo/cms/sobrestfestudosci/anexo/encargos_sociais_03102007.pdf), onde 5% do pessoal é demitido pelo empregador no decurso do contrato (para estes, considerou-se o aviso prévio indenizado). Desprezou-se as demissões por justa causa e os pedidos de demissão."]
[null,null,"C","Multa do FGTS e Contribuição Social sobre o Aviso Prévio Indenizado (Art. 18, §1º, da Lei 8.036/1990 e art. 1º da LC nº 110/2001)",{"$f":"'Encargos Sociais'!E37","v":7.7170666666666644E-3},25.32,null,"* Nota 2 - No cálculo do percentual, considerou-se 36 dias, correspondendo à metade da duração média dos contratos (2 anos)"]
[null,null,"D","Aviso Prévio Trabalhado (Art. 488, parágrafo único, CLT)",{"$f":"'Encargos Sociais'!E38","v":1.2037037037037035E-2},39.49,null,"* Nota 3 - Incide sobre a Remuneração + 13º salário (1/12) + Férias (1/12) + Adicional de Férias (1/36) x 50% multa (40% para o empregado e 10% de contribuição social) x 8% FGTS"]
[null,null,"E","Incidência de GPS, FGTS e outras contribuições sobre o Aviso Prévio Trabalhado",{"$f":"'Encargos Sociais'!E39","v":4.1888888888888878E-3},13.74,null,"* Nota 4 - Os 95% restantes do cálculo, a um prazo médio de contrato de 4 anos. Assim, calcula-se 7 dias para o 1º ano de contrato e mais 3 dias para os 3 anos seguintes."]
[null,null,"F","Multa do FGTS e Contribuição Social sobre o Aviso Prévio Trabalhado",{"$f":"'Encargos Sociais'!E40","v":3.0505155555555549E-2},100.08]
[]
[null,null,null,"TOTAL DE PREVISÃO PARA RESCISÃO",null,{"$f":"SUM(F48:F53)","v":208.16}]
[]
[null,"MÓDULO 4 - CUSTO DO PROFISSIONAL AUSENTE",null,null,"Percentuais","Valor"]
[null,"Submódulo 4.1 - Ausências Legais"]
[null,null,"A","Férias (Arts. 129 e 130, inc. I, da CLT)",{"$f":"'Encargos Sociais'!E24","v":9.0909090909090912E-2},{"$f":"ROUND(E59*$F$16,2)","v":273.39999999999998},null,"* Nota 1 - As alíneas “A” a “F” referem-se somente ao custo que será pago ao repositor pelos dias \ntrabalhados quando da necessidade de substituir a mão de obra alocada na prestação do serviço."]
[null,null,"B","Ausências Legais (Arts. 131 e 473 da CLT)",{"$f":"'Encargos Sociais'!E25","v":7.9365079365079361E-3},23.87,null,"* Nota 2 - Adotou-se a estimativa do SINAPI de 2 dias por ano."]
[null,null,"C","Licença-Paternidade (Art. 7º, XIX, e art. 10, §1º, do ADCT, CF/1988 e Art. 1º, II, da Lei 11.770/2008)",{"$f":"'Encargos Sociais'!E26","v":8.2777777777777776E-4},2.4900000000000002,null,"* Nota 3 - Utilizada a proporção de 50% para homens, 5 dias de afastamento, e a probabilidade de um trabalhador requerer a Licença Paternidade em 5,22%, conforme SINAPI (citando dados da PNAD 2015)"]
[null,null,"D","Ausência por Acidente de Trabalho (Art. 131, III, da CLT)",{"$f":"'Encargos Sociais'!E27","v":8.541666666666667E-4},2.57,null,"* Nota 4 - Utilzada a estatística de 1,96% dos contribuintes beneficiados com a emissão do auxílio, conforme Anuário Estatístico da Previdência Social. Afastamento de 15 dias a cargo da empresa."]
[null,null,"E","Afastamento Maternidade (Art. 71 da Lei nº 8.213/1991)",{"$f":"'Encargos Sociais'!E28","v":3.2925925925925922E-3},9.9,null,"* Nota 5 - Utilizada a proporção de 50% para mulheres, 180 dias de afastamento, e a probabilidade de uma trabalhadora requerer a Licença Maternidade em 4,91%, conforme SINAPI (citando dados do IBGE 2016)"]
[null,null,"F","Auxílio Enfermidade - Doença (Art. 59 da Lei nº 8.213/1991)",{"$f":"'Encargos Sociais'!E29","v":7.1222222222222225E-3},21.42,null,"* Nota 6 - Utilizada a estatística de 3,37% dos contribuintes beneficiados com o auxílio, conforme Anuário Estatístico da Previdência Social de 2015 (acrescidos de 2 dias ao ano, para os quais o trabalhador nem requer o benefício da Previdência - conforme SINAPI)"]
[]
[null,"Submódulo 4.2 - Intrajornada"]
[null,null,"A","Intervalo para repouso ou alimentação",{"$f":"'Encargos Sociais'!E32","v":0},{"$f":"ROUND(E67*$F$16,2)","v":0}]
[]
[null,null,null,"QUADRO-RESUMO DO MÓDULO 4",null,"Valor"]
[null,null,null,"4.1 - Ausências Legais",{"$f":"SUM(E59:E64)","v":0.11094235810485811},{"$f":"ROUND(E70*$F$16,2)","v":333.65}]
[null,null,null,"4.2 - Intrajornada",{"$f":"E67","v":0},{"$f":"ROUND(E71*$F$16,2)","v":0}]
[]
[null,null,null,"TOTAL DE PREVISÃO PARA RESCISÃO E INTERVALO INTRAJORNADA",null,{"$f":"SUM(F70:F71)","v":333.65}]
[]
[null,"MÓDULO 5 - INSUMOS DIVERSOS",null,null,null,"Valor"]
[null,null,"A","Uniformes - aquisição",null,{"$f":"ROUND(HLOOKUP($B$5,Uniformes!K6:DZ172,3)/12,2)","v":0}]
[null,null,"B","Materiais de consumo relacionados ao posto - aquisição",null,{"$f":"ROUND(HLOOKUP(B5,'Mat Cons'!I11:DX13,3)/12,2)","v":0}]
[null,null,"C","Materiais permanentes relacionados ao posto - remuneração da sua depreciação / manutenção",null,{"$f":"HLOOKUP(B5,'Mat Perm'!Q11:EF13,3)","v":0}]
[null,null,"D","Equipamentos relacionados ao posto - remuneração da sua depreciação / manutenção",null,{"$f":"HLOOKUP(B5,'Equip Rel'!Q11:EF13,3)","v":0}]
[null,null,"E","Equipamentos de Proteção Individual - EPI - aquisição",null,{"$f":"ROUND(HLOOKUP(B5,EPI!I3:DX37,3)/12,2)","v":0}]
[]
[null,null,null,"TOTAL DE INSUMOS DIVERSOS",null,{"$f":"SUM(F76:F81)","v":0},null,"* Nota - Valores mensais por empregado"]
[]
[null,"MÓDULO 6 - CUSTOS INDIRETOS, TRIBUTOS E LUCRO - BDI",null,null,"Percentuais","Valor"]
[null,null,"A","Custos Indiretos",{"$f":"BDI!E6","v":5.8400000000000001E-2}]
[null,null,"A.1","Administração Central",{"$f":"BDI!E7","v":2.1600000000000001E-2}]
[null,null,"A.2","Seguros, Garantias e Riscos",{"$f":"BDI!E8","v":3.6799999999999999E-2}]
[null,null,"B","Lucro",{"$f":"BDI!E10","v":3.3399999999999999E-2}]
[null,null,"C","Tributos",{"$f":"SUM(E90:E91)","v":0.124}]
[null,null,"C.1","Tributos Federais (COFINS, PIS e CPRB)",{"$f":"BDI!E18","v":7.3999999999999996E-2}]
[null,null,"C.2","Tributos Distritais (ISS)",{"$f":"BDI!E23","v":0.05},null,null,"* Nota - Utilizou-se o indicado pelo Sindicato da Arquitetura e da Engenharia (Sinaenco, 2008, p. 22), que adota um percentual redutor de 20% no cálculo dos custos tributários relativos às contribuições PIS e COFINS"]
[null,null,"D","Despesas Financeiras",{"$f":"BDI!E13","v":5.2519605742542552E-3}]
[]
[null,null,null,"TOTAL DE BDI",{"$f":"BDI!E26","v":0.25509999999999999},{"$f":"E94*E102","v":1592.4438929999999}]
[]
[null,null,null,"QUADRO-RESUMO DO CUSTO MENSAL POR EMPREGADO - SEM O 13º","Valor"]
[null,null,null,"Módulo 1 - Composição da Remuneração",{"$f":"F16","v":3007.38}]
[null,null,null,"Módulo 2 - Encargos e Benefícios Anuais, Mensais e Diários",{"$f":"F45","v":2693.24}]
[null,null,null,"Módulo 3 - Provisão para Rescisão",{"$f":"F55","v":208.16}]
[null,null,null,"Módulo 4 - Custo de Reposição do Profissional Ausente",{"$f":"F73","v":333.65}]
[null,null,null,"Módulo 5 - Insumos Diversos",{"$f":"F82","v":0}]
[null,null,null,"SUBTOTAL (A+B+C+D+E)",{"$f":"SUM(E97:E101)","v":6242.4299999999994}]
[null,null,null,"Módulo 6 - Custos Indiretos, Tributos e Lucro",{"$f":"F94","v":1592.4438929999999}]
[]
[null,null,null,"TOTAL DO POSTO",{"$f":"SUM(E102:E103)","v":7834.873892999999}]
[]
[null,"MÓDULO 7 - DESTAQUE DO MÓDULO 2 - 13º SALÁRIO",null,null,"Percentuais","Valor"]
[null,null,"A","13º Salário",{"$f":"'Encargos Sociais'!E31","v":8.3333333333333329E-2},{"$f":"ROUND(E108*F$16,2)","v":250.62}]
[null,null,"B","Encargos Sociais sobre o 13º Salário - Taxa calculada no SUBMÓDULO 2.2",{"$f":"SUM($E$24:$E$32)","v":0.34800000000000003},{"$f":"ROUND(E109*$F$108,2)","v":87.22},null,"* Nota 1 - Provisiona-se, mensalmente, o proporcional a 1/12 dos valores referentes a gratificação natalina e adicional de férias."]
[null,null,"C","Reincidência de férias sobre o 13º Salário",{"$f":"E59","v":9.0909090909090912E-2},{"$f":"ROUND(E110*$F$108,2)","v":22.78}]
[null,null,"D","BDI sobre o 13º Salário - Taxa calculada no MÓDULO 6",{"$f":"E94","v":0.25509999999999999},{"$f":"ROUND(E111*($F$108+$F$109),2)","v":86.18}]
[]
[null,null,null,"TOTAL DO DESTAQUE DO 13º SALÁRIO",null,{"$f":"SUM(F108:F111)","v":446.8}]
[]
[null,null,null,"QUADRO-RESUMO DO CUSTO MENSAL POR EMPREGADO","Valor"]
[null,null,null,"Custo total - sem o 13º Salário",{"$f":"E105","v":7834.873892999999}]
[null,null,null,"Destaque do 13º Salário (valor mensal)",{"$f":"F113","v":446.8}]
[]
[null,null,null,"TOTAL DO POSTO",{"$f":"E116+E117","v":8281.6738929999992}]

{"sheet":"7","index":10,"n_rows":119,"n_cols":8,"rows_kept":119,"cut":false,"hidden":false,"merged":[[106,1,106,3],[39,3,39,5],[46,1,46,3],[56,1,56,3],[68,3,68,5],[74,1,74,3],[83,1,83,3],[17,1,17,3],[1,1,1,5],[2,1,2,5],[4,1,4,2],[5,1,5,2],[7,1,7,3]]}
[]
[null,"PLANILHA DE ESTIMATIVA DE CUSTOS"]
[null,"Padrão IN 05/2017 e IN 07/2018 - MPDG"]
[]
[null,7,null,{"$f":"HLOOKUP($B$5,'Dados Gerais'!$D$5:$BK$20,6)","v":"TÉCNICO INSTALADOR DE CABEAMENTO"},"QUANTIDADE",{"$f":"HLOOKUP($B$5,'Dados Gerais'!$D$5:$BK$20,10)","v":7}]
[null,"CCT",null,{"$f":"HLOOKUP($B$5,'Dados Gerais'!$D$5:$BK$20,15)","v":"SINDPD/DF X SINDESEI/DF 2021/2022 Nº DF000608/2021"},"DATA-BASE",{"$f":"'Dados Gerais'!F20","v":"2021-05-01"}]
[]
[null,"MÓDULO 1 - COMPOSIÇÃO DA REMUNERAÇÃO",null,null,null,"Valor"]
[null,null,"A","Salário-Base",null,{"$f":"HLOOKUP($B$5,'Dados Gerais'!$D$5:$BK$20,8)","v":2314.46}]
[null,null,"B","Adicional de Periculosidade",null,{"$f":"HLOOKUP($B$5,'Dados Gerais'!$D$5:$BK$37,25)","v":0}]
[null,null,"C","Adicional de Insalubridade",null,{"$f":"HLOOKUP($B$5,'Dados Gerais'!$D$5:$BK$37,31)","v":0}]
[null,null,"D","Adicional Noturno",null,{"$f":"HLOOKUP($B$5,'Dados Gerais'!$D$5:$BK$50,46)","v":0},null,"* Nota 1 - O Módulo 1 refere-se ao valor mensal devido ao empregado pela prestação do serviço no período de 12 meses."]
[null,null,"E","Adicional de Hora Extra",null,{"$f":"HLOOKUP($B$5,'Dados Gerais'!$D$5:$BK$67,63)","v":0},null,"* Nota 2 - O adicional de hora extra no feriado trabalhado foi suprimido pela Lei 13.467/17"]
[null,null,"F","Outros (especificar)",null,{"$f":"HLOOKUP($B$5,'Dados Gerais'!$D$5:$BK$59,33)","v":0},null,"* Nota 3 - ART. 7º, § 2º, DA LEI Nº 605/49.Sendo mensalista o obreiro, o adicional noturno pago de forma fixa já é considerado integrado para os efeitos do pagamento do repouso semanal remunerado, nos termos do art. 7º, § 2º, da Lei nº 605/49."]
[]
[null,null,null,"TOTAL DA REMUNERAÇÃO",null,{"$f":"SUM(F9:F14)","v":2314.46}]
[]
[null,"MÓDULO 2 - ENCARGOS E BENEFÍCIOS ANUAIS, MENSAIS E DIÁRIOS",null,null,"Percentuais","Valor"]
[null,"Submódulo 2.1 - 13º Salário, Férias e Adicional de Férias"]
[null,null,"A","13º Salário - Calculado no Módulo 7 - Destacado",0,{"$f":"ROUND(E20*F$16,2)","v":0},null,"* Nota 1 - Provisiona-se, mensalmente, o proporcional a 1/11 dos valores referentes a gratificação natalina, férias e adicional de férias."]
[null,null,"B","Adicional de Férias",{"$f":"'Encargos Sociais'!E30","v":3.03030303030303E-2},{"$f":"ROUND(E21*F$16,2)","v":70.14},null,"* Nota 2 - O adicional de férias contido no Submódulo 2.1 corresponde a 1/3 da remuneração que, por sua vez, é dividida por 11 contome Nota 1."]
[]
[null,"Submódulo 2.2 - Encargos Previdenciários (GPS), Fundo de Garantia por Tempo de Serviço (FGTS) e Outras Contribuições"]
[null,null,"A","INSS (art. 22, inciso I, Lei nº 8.212/91)",{"$f":"'Encargos Sociais'!E13","v":0.2},{"$f":"ROUND(E24*($F$16+$F$41+$F$73),2)","v":528.27}]
[null,null,"B","Salário Educação (art. 3º, inciso I, Decreto nº 87.043/82)",{"$f":"'Encargos Sociais'!E14","v":2.5000000000000001E-2},{"$f":"ROUND(E25*($F$16+$F$41+$F$73),2)","v":66.03}]
[null,null,"C","SAT/RAT (art. 22, II, Lei 8.212/91 e Anexo V, Decreto 6.042/07) - Enquadramento 8211-3/00",{"$f":"'Encargos Sociais'!E15","v":0.01},26.41]
[null,null,"D","SESC ou SESI (art. 30, Lei nº 8.036/90 e art. 1º, Lei 8.154/90)",{"$f":"'Encargos Sociais'!E16","v":1.4999999999999999E-2},39.619999999999997]
[null,null,"E","SENAI ou SENAC (Decreto nº 2.318/86)",{"$f":"'Encargos Sociais'!E17","v":0.01},26.41]
[null,null,"F","SEBRAE (§ 3º, art. 8º, Lei 8.029/90, alterada pela Lei nº 8.154/90)",{"$f":"'Encargos Sociais'!E18","v":6.0000000000000001E-3},15.85]
[null,null,"G","INCRA (art. 1º, I, Decreto Lei 1.146/70 e Lei 7.787, de 30/06/89)",{"$f":"'Encargos Sociais'!E19","v":2E-3},5.28,null,"* Nota 1 - Os percentuais dos encargos previdenciários, do FGTS e demais contribuições são estabelecidos por legislação vigente."]
[null,null,"H","FGTS (Lei Complementar nº 110/01 e art. 30, Lei nº 8.036/90)",{"$f":"'Encargos Sociais'!E20","v":0.08},211.31,null,"* Nota 2 - O SAT, a depender do grau de risco do serviço, irá variar entre 1%, para risco leve, de 2%, para risco médio, e de 3% para risco grave."]
[null,null,"I","SECONCI (Convenções Coletivas de Trabalho da construção)",{"$f":"'Encargos Sociais'!E21","v":0},0,null,"* Nota 3 - Os percentuais do Submódulo 2.2 incidem sobre o Módulo 1 e o Submódulo 2.1."]
[]
[null,"Submódulo 2.3 - Benefícios Mensais e Diários"]
[null,null,"A","Auxílio Transporte",null,{"$f":"HLOOKUP($B$5,'Dados Gerais'!$D$5:$BK$93,82)","v":163.67000000000002}]
[null,null,"B","Auxílio Alimentação",null,{"$f":"HLOOKUP($B$5,'Dados Gerais'!$D$5:$BK$93,89)","v":770}]
[null,null,"C","Assistência Médica e Familiar",null,{"$f":"HLOOKUP($B$5,'Dados Gerais'!$D$5:$BK$101,97)","v":285.5}]
[null,null,"D","Outros (Seguro de vida e auxílio funeral e auxílio odontológico)",null,{"$f":"HLOOKUP($B$5,'Dados Gerais'!$D$5:$BK$118,114)","v":12.36},null,"* Nota 1 - O valor informado deverá ser o custo real do benefício (descontado o valor eventualmente pago pelo empregado)."]
[null,null,null,null,null,null,null,"* Nota 2 - Observar a previsão dos benefícios contidos em Acordos, Convenções e Dissídios Coletivos de Trabalho e o disposto no art. 6º da IN 5/2017"]
[null,null,null,"QUADRO-RESUMO DO MÓDULO 2"]
[null,null,null,"2.1 - 13º Salário, Férias e Adicional de Férias - 13º Destacado - Calculado no Módulo 7 ",{"$f":"SUM(E20:E21)","v":3.03030303030303E-2},{"$f":"F20+F21","v":70.14}]
[null,null,null,"2.2 - Encargos Previdenciários (GPS), Fundo de Garantia por Tempo de Serviço (FGTS) e Contribuições",{"$f":"SUM(E24:E32)","v":0.34800000000000003},{"$f":"SUM(F24:F32)","v":919.17999999999984}]
[null,null,null,"2.3 - Benefícios Mensais e Diários",null,{"$f":"SUM(F35:F38)","v":1231.53}]
[]
[null,null,null,"TOTAL DOS ENCARGOS E BENEFÍCIOS",null,{"$f":"SUM(F41:F43)","v":2220.85}]
[]
[null,"MÓDULO 3 - PREVISÃO PARA RESCISÃO",null,null,"Percentuais","Valor"]
[null,null,"A","Aviso Prévio Indenizado (Art. 7º, inciso XXI, da CF/1988 e arts. 477, 487, §1º, e 491 da CLT)",{"$f":"'Encargos Sociais'!E35","v":8.3333333333333332E-3},{"$f":"ROUND(E48*($F$16+$F$59),2)","v":21.04}]
[null,null,"B","Incidência do FGTS sobre o Aviso Prévio Indenizado (Súmula 305 TST)",{"$f":"'Encargos Sociais'!E36","v":6.6666666666666664E-4},{"$f":"ROUND(E49*($F$16+$F$59),2)","v":1.68},null,"* Nota 1 - Adotou-se os parâmetros do estudo do STF (http://www.stf.jus.br/arquivo/cms/sobrestfestudosci/anexo/encargos_sociais_03102007.pdf), onde 5% do pessoal é demitido pelo empregador no decurso do contrato (para estes, considerou-se o aviso prévio indenizado). Desprezou-se as demissões por justa causa e os pedidos de demissão."]
[null,null,"C","Multa do FGTS e Contribuição Social sobre o Aviso Prévio Indenizado (Art. 18, §1º, da Lei 8.036/1990 e art. 1º da LC nº 110/2001)",{"$f":"'Encargos Sociais'!E37","v":7.7170666666666644E-3},19.48,null,"* Nota 2 - No cálculo do percentual, considerou-se 36 dias, correspondendo à metade da duração média dos contratos (2 anos)"]
[null,null,"D","Aviso Prévio Trabalhado (Art. 488, parágrafo único, CLT)",{"$f":"'Encargos Sociais'!E38","v":1.2037037037037035E-2},30.39,null,"* Nota 3 - Incide sobre a Remuneração + 13º salário (1/12) + Férias (1/12) + Adicional de Férias (1/36) x 50% multa (40% para o empregado e 10% de contribuição social) x 8% FGTS"]
[null,null,"E","Incidência de GPS, FGTS e outras contribuições sobre o Aviso Prévio Trabalhado",{"$f":"'Encargos Sociais'!E39","v":4.1888888888888878E-3},10.58,null,"* Nota 4 - Os 95% restantes do cálculo, a um prazo médio de contrato de 4 anos. Assim, calcula-se 7 dias para o 1º ano de contrato e mais 3 dias para os 3 anos seguintes."]
[null,null,"F","Multa do FGTS e Contribuição Social sobre o Aviso Prévio Trabalhado",{"$f":"'Encargos Sociais'!E40","v":3.0505155555555549E-2},77.02]
[]
[null,null,null,"TOTAL DE PREVISÃO PARA RESCISÃO",null,{"$f":"SUM(F48:F53)","v":160.19}]
[]
[null,"MÓDULO 4 - CUSTO DO PROFISSIONAL AUSENTE",null,null,"Percentuais","Valor"]
[null,"Submódulo 4.1 - Ausências Legais"]
[null,null,"A","Férias (Arts. 129 e 130, inc. I, da CLT)",{"$f":"'Encargos Sociais'!E24","v":9.0909090909090912E-2},{"$f":"ROUND(E59*$F$16,2)","v":210.41},null,"* Nota 1 - As alíneas “A” a “F” referem-se somente ao custo que será pago ao repositor pelos dias \ntrabalhados quando da necessidade de substituir a mão de obra alocada na prestação do serviço."]
[null,null,"B","Ausências Legais (Arts. 131 e 473 da CLT)",{"$f":"'Encargos Sociais'!E25","v":7.9365079365079361E-3},18.37,null,"* Nota 2 - Adotou-se a estimativa do SINAPI de 2 dias por ano."]
[null,null,"C","Licença-Paternidade (Art. 7º, XIX, e art. 10, §1º, do ADCT, CF/1988 e Art. 1º, II, da Lei 11.770/2008)",{"$f":"'Encargos Sociais'!E26","v":8.2777777777777776E-4},1.92,null,"* Nota 3 - Utilizada a proporção de 50% para homens, 5 dias de afastamento, e a probabilidade de um trabalhador requerer a Licença Paternidade em 5,22%, conforme SINAPI (citando dados da PNAD 2015)"]
[null,null,"D","Ausência por Acidente de Trabalho (Art. 131, III, da CLT)",{"$f":"'Encargos Sociais'!E27","v":8.541666666666667E-4},1.98,null,"* Nota 4 - Utilzada a estatística de 1,96% dos contribuintes beneficiados com a emissão do auxílio, conforme Anuário Estatístico da Previdência Social. Afastamento de 15 dias a cargo da empresa."]
[null,null,"E","Afastamento Maternidade (Art. 71 da Lei nº 8.213/1991)",{"$f":"'Encargos Sociais'!E28","v":3.2925925925925922E-3},7.62,null,"* Nota 5 - Utilizada a proporção de 50% para mulheres, 180 dias de afastamento, e a probabilidade de uma trabalhadora requerer a Licença Maternidade em 4,91%, conforme SINAPI (citando dados do IBGE 2016)"]
[null,null,"F","Auxílio Enfermidade - Doença (Art. 59 da Lei nº 8.213/1991)",{"$f":"'Encargos Sociais'!E29","v":7.1222222222222225E-3},16.48,null,"* Nota 6 - Utilizada a estatística de 3,37% dos contribuintes beneficiados com o auxílio, conforme Anuário Estatístico da Previdência Social de 2015 (acrescidos de 2 dias ao ano, para os quais o trabalhador nem requer o benefício da Previdência - conforme SINAPI)"]
[]
[null,"Submódulo 4.2 - Intrajornada"]
[null,null,"A","Intervalo para repouso ou alimentação",{"$f":"'Encargos Sociais'!E32","v":0},{"$f":"ROUND(E67*$F$16,2)","v":0}]
[]
[null,null,null,"QUADRO-RESUMO DO MÓDULO 4",null,"Valor"]
[null,null,null,"4.1 - Ausências Legais",{"$f":"SUM(E59:E64)","v":0.11094235810485811},{"$f":"ROUND(E70*$F$16,2)","v":256.77}]
[null,null,null,"4.2 - Intrajornada",{"$f":"E67","v":0},{"$f":"ROUND(E71*$F$16,2)","v":0}]
[]
[null,null,null,"TOTAL DE PREVISÃO PARA RESCISÃO E INTERVALO INTRAJORNADA",null,{"$f":"SUM(F70:F71)","v":256.77}]
[]
[null,"MÓDULO 5 - INSUMOS DIVERSOS",null,null,null,"Valor"]
[null,null,"A","Uniformes - aquisição",null,{"$f":"ROUND(HLOOKUP($B$5,Uniformes!K6:DZ172,3)/12,2)","v":86.5}]
[null,null,"B","Materiais de consumo relacionados ao posto - aquisição",null,{"$f":"ROUND(HLOOKUP(B5,'Mat Cons'!I11:DX13,3)/12,2)","v":0}]
[null,null,"C","Materiais permanentes relacionados ao posto - remuneração da sua depreciação / manutenção",null,{"$f":"HLOOKUP(B5,'Mat Perm'!Q11:EF13,3)","v":0}]
[null,null,"D","Equipamentos relacionados ao posto - remuneração da sua depreciação / manutenção",null,{"$f":"HLOOKUP(B5,'Equip Rel'!Q11:EF13,3)","v":0}]
[null,null,"E","Equipamentos de Proteção Individual - EPI - aquisição",null,{"$f":"ROUND(HLOOKUP(B5,EPI!I3:DX37,3)/12,2)","v":475.45}]
[]
[null,null,null,"TOTAL DE INSUMOS DIVERSOS",null,{"$f":"SUM(F76:F81)","v":561.95000000000005},null,"* Nota - Valores mensais por empregado"]
[]
[null,"MÓDULO 6 - CUSTOS INDIRETOS, TRIBUTOS E LUCRO - BDI",null,null,"Percentuais","Valor"]
[null,null,"A","Custos Indiretos",{"$f":"BDI!E6","v":5.8400000000000001E-2}]
[null,null,"A.1","Administração Central",{"$f":"BDI!E7","v":2.1600000000000001E-2}]
[null,null,"A.2","Seguros, Garantias e Riscos",{"$f":"BDI!E8","v":3.6799999999999999E-2}]
[null,null,"B","Lucro",{"$f":"BDI!E10","v":3.3399999999999999E-2}]
[null,null,"C","Tributos",{"$f":"SUM(E90:E91)","v":0.124}]
[null,null,"C.1","Tributos Federais (COFINS, PIS e CPRB)",{"$f":"BDI!E18","v":7.3999999999999996E-2}]
[null,null,"C.2","Tributos Distritais (ISS)",{"$f":"BDI!E23","v":0.05},null,null,"* Nota - Utilizou-se o indicado pelo Sindicato da Arquitetura e da Engenharia (Sinaenco, 2008, p. 22), que adota um percentual redutor de 20% no cálculo dos custos tributários relativos às contribuições PIS e COFINS"]
[null,null,"D","Despesas Financeiras",{"$f":"BDI!E13","v":5.2519605742542552E-3}]
[]
[null,null,null,"TOTAL DE BDI",{"$f":"BDI!E26","v":0.25509999999999999},{"$f":"E94*E102","v":1406.6775219999995}]
[]
[null,null,null,"QUADRO-RESUMO DO CUSTO MENSAL POR EMPREGADO - SEM O 13º","Valor"]
[null,null,null,"Módulo 1 - Composição da Remuneração",{"$f":"F16","v":2314.46}]
[null,null,null,"Módulo 2 - Encargos e Benefícios Anuais, Mensais e Diários",{"$f":"F45","v":2220.85}]
[null,null,null,"Módulo 3 - Provisão para Rescisão",{"$f":"F55","v":160.19}]
[null,null,null,"Módulo 4 - Custo de Reposição do Profissional Ausente",{"$f":"F73","v":256.77}]
[null,null,null,"Módulo 5 - Insumos Diversos",{"$f":"F82","v":561.95000000000005}]
[null,null,null,"SUBTOTAL (A+B+C+D+E)",{"$f":"SUM(E97:E101)","v":5514.2199999999984}]
[null,null,null,"Módulo 6 - Custos Indiretos, Tributos e Lucro",{"$f":"F94","v":1406.6775219999995}]
[]
[null,null,null,"TOTAL DO POSTO",{"$f":"SUM(E102:E103)","v":6920.8975219999975}]
[]
[null,"MÓDULO 7 - DESTAQUE DO MÓDULO 2 - 13º SALÁRIO",null,null,"Percentuais","Valor"]
[null,null,"A","13º Salário",{"$f":"'Encargos Sociais'!E31","v":8.3333333333333329E-2},{"$f":"ROUND(E108*F$16,2)","v":192.87}]
[null,null,"B","Encargos Sociais sobre o 13º Salário - Taxa calculada no SUBMÓDULO 2.2",{"$f":"SUM($E$24:$E$32)","v":0.34800000000000003},{"$f":"ROUND(E109*$F$108,2)","v":67.12},null,"* Nota 1 - Provisiona-se, mensalmente, o proporcional a 1/12 dos valores referentes a gratificação natalina e adicional de férias."]
[null,null,"C","Reincidência de férias sobre o 13º Salário",{"$f":"E59","v":9.0909090909090912E-2},{"$f":"ROUND(E110*$F$108,2)","v":17.53}]
[null,null,"D","BDI sobre o 13º Salário - Taxa calculada no MÓDULO 6",{"$f":"E94","v":0.25509999999999999},{"$f":"ROUND(E111*($F$108+$F$109),2)","v":66.319999999999993}]
[]
[null,null,null,"TOTAL DO DESTAQUE DO 13º SALÁRIO",null,{"$f":"SUM(F108:F111)","v":343.84}]
[]
[null,null,null,"QUADRO-RESUMO DO CUSTO MENSAL POR EMPREGADO","Valor"]
[null,null,null,"Custo total - sem o 13º Salário",{"$f":"E105","v":6920.8975219999975}]
[null,null,null,"Destaque do 13º Salário (valor mensal)",{"$f":"F113","v":343.84}]
[]
[null,null,null,"TOTAL DO POSTO",{"$f":"E116+E117","v":7264.7375219999976}]

{"sheet":"8","index":11,"n_rows":119,"n_cols":8,"rows_kept":119,"cut":false,"hidden":false,"merged":[[106,1,106,3],[39,3,39,5],[46,1,46,3],[56,1,56,3],[68,3,68,5],[74,1,74,3],[83,1,83,3],[17,1,17,3],[1,1,1,5],[2,1,2,5],[4,1,4,2],[5,1,5,2],[7,1,7,3]]}
[]
[null,"PLANILHA DE ESTIMATIVA DE CUSTOS"]
[null,"Padrão IN 05/2017 e IN 07/2018 - MPDG"]
[]
[null,8,null,{"$f":"HLOOKUP($B$5,'Dados Gerais'!$D$5:$BK$20,6)","v":"TÉCNICO DE MANUTENÇÃO DE INFRAESTRUTURA DE REDE"},"QUANTIDADE",{"$f":"HLOOKUP($B$5,'Dados Gerais'!$D$5:$BK$20,10)","v":8}]
[null,"CCT",null,{"$f":"HLOOKUP($B$5,'Dados Gerais'!$D$5:$BK$20,15)","v":"SINDPD/DF X SINDESEI/DF 2021/2022 Nº DF000608/2021"},"DATA-BASE",{"$f":"'Dados Gerais'!F20","v":"2021-05-01"}]
[]
[null,"MÓDULO 1 - COMPOSIÇÃO DA REMUNERAÇÃO",null,null,null,"Valor"]
[null,null,"A","Salário-Base",null,{"$f":"HLOOKUP($B$5,'Dados Gerais'!$D$5:$BK$20,8)","v":3130.93}]
[null,null,"B","Adicional de Periculosidade",null,{"$f":"HLOOKUP($B$5,'Dados Gerais'!$D$5:$BK$37,25)","v":0}]
[null,null,"C","Adicional de Insalubridade",null,{"$f":"HLOOKUP($B$5,'Dados Gerais'!$D$5:$BK$37,31)","v":0}]
[null,null,"D","Adicional Noturno",null,{"$f":"HLOOKUP($B$5,'Dados Gerais'!$D$5:$BK$50,46)","v":0},null,"* Nota 1 - O Módulo 1 refere-se ao valor mensal devido ao empregado pela prestação do serviço no período de 12 meses."]
[null,null,"E","Adicional de Hora Extra",null,{"$f":"HLOOKUP($B$5,'Dados Gerais'!$D$5:$BK$67,63)","v":0},null,"* Nota 2 - O adicional de hora extra no feriado trabalhado foi suprimido pela Lei 13.467/17"]
[null,null,"F","Outros (especificar)",null,{"$f":"HLOOKUP($B$5,'Dados Gerais'!$D$5:$BK$59,33)","v":0},null,"* Nota 3 - ART. 7º, § 2º, DA LEI Nº 605/49.Sendo mensalista o obreiro, o adicional noturno pago de forma fixa já é considerado integrado para os efeitos do pagamento do repouso semanal remunerado, nos termos do art. 7º, § 2º, da Lei nº 605/49."]
[]
[null,null,null,"TOTAL DA REMUNERAÇÃO",null,{"$f":"SUM(F9:F14)","v":3130.93}]
[]
[null,"MÓDULO 2 - ENCARGOS E BENEFÍCIOS ANUAIS, MENSAIS E DIÁRIOS",null,null,"Percentuais","Valor"]
[null,"Submódulo 2.1 - 13º Salário, Férias e Adicional de Férias"]
[null,null,"A","13º Salário - Calculado no Módulo 7 - Destacado",0,{"$f":"ROUND(E20*F$16,2)","v":0},null,"* Nota 1 - Provisiona-se, mensalmente, o proporcional a 1/11 dos valores referentes a gratificação natalina, férias e adicional de férias."]
[null,null,"B","Adicional de Férias",{"$f":"'Encargos Sociais'!E30","v":3.03030303030303E-2},{"$f":"ROUND(E21*F$16,2)","v":94.88},null,"* Nota 2 - O adicional de férias contido no Submódulo 2.1 corresponde a 1/3 da remuneração que, por sua vez, é dividida por 11 contome Nota 1."]
[]
[null,"Submódulo 2.2 - Encargos Previdenciários (GPS), Fundo de Garantia por Tempo de Serviço (FGTS) e Outras Contribuições"]
[null,null,"A","INSS (art. 22, inciso I, Lei nº 8.212/91)",{"$f":"'Encargos Sociais'!E13","v":0.2},{"$f":"ROUND(E24*($F$16+$F$41+$F$73),2)","v":714.63}]
[null,null,"B","Salário Educação (art. 3º, inciso I, Decreto nº 87.043/82)",{"$f":"'Encargos Sociais'!E14","v":2.5000000000000001E-2},{"$f":"ROUND(E25*($F$16+$F$41+$F$73),2)","v":89.33}]
[null,null,"C","SAT/RAT (art. 22, II, Lei 8.212/91 e Anexo V, Decreto 6.042/07) - Enquadramento 8211-3/00",{"$f":"'Encargos Sociais'!E15","v":0.01},35.729999999999997]
[null,null,"D","SESC ou SESI (art. 30, Lei nº 8.036/90 e art. 1º, Lei 8.154/90)",{"$f":"'Encargos Sociais'!E16","v":1.4999999999999999E-2},53.6]
[null,null,"E","SENAI ou SENAC (Decreto nº 2.318/86)",{"$f":"'Encargos Sociais'!E17","v":0.01},35.729999999999997]
[null,null,"F","SEBRAE (§ 3º, art. 8º, Lei 8.029/90, alterada pela Lei nº 8.154/90)",{"$f":"'Encargos Sociais'!E18","v":6.0000000000000001E-3},21.44]
[null,null,"G","INCRA (art. 1º, I, Decreto Lei 1.146/70 e Lei 7.787, de 30/06/89)",{"$f":"'Encargos Sociais'!E19","v":2E-3},7.15,null,"* Nota 1 - Os percentuais dos encargos previdenciários, do FGTS e demais contribuições são estabelecidos por legislação vigente."]
[null,null,"H","FGTS (Lei Complementar nº 110/01 e art. 30, Lei nº 8.036/90)",{"$f":"'Encargos Sociais'!E20","v":0.08},285.85000000000002,null,"* Nota 2 - O SAT, a depender do grau de risco do serviço, irá variar entre 1%, para risco leve, de 2%, para risco médio, e de 3% para risco grave."]
[null,null,"I","SECONCI (Convenções Coletivas de Trabalho da construção)",{"$f":"'Encargos Sociais'!E21","v":0},0,null,"* Nota 3 - Os percentuais do Submódulo 2.2 incidem sobre o Módulo 1 e o Submódulo 2.1."]
[]
[null,"Submódulo 2.3 - Benefícios Mensais e Diários"]
[null,null,"A","Auxílio Transporte",null,{"$f":"HLOOKUP($B$5,'Dados Gerais'!$D$5:$BK$93,82)","v":114.68}]
[null,null,"B","Auxílio Alimentação",null,{"$f":"HLOOKUP($B$5,'Dados Gerais'!$D$5:$BK$93,89)","v":770}]
[null,null,"C","Assistência Médica e Familiar",null,{"$f":"HLOOKUP($B$5,'Dados Gerais'!$D$5:$BK$101,97)","v":285.5}]
[null,null,"D","Outros (Seguro de vida e auxílio funeral e auxílio odontológico)",null,{"$f":"HLOOKUP($B$5,'Dados Gerais'!$D$5:$BK$118,114)","v":12.36},null,"* Nota 1 - O valor informado deverá ser o custo real do benefício (descontado o valor eventualmente pago pelo empregado)."]
[null,null,null,null,null,null,null,"* Nota 2 - Observar a previsão dos benefícios contidos em Acordos, Convenções e Dissídios Coletivos de Trabalho e o disposto no art. 6º da IN 5/2017"]
[null,null,null,"QUADRO-RESUMO DO MÓDULO 2"]
[null,null,null,"2.1 - 13º Salário, Férias e Adicional de Férias - 13º Destacado - Calculado no Módulo 7 ",{"$f":"SUM(E20:E21)","v":3.03030303030303E-2},{"$f":"F20+F21","v":94.88}]
[null,null,null,"2.2 - Encargos Previdenciários (GPS), Fundo de Garantia por Tempo de Serviço (FGTS) e Contribuições",{"$f":"SUM(E24:E32)","v":0.34800000000000003},{"$f":"SUM(F24:F32)","v":1243.46}]
[null,null,null,"2.3 - Benefícios Mensais e Diários",null,{"$f":"SUM(F35:F38)","v":1182.54}]
[]
[null,null,null,"TOTAL DOS ENCARGOS E BENEFÍCIOS",null,{"$f":"SUM(F41:F43)","v":2520.88}]
[]
[null,"MÓDULO 3 - PREVISÃO PARA RESCISÃO",null,null,"Percentuais","Valor"]
[null,null,"A","Aviso Prévio Indenizado (Art. 7º, inciso XXI, da CF/1988 e arts. 477, 487, §1º, e 491 da CLT)",{"$f":"'Encargos Sociais'!E35","v":8.3333333333333332E-3},{"$f":"ROUND(E48*($F$16+$F$59),2)","v":28.46}]
[null,null,"B","Incidência do FGTS sobre o Aviso Prévio Indenizado (Súmula 305 TST)",{"$f":"'Encargos Sociais'!E36","v":6.6666666666666664E-4},{"$f":"ROUND(E49*($F$16+$F$59),2)","v":2.2799999999999998},null,"* Nota 1 - Adotou-se os parâmetros do estudo do STF (http://www.stf.jus.br/arquivo/cms/sobrestfestudosci/anexo/encargos_sociais_03102007.pdf), onde 5% do pessoal é demitido pelo empregador no decurso do contrato (para estes, considerou-se o aviso prévio indenizado). Desprezou-se as demissões por justa causa e os pedidos de demissão."]
[null,null,"C","Multa do FGTS e Contribuição Social sobre o Aviso Prévio Indenizado (Art. 18, §1º, da Lei 8.036/1990 e art. 1º da LC nº 110/2001)",{"$f":"'Encargos Sociais'!E37","v":7.7170666666666644E-3},26.36,null,"* Nota 2 - No cálculo do percentual, considerou-se 36 dias, correspondendo à metade da duração média dos contratos (2 anos)"]
[null,null,"D","Aviso Prévio Trabalhado (Art. 488, parágrafo único, CLT)",{"$f":"'Encargos Sociais'!E38","v":1.2037037037037035E-2},41.11,null,"* Nota 3 - Incide sobre a Remuneração + 13º salário (1/12) + Férias (1/12) + Adicional de Férias (1/36) x 50% multa (40% para o empregado e 10% de contribuição social) x 8% FGTS"]
[null,null,"E","Incidência de GPS, FGTS e outras contribuições sobre o Aviso Prévio Trabalhado",{"$f":"'Encargos Sociais'!E39","v":4.1888888888888878E-3},14.31,null,"* Nota 4 - Os 95% restantes do cálculo, a um prazo médio de contrato de 4 anos. Assim, calcula-se 7 dias para o 1º ano de contrato e mais 3 dias para os 3 anos seguintes."]
[null,null,"F","Multa do FGTS e Contribuição Social sobre o Aviso Prévio Trabalhado",{"$f":"'Encargos Sociais'!E40","v":3.0505155555555549E-2},104.19]
[]
[null,null,null,"TOTAL DE PREVISÃO PARA RESCISÃO",null,{"$f":"SUM(F48:F53)","v":216.71}]
[]
[null,"MÓDULO 4 - CUSTO DO PROFISSIONAL AUSENTE",null,null,"Percentuais","Valor"]
[null,"Submódulo 4.1 - Ausências Legais"]
[null,null,"A","Férias (Arts. 129 e 130, inc. I, da CLT)",{"$f":"'Encargos Sociais'!E24","v":9.0909090909090912E-2},{"$f":"ROUND(E59*$F$16,2)","v":284.63},null,"* Nota 1 - As alíneas “A” a “F” referem-se somente ao custo que será pago ao repositor pelos dias \ntrabalhados quando da necessidade de substituir a mão de obra alocada na prestação do serviço."]
[null,null,"B","Ausências Legais (Arts. 131 e 473 da CLT)",{"$f":"'Encargos Sociais'!E25","v":7.9365079365079361E-3},24.85,null,"* Nota 2 - Adotou-se a estimativa do SINAPI de 2 dias por ano."]
[null,null,"C","Licença-Paternidade (Art. 7º, XIX, e art. 10, §1º, do ADCT, CF/1988 e Art. 1º, II, da Lei 11.770/2008)",{"$f":"'Encargos Sociais'!E26","v":8.2777777777777776E-4},2.59,null,"* Nota 3 - Utilizada a proporção de 50% para homens, 5 dias de afastamento, e a probabilidade de um trabalhador requerer a Licença Paternidade em 5,22%, conforme SINAPI (citando dados da PNAD 2015)"]
[null,null,"D","Ausência por Acidente de Trabalho (Art. 131, III, da CLT)",{"$f":"'Encargos Sociais'!E27","v":8.541666666666667E-4},2.67,null,"* Nota 4 - Utilzada a estatística de 1,96% dos contribuintes beneficiados com a emissão do auxílio, conforme Anuário Estatístico da Previdência Social. Afastamento de 15 dias a cargo da empresa."]
[null,null,"E","Afastamento Maternidade (Art. 71 da Lei nº 8.213/1991)",{"$f":"'Encargos Sociais'!E28","v":3.2925925925925922E-3},10.31,null,"* Nota 5 - Utilizada a proporção de 50% para mulheres, 180 dias de afastamento, e a probabilidade de uma trabalhadora requerer a Licença Maternidade em 4,91%, conforme SINAPI (citando dados do IBGE 2016)"]
[null,null,"F","Auxílio Enfermidade - Doença (Art. 59 da Lei nº 8.213/1991)",{"$f":"'Encargos Sociais'!E29","v":7.1222222222222225E-3},22.3,null,"* Nota 6 - Utilizada a estatística de 3,37% dos contribuintes beneficiados com o auxílio, conforme Anuário Estatístico da Previdência Social de 2015 (acrescidos de 2 dias ao ano, para os quais o trabalhador nem requer o benefício da Previdência - conforme SINAPI)"]
[]
[null,"Submódulo 4.2 - Intrajornada"]
[null,null,"A","Intervalo para repouso ou alimentação",{"$f":"'Encargos Sociais'!E32","v":0},{"$f":"ROUND(E67*$F$16,2)","v":0}]
[]
[null,null,null,"QUADRO-RESUMO DO MÓDULO 4",null,"Valor"]
[null,null,null,"4.1 - Ausências Legais",{"$f":"SUM(E59:E64)","v":0.11094235810485811},{"$f":"ROUND(E70*$F$16,2)","v":347.35}]
[null,null,null,"4.2 - Intrajornada",{"$f":"E67","v":0},{"$f":"ROUND(E71*$F$16,2)","v":0}]
[]
[null,null,null,"TOTAL DE PREVISÃO PARA RESCISÃO E INTERVALO INTRAJORNADA",null,{"$f":"SUM(F70:F71)","v":347.35}]
[]
[null,"MÓDULO 5 - INSUMOS DIVERSOS",null,null,null,"Valor"]
[null,null,"A","Uniformes - aquisição",null,{"$f":"ROUND(HLOOKUP($B$5,Uniformes!K6:DZ172,3)/12,2)","v":86.5}]
[null,null,"B","Materiais de consumo relacionados ao posto - aquisição",null,{"$f":"ROUND(HLOOKUP(B5,'Mat Cons'!I11:DX13,3)/12,2)","v":0}]
[null,null,"C","Materiais permanentes relacionados ao posto - remuneração da sua depreciação / manutenção",null,{"$f":"HLOOKUP(B5,'Mat Perm'!Q11:EF13,3)","v":0}]
[null,null,"D","Equipamentos relacionados ao posto - remuneração da sua depreciação / manutenção",null,{"$f":"HLOOKUP(B5,'Equip Rel'!Q11:EF13,3)","v":0}]
[null,null,"E","Equipamentos de Proteção Individual - EPI - aquisição",null,{"$f":"ROUND(HLOOKUP(B5,EPI!I3:DX37,3)/12,2)","v":333.89}]
[]
[null,null,null,"TOTAL DE INSUMOS DIVERSOS",null,{"$f":"SUM(F76:F81)","v":420.39},null,"* Nota - Valores mensais por empregado"]
[]
[null,"MÓDULO 6 - CUSTOS INDIRETOS, TRIBUTOS E LUCRO - BDI",null,null,"Percentuais","Valor"]
[null,null,"A","Custos Indiretos",{"$f":"BDI!E6","v":5.8400000000000001E-2}]
[null,null,"A.1","Administração Central",{"$f":"BDI!E7","v":2.1600000000000001E-2}]
[null,null,"A.2","Seguros, Garantias e Riscos",{"$f":"BDI!E8","v":3.6799999999999999E-2}]
[null,null,"B","Lucro",{"$f":"BDI!E10","v":3.3399999999999999E-2}]
[null,null,"C","Tributos",{"$f":"SUM(E90:E91)","v":0.124}]
[null,null,"C.1","Tributos Federais (COFINS, PIS e CPRB)",{"$f":"BDI!E18","v":7.3999999999999996E-2}]
[null,null,"C.2","Tributos Distritais (ISS)",{"$f":"BDI!E23","v":0.05},null,null,"* Nota - Utilizou-se o indicado pelo Sindicato da Arquitetura e da Engenharia (Sinaenco, 2008, p. 22), que adota um percentual redutor de 20% no cálculo dos custos tributários relativos às contribuições PIS e COFINS"]
[null,null,"D","Despesas Financeiras",{"$f":"BDI!E13","v":5.2519605742542552E-3}]
[]
[null,null,null,"TOTAL DE BDI",{"$f":"BDI!E26","v":0.25509999999999999},{"$f":"E94*E102","v":1692.909926}]
[]
[null,null,null,"QUADRO-RESUMO DO CUSTO MENSAL POR EMPREGADO - SEM O 13º","Valor"]
[null,null,null,"Módulo 1 - Composição da Remuneração",{"$f":"F16","v":3130.93}]
[null,null,null,"Módulo 2 - Encargos e Benefícios Anuais, Mensais e Diários",{"$f":"F45","v":2520.88}]
[null,null,null,"Módulo 3 - Provisão para Rescisão",{"$f":"F55","v":216.71}]
[null,null,null,"Módulo 4 - Custo de Reposição do Profissional Ausente",{"$f":"F73","v":347.35}]
[null,null,null,"Módulo 5 - Insumos Diversos",{"$f":"F82","v":420.39}]
[null,null,null,"SUBTOTAL (A+B+C+D+E)",{"$f":"SUM(E97:E101)","v":6636.26}]
[null,null,null,"Módulo 6 - Custos Indiretos, Tributos e Lucro",{"$f":"F94","v":1692.909926}]
[]
[null,null,null,"TOTAL DO POSTO",{"$f":"SUM(E102:E103)","v":8329.1699260000005}]
[]
[null,"MÓDULO 7 - DESTAQUE DO MÓDULO 2 - 13º SALÁRIO",null,null,"Percentuais","Valor"]
[null,null,"A","13º Salário",{"$f":"'Encargos Sociais'!E31","v":8.3333333333333329E-2},{"$f":"ROUND(E108*F$16,2)","v":260.91000000000003}]
[null,null,"B","Encargos Sociais sobre o 13º Salário - Taxa calculada no SUBMÓDULO 2.2",{"$f":"SUM($E$24:$E$32)","v":0.34800000000000003},{"$f":"ROUND(E109*$F$108,2)","v":90.8},null,"* Nota 1 - Provisiona-se, mensalmente, o proporcional a 1/12 dos valores referentes a gratificação natalina e adicional de férias."]
[null,null,"C","Reincidência de férias sobre o 13º Salário",{"$f":"E59","v":9.0909090909090912E-2},{"$f":"ROUND(E110*$F$108,2)","v":23.72}]
[null,null,"D","BDI sobre o 13º Salário - Taxa calculada no MÓDULO 6",{"$f":"E94","v":0.25509999999999999},{"$f":"ROUND(E111*($F$108+$F$109),2)","v":89.72}]
[]
[null,null,null,"TOTAL DO DESTAQUE DO 13º SALÁRIO",null,{"$f":"SUM(F108:F111)","v":465.15000000000009}]
[]
[null,null,null,"QUADRO-RESUMO DO CUSTO MENSAL POR EMPREGADO","Valor"]
[null,null,null,"Custo total - sem o 13º Salário",{"$f":"E105","v":8329.1699260000005}]
[null,null,null,"Destaque do 13º Salário (valor mensal)",{"$f":"F113","v":465.15000000000009}]
[]
[null,null,null,"TOTAL DO POSTO",{"$f":"E116+E117","v":8794.3199260000001}]

{"sheet":"9","index":12,"n_rows":119,"n_cols":8,"rows_kept":119,"cut":false,"hidden":false,"merged":[[106,1,106,3],[39,3,39,5],[46,1,46,3],[56,1,56,3],[68,3,68,5],[74,1,74,3],[83,1,83,3],[17,1,17,3],[1,1,1,5],[2,1,2,5],[4,1,4,2],[5,1,5,2],[7,1,7,3]]}
[]
[null,"PLANILHA DE ESTIMATIVA DE CUSTOS"]
[null,"Padrão IN 05/2017 e IN 07/2018 - MPDG"]
[]
[null,9,null,{"$f":"HLOOKUP($B$5,'Dados Gerais'!$D$5:$BK$20,6)","v":"ANALISTA DE INFRAESTRUTURA DE TI PLENO"},"QUANTIDADE",{"$f":"HLOOKUP($B$5,'Dados Gerais'!$D$5:$BK$20,10)","v":6}]
[null,"CCT",null,{"$f":"HLOOKUP($B$5,'Dados Gerais'!$D$5:$BK$20,15)","v":"SINDPD/DF X SINDESEI/DF 2021/2022 Nº DF000608/2021"},"DATA-BASE",{"$f":"'Dados Gerais'!F20","v":"2021-05-01"}]
[]
[null,"MÓDULO 1 - COMPOSIÇÃO DA REMUNERAÇÃO",null,null,null,"Valor"]
[null,null,"A","Salário-Base",null,{"$f":"HLOOKUP($B$5,'Dados Gerais'!$D$5:$BK$20,8)","v":6192.84}]
[null,null,"B","Adicional de Periculosidade",null,{"$f":"HLOOKUP($B$5,'Dados Gerais'!$D$5:$BK$37,25)","v":0}]
[null,null,"C","Adicional de Insalubridade",null,{"$f":"HLOOKUP($B$5,'Dados Gerais'!$D$5:$BK$37,31)","v":0}]
[null,null,"D","Adicional Noturno",null,{"$f":"HLOOKUP($B$5,'Dados Gerais'!$D$5:$BK$50,46)","v":0},null,"* Nota 1 - O Módulo 1 refere-se ao valor mensal devido ao empregado pela prestação do serviço no período de 12 meses."]
[null,null,"E","Adicional de Hora Extra",null,{"$f":"HLOOKUP($B$5,'Dados Gerais'!$D$5:$BK$67,63)","v":0},null,"* Nota 2 - O adicional de hora extra no feriado trabalhado foi suprimido pela Lei 13.467/17"]
[null,null,"F","Outros (especificar)",null,{"$f":"HLOOKUP($B$5,'Dados Gerais'!$D$5:$BK$59,33)","v":0},null,"* Nota 3 - ART. 7º, § 2º, DA LEI Nº 605/49.Sendo mensalista o obreiro, o adicional noturno pago de forma fixa já é considerado integrado para os efeitos do pagamento do repouso semanal remunerado, nos termos do art. 7º, § 2º, da Lei nº 605/49."]
[]
[null,null,null,"TOTAL DA REMUNERAÇÃO",null,{"$f":"SUM(F9:F14)","v":6192.84}]
[]
[null,"MÓDULO 2 - ENCARGOS E BENEFÍCIOS ANUAIS, MENSAIS E DIÁRIOS",null,null,"Percentuais","Valor"]
[null,"Submódulo 2.1 - 13º Salário, Férias e Adicional de Férias"]
[null,null,"A","13º Salário - Calculado no Módulo 7 - Destacado",0,{"$f":"ROUND(E20*F$16,2)","v":0},null,"* Nota 1 - Provisiona-se, mensalmente, o proporcional a 1/11 dos valores referentes a gratificação natalina, férias e adicional de férias."]
[null,null,"B","Adicional de Férias",{"$f":"'Encargos Sociais'!E30","v":3.03030303030303E-2},{"$f":"ROUND(E21*F$16,2)","v":187.66},null,"* Nota 2 - O adicional de férias contido no Submódulo 2.1 corresponde a 1/3 da remuneração que, por sua vez, é dividida por 11 contome Nota 1."]
[]
[null,"Submódulo 2.2 - Encargos Previdenciários (GPS), Fundo de Garantia por Tempo de Serviço (FGTS) e Outras Contribuições"]
[null,null,"A","INSS (art. 22, inciso I, Lei nº 8.212/91)",{"$f":"'Encargos Sociais'!E13","v":0.2},{"$f":"ROUND(E24*($F$16+$F$41+$F$73),2)","v":1413.51}]
[null,null,"B","Salário Educação (art. 3º, inciso I, Decreto nº 87.043/82)",{"$f":"'Encargos Sociais'!E14","v":2.5000000000000001E-2},{"$f":"ROUND(E25*($F$16+$F$41+$F$73),2)","v":176.69}]
[null,null,"C","SAT/RAT (art. 22, II, Lei 8.212/91 e Anexo V, Decreto 6.042/07) - Enquadramento 8211-3/00",{"$f":"'Encargos Sociais'!E15","v":0.01},70.680000000000007]
[null,null,"D","SESC ou SESI (art. 30, Lei nº 8.036/90 e art. 1º, Lei 8.154/90)",{"$f":"'Encargos Sociais'!E16","v":1.4999999999999999E-2},106.01]
[null,null,"E","SENAI ou SENAC (Decreto nº 2.318/86)",{"$f":"'Encargos Sociais'!E17","v":0.01},70.680000000000007]
[null,null,"F","SEBRAE (§ 3º, art. 8º, Lei 8.029/90, alterada pela Lei nº 8.154/90)",{"$f":"'Encargos Sociais'!E18","v":6.0000000000000001E-3},42.41]
[null,null,"G","INCRA (art. 1º, I, Decreto Lei 1.146/70 e Lei 7.787, de 30/06/89)",{"$f":"'Encargos Sociais'!E19","v":2E-3},14.14,null,"* Nota 1 - Os percentuais dos encargos previdenciários, do FGTS e demais contribuições são estabelecidos por legislação vigente."]
[null,null,"H","FGTS (Lei Complementar nº 110/01 e art. 30, Lei nº 8.036/90)",{"$f":"'Encargos Sociais'!E20","v":0.08},565.4,null,"* Nota 2 - O SAT, a depender do grau de risco do serviço, irá variar entre 1%, para risco leve, de 2%, para risco médio, e de 3% para risco grave."]
[null,null,"I","SECONCI (Convenções Coletivas de Trabalho da construção)",{"$f":"'Encargos Sociais'!E21","v":0},0,null,"* Nota 3 - Os percentuais do Submódulo 2.2 incidem sobre o Módulo 1 e o Submódulo 2.1."]
[]
[null,"Submódulo 2.3 - Benefícios Mensais e Diários"]
[null,null,"A","Auxílio Transporte",null,{"$f":"HLOOKUP($B$5,'Dados Gerais'!$D$5:$BK$93,82)","v":0}]
[null,null,"B","Auxílio Alimentação",null,{"$f":"HLOOKUP($B$5,'Dados Gerais'!$D$5:$BK$93,89)","v":770}]
[null,null,"C","Assistência Médica e Familiar",null,{"$f":"HLOOKUP($B$5,'Dados Gerais'!$D$5:$BK$101,97)","v":237.92}]
[null,null,"D","Outros (Seguro de vida e auxílio funeral e auxílio odontológico)",null,{"$f":"HLOOKUP($B$5,'Dados Gerais'!$D$5:$BK$118,114)","v":12.36},null,"* Nota 1 - O valor informado deverá ser o custo real do benefício (descontado o valor eventualmente pago pelo empregado)."]
[null,null,null,null,null,null,null,"* Nota 2 - Observar a previsão dos benefícios contidos em Acordos, Convenções e Dissídios Coletivos de Trabalho e o disposto no art. 6º da IN 5/2017"]
[null,null,null,"QUADRO-RESUMO DO MÓDULO 2"]
[null,null,null,"2.1 - 13º Salário, Férias e Adicional de Férias - 13º Destacado - Calculado no Módulo 7 ",{"$f":"SUM(E20:E21)","v":3.03030303030303E-2},{"$f":"F20+F21","v":187.66}]
[null,null,null,"2.2 - Encargos Previdenciários (GPS), Fundo de Garantia por Tempo de Serviço (FGTS) e Contribuições",{"$f":"SUM(E24:E32)","v":0.34800000000000003},{"$f":"SUM(F24:F32)","v":2459.5200000000004}]
[null,null,null,"2.3 - Benefícios Mensais e Diários",null,{"$f":"SUM(F35:F38)","v":1020.28}]
[]
[null,null,null,"TOTAL DOS ENCARGOS E BENEFÍCIOS",null,{"$f":"SUM(F41:F43)","v":3667.46}]
[]
[null,"MÓDULO 3 - PREVISÃO PARA RESCISÃO",null,null,"Percentuais","Valor"]
[null,null,"A","Aviso Prévio Indenizado (Art. 7º, inciso XXI, da CF/1988 e arts. 477, 487, §1º, e 491 da CLT)",{"$f":"'Encargos Sociais'!E35","v":8.3333333333333332E-3},{"$f":"ROUND(E48*($F$16+$F$59),2)","v":56.3}]
[null,null,"B","Incidência do FGTS sobre o Aviso Prévio Indenizado (Súmula 305 TST)",{"$f":"'Encargos Sociais'!E36","v":6.6666666666666664E-4},{"$f":"ROUND(E49*($F$16+$F$59),2)","v":4.5},null,"* Nota 1 - Adotou-se os parâmetros do estudo do STF (http://www.stf.jus.br/arquivo/cms/sobrestfestudosci/anexo/encargos_sociais_03102007.pdf), onde 5% do pessoal é demitido pelo empregador no decurso do contrato (para estes, considerou-se o aviso prévio indenizado). Desprezou-se as demissões por justa causa e os pedidos de demissão."]
[null,null,"C","Multa do FGTS e Contribuição Social sobre o Aviso Prévio Indenizado (Art. 18, §1º, da Lei 8.036/1990 e art. 1º da LC nº 110/2001)",{"$f":"'Encargos Sociais'!E37","v":7.7170666666666644E-3},52.14,null,"* Nota 2 - No cálculo do percentual, considerou-se 36 dias, correspondendo à metade da duração média dos contratos (2 anos)"]
[null,null,"D","Aviso Prévio Trabalhado (Art. 488, parágrafo único, CLT)",{"$f":"'Encargos Sociais'!E38","v":1.2037037037037035E-2},81.319999999999993,null,"* Nota 3 - Incide sobre a Remuneração + 13º salário (1/12) + Férias (1/12) + Adicional de Férias (1/36) x 50% multa (40% para o empregado e 10% de contribuição social) x 8% FGTS"]
[null,null,"E","Incidência de GPS, FGTS e outras contribuições sobre o Aviso Prévio Trabalhado",{"$f":"'Encargos Sociais'!E39","v":4.1888888888888878E-3},28.3,null,"* Nota 4 - Os 95% restantes do cálculo, a um prazo médio de contrato de 4 anos. Assim, calcula-se 7 dias para o 1º ano de contrato e mais 3 dias para os 3 anos seguintes."]
[null,null,"F","Multa do FGTS e Contribuição Social sobre o Aviso Prévio Trabalhado",{"$f":"'Encargos Sociais'!E40","v":3.0505155555555549E-2},206.09]
[]
[null,null,null,"TOTAL DE PREVISÃO PARA RESCISÃO",null,{"$f":"SUM(F48:F53)","v":428.65}]
[]
[null,"MÓDULO 4 - CUSTO DO PROFISSIONAL AUSENTE",null,null,"Percentuais","Valor"]
[null,"Submódulo 4.1 - Ausências Legais"]
[null,null,"A","Férias (Arts. 129 e 130, inc. I, da CLT)",{"$f":"'Encargos Sociais'!E24","v":9.0909090909090912E-2},{"$f":"ROUND(E59*$F$16,2)","v":562.99},null,"* Nota 1 - As alíneas “A” a “F” referem-se somente ao custo que será pago ao repositor pelos dias \ntrabalhados quando da necessidade de substituir a mão de obra alocada na prestação do serviço."]
[null,null,"B","Ausências Legais (Arts. 131 e 473 da CLT)",{"$f":"'Encargos Sociais'!E25","v":7.9365079365079361E-3},49.15,null,"* Nota 2 - Adotou-se a estimativa do SINAPI de 2 dias por ano."]
[null,null,"C","Licença-Paternidade (Art. 7º, XIX, e art. 10, §1º, do ADCT, CF/1988 e Art. 1º, II, da Lei 11.770/2008)",{"$f":"'Encargos Sociais'!E26","v":8.2777777777777776E-4},5.13,null,"* Nota 3 - Utilizada a proporção de 50% para homens, 5 dias de afastamento, e a probabilidade de um trabalhador requerer a Licença Paternidade em 5,22%, conforme SINAPI (citando dados da PNAD 2015)"]
[null,null,"D","Ausência por Acidente de Trabalho (Art. 131, III, da CLT)",{"$f":"'Encargos Sociais'!E27","v":8.541666666666667E-4},5.29,null,"* Nota 4 - Utilzada a estatística de 1,96% dos contribuintes beneficiados com a emissão do auxílio, conforme Anuário Estatístico da Previdência Social. Afastamento de 15 dias a cargo da empresa."]
[null,null,"E","Afastamento Maternidade (Art. 71 da Lei nº 8.213/1991)",{"$f":"'Encargos Sociais'!E28","v":3.2925925925925922E-3},20.39,null,"* Nota 5 - Utilizada a proporção de 50% para mulheres, 180 dias de afastamento, e a probabilidade de uma trabalhadora requerer a Licença Maternidade em 4,91%, conforme SINAPI (citando dados do IBGE 2016)"]
[null,null,"F","Auxílio Enfermidade - Doença (Art. 59 da Lei nº 8.213/1991)",{"$f":"'Encargos Sociais'!E29","v":7.1222222222222225E-3},44.11,null,"* Nota 6 - Utilizada a estatística de 3,37% dos contribuintes beneficiados com o auxílio, conforme Anuário Estatístico da Previdência Social de 2015 (acrescidos de 2 dias ao ano, para os quais o trabalhador nem requer o benefício da Previdência - conforme SINAPI)"]
[]
[null,"Submódulo 4.2 - Intrajornada"]
[null,null,"A","Intervalo para repouso ou alimentação",{"$f":"'Encargos Sociais'!E32","v":0},{"$f":"ROUND(E67*$F$16,2)","v":0}]
[]
[null,null,null,"QUADRO-RESUMO DO MÓDULO 4",null,"Valor"]
[null,null,null,"4.1 - Ausências Legais",{"$f":"SUM(E59:E64)","v":0.11094235810485811},{"$f":"ROUND(E70*$F$16,2)","v":687.05}]
[null,null,null,"4.2 - Intrajornada",{"$f":"E67","v":0},{"$f":"ROUND(E71*$F$16,2)","v":0}]
[]
[null,null,null,"TOTAL DE PREVISÃO PARA RESCISÃO E INTERVALO INTRAJORNADA",null,{"$f":"SUM(F70:F71)","v":687.05}]
[]
[null,"MÓDULO 5 - INSUMOS DIVERSOS",null,null,null,"Valor"]
[null,null,"A","Uniformes - aquisição",null,{"$f":"ROUND(HLOOKUP($B$5,Uniformes!K6:DZ172,3)/12,2)","v":0}]
[null,null,"B","Materiais de consumo relacionados ao posto - aquisição",null,{"$f":"ROUND(HLOOKUP(B5,'Mat Cons'!I11:DX13,3)/12,2)","v":0}]
[null,null,"C","Materiais permanentes relacionados ao posto - remuneração da sua depreciação / manutenção",null,{"$f":"HLOOKUP(B5,'Mat Perm'!Q11:EF13,3)","v":0}]
[null,null,"D","Equipamentos relacionados ao posto - remuneração da sua depreciação / manutenção",null,{"$f":"HLOOKUP(B5,'Equip Rel'!Q11:EF13,3)","v":0}]
[null,null,"E","Equipamentos de Proteção Individual - EPI - aquisição",null,{"$f":"ROUND(HLOOKUP(B5,EPI!I3:DX37,3)/12,2)","v":0}]
[]
[null,null,null,"TOTAL DE INSUMOS DIVERSOS",null,{"$f":"SUM(F76:F81)","v":0},null,"* Nota - Valores mensais por empregado"]
[]
[null,"MÓDULO 6 - CUSTOS INDIRETOS, TRIBUTOS E LUCRO - BDI",null,null,"Percentuais","Valor"]
[null,null,"A","Custos Indiretos",{"$f":"BDI!E6","v":5.8400000000000001E-2}]
[null,null,"A.1","Administração Central",{"$f":"BDI!E7","v":2.1600000000000001E-2}]
[null,null,"A.2","Seguros, Garantias e Riscos",{"$f":"BDI!E8","v":3.6799999999999999E-2}]
[null,null,"B","Lucro",{"$f":"BDI!E10","v":3.3399999999999999E-2}]
[null,null,"C","Tributos",{"$f":"SUM(E90:E91)","v":0.124}]
[null,null,"C.1","Tributos Federais (COFINS, PIS e CPRB)",{"$f":"BDI!E18","v":7.3999999999999996E-2}]
[null,null,"C.2","Tributos Distritais (ISS)",{"$f":"BDI!E23","v":0.05},null,null,"* Nota - Utilizou-se o indicado pelo Sindicato da Arquitetura e da Engenharia (Sinaenco, 2008, p. 22), que adota um percentual redutor de 20% no cálculo dos custos tributários relativos às contribuições PIS e COFINS"]
[null,null,"D","Despesas Financeiras",{"$f":"BDI!E13","v":5.2519605742542552E-3}]
[]
[null,null,null,"TOTAL DE BDI",{"$f":"BDI!E26","v":0.25509999999999999},{"$f":"E94*E102","v":2799.9775999999993}]
[]
[null,null,null,"QUADRO-RESUMO DO CUSTO MENSAL POR EMPREGADO - SEM O 13º","Valor"]
[null,null,null,"Módulo 1 - Composição da Remuneração",{"$f":"F16","v":6192.84}]
[null,null,null,"Módulo 2 - Encargos e Benefícios Anuais, Mensais e Diários",{"$f":"F45","v":3667.46}]
[null,null,null,"Módulo 3 - Provisão para Rescisão",{"$f":"F55","v":428.65}]
[null,null,null,"Módulo 4 - Custo de Reposição do Profissional Ausente",{"$f":"F73","v":687.05}]
[null,null,null,"Módulo 5 - Insumos Diversos",{"$f":"F82","v":0}]
[null,null,null,"SUBTOTAL (A+B+C+D+E)",{"$f":"SUM(E97:E101)","v":10975.999999999998}]
[null,null,null,"Módulo 6 - Custos Indiretos, Tributos e Lucro",{"$f":"F94","v":2799.9775999999993}]
[]
[null,null,null,"TOTAL DO POSTO",{"$f":"SUM(E102:E103)","v":13775.977599999998}]
[]
[null,"MÓDULO 7 - DESTAQUE DO MÓDULO 2 - 13º SALÁRIO",null,null,"Percentuais","Valor"]
[null,null,"A","13º Salário",{"$f":"'Encargos Sociais'!E31","v":8.3333333333333329E-2},{"$f":"ROUND(E108*F$16,2)","v":516.07000000000005}]
[null,null,"B","Encargos Sociais sobre o 13º Salário - Taxa calculada no SUBMÓDULO 2.2",{"$f":"SUM($E$24:$E$32)","v":0.34800000000000003},{"$f":"ROUND(E109*$F$108,2)","v":179.59},null,"* Nota 1 - Provisiona-se, mensalmente, o proporcional a 1/12 dos valores referentes a gratificação natalina e adicional de férias."]
[null,null,"C","Reincidência de férias sobre o 13º Salário",{"$f":"E59","v":9.0909090909090912E-2},{"$f":"ROUND(E110*$F$108,2)","v":46.92}]
[null,null,"D","BDI sobre o 13º Salário - Taxa calculada no MÓDULO 6",{"$f":"E94","v":0.25509999999999999},{"$f":"ROUND(E111*($F$108+$F$109),2)","v":177.46}]
[]
[null,null,null,"TOTAL DO DESTAQUE DO 13º SALÁRIO",null,{"$f":"SUM(F108:F111)","v":920.04000000000008}]
[]
[null,null,null,"QUADRO-RESUMO DO CUSTO MENSAL POR EMPREGADO","Valor"]
[null,null,null,"Custo total - sem o 13º Salário",{"$f":"E105","v":13775.977599999998}]
[null,null,null,"Destaque do 13º Salário (valor mensal)",{"$f":"F113","v":920.04000000000008}]
[]
[null,null,null,"TOTAL DO POSTO",{"$f":"E116+E117","v":14696.017599999999}]

{"sheet":"10","index":13,"n_rows":119,"n_cols":8,"rows_kept":119,"cut":false,"hidden":false,"merged":[[106,1,106,3],[39,3,39,5],[46,1,46,3],[56,1,56,3],[68,3,68,5],[74,1,74,3],[83,1,83,3],[17,1,17,3],[1,1,1,5],[2,1,2,5],[4,1,4,2],[5,1,5,2],[7,1,7,3]]}
[]
[null,"PLANILHA DE ESTIMATIVA DE CUSTOS"]
[null,"Padrão IN 05/2017 e IN 07/2018 - MPDG"]
[]
[null,10,null,{"$f":"HLOOKUP($B$5,'Dados Gerais'!$D$5:$BK$20,6)","v":"ANALISTA DE INFRAESTRUTURA DE TI SÊNIOR"},"QUANTIDADE",{"$f":"HLOOKUP($B$5,'Dados Gerais'!$D$5:$BK$20,10)","v":26}]
[null,"CCT",null,{"$f":"HLOOKUP($B$5,'Dados Gerais'!$D$5:$BK$20,15)","v":"SINDPD/DF X SINDESEI/DF 2021/2022 Nº DF000608/2021"},"DATA-BASE",{"$f":"'Dados Gerais'!F20","v":"2021-05-01"}]
[]
[null,"MÓDULO 1 - COMPOSIÇÃO DA REMUNERAÇÃO",null,null,null,"Valor"]
[null,null,"A","Salário-Base",null,{"$f":"HLOOKUP($B$5,'Dados Gerais'!$D$5:$BK$20,8)","v":8113.11}]
[null,null,"B","Adicional de Periculosidade",null,{"$f":"HLOOKUP($B$5,'Dados Gerais'!$D$5:$BK$37,25)","v":0}]
[null,null,"C","Adicional de Insalubridade",null,{"$f":"HLOOKUP($B$5,'Dados Gerais'!$D$5:$BK$37,31)","v":0}]
[null,null,"D","Adicional Noturno",null,{"$f":"HLOOKUP($B$5,'Dados Gerais'!$D$5:$BK$50,46)","v":0},null,"* Nota 1 - O Módulo 1 refere-se ao valor mensal devido ao empregado pela prestação do serviço no período de 12 meses."]
[null,null,"E","Adicional de Hora Extra",null,{"$f":"HLOOKUP($B$5,'Dados Gerais'!$D$5:$BK$67,63)","v":0},null,"* Nota 2 - O adicional de hora extra no feriado trabalhado foi suprimido pela Lei 13.467/17"]
[null,null,"F","Outros (especificar)",null,{"$f":"HLOOKUP($B$5,'Dados Gerais'!$D$5:$BK$59,33)","v":0},null,"* Nota 3 - ART. 7º, § 2º, DA LEI Nº 605/49.Sendo mensalista o obreiro, o adicional noturno pago de forma fixa já é considerado integrado para os efeitos do pagamento do repouso semanal remunerado, nos termos do art. 7º, § 2º, da Lei nº 605/49."]
[]
[null,null,null,"TOTAL DA REMUNERAÇÃO",null,{"$f":"SUM(F9:F14)","v":8113.11}]
[]
[null,"MÓDULO 2 - ENCARGOS E BENEFÍCIOS ANUAIS, MENSAIS E DIÁRIOS",null,null,"Percentuais","Valor"]
[null,"Submódulo 2.1 - 13º Salário, Férias e Adicional de Férias"]
[null,null,"A","13º Salário - Calculado no Módulo 7 - Destacado",0,{"$f":"ROUND(E20*F$16,2)","v":0},null,"* Nota 1 - Provisiona-se, mensalmente, o proporcional a 1/11 dos valores referentes a gratificação natalina, férias e adicional de férias."]
[null,null,"B","Adicional de Férias",{"$f":"'Encargos Sociais'!E30","v":3.03030303030303E-2},{"$f":"ROUND(E21*F$16,2)","v":245.85},null,"* Nota 2 - O adicional de férias contido no Submódulo 2.1 corresponde a 1/3 da remuneração que, por sua vez, é dividida por 11 contome Nota 1."]
[]
[null,"Submódulo 2.2 - Encargos Previdenciários (GPS), Fundo de Garantia por Tempo de Serviço (FGTS) e Outras Contribuições"]
[null,null,"A","INSS (art. 22, inciso I, Lei nº 8.212/91)",{"$f":"'Encargos Sociais'!E13","v":0.2},{"$f":"ROUND(E24*($F$16+$F$41+$F$73),2)","v":1851.81}]
[null,null,"B","Salário Educação (art. 3º, inciso I, Decreto nº 87.043/82)",{"$f":"'Encargos Sociais'!E14","v":2.5000000000000001E-2},{"$f":"ROUND(E25*($F$16+$F$41+$F$73),2)","v":231.48}]
[null,null,"C","SAT/RAT (art. 22, II, Lei 8.212/91 e Anexo V, Decreto 6.042/07) - Enquadramento 8211-3/00",{"$f":"'Encargos Sociais'!E15","v":0.01},92.59]
[null,null,"D","SESC ou SESI (art. 30, Lei nº 8.036/90 e art. 1º, Lei 8.154/90)",{"$f":"'Encargos Sociais'!E16","v":1.4999999999999999E-2},138.88999999999999]
[null,null,"E","SENAI ou SENAC (Decreto nº 2.318/86)",{"$f":"'Encargos Sociais'!E17","v":0.01},92.59]
[null,null,"F","SEBRAE (§ 3º, art. 8º, Lei 8.029/90, alterada pela Lei nº 8.154/90)",{"$f":"'Encargos Sociais'!E18","v":6.0000000000000001E-3},55.55]
[null,null,"G","INCRA (art. 1º, I, Decreto Lei 1.146/70 e Lei 7.787, de 30/06/89)",{"$f":"'Encargos Sociais'!E19","v":2E-3},18.52,null,"* Nota 1 - Os percentuais dos encargos previdenciários, do FGTS e demais contribuições são estabelecidos por legislação vigente."]
[null,null,"H","FGTS (Lei Complementar nº 110/01 e art. 30, Lei nº 8.036/90)",{"$f":"'Encargos Sociais'!E20","v":0.08},740.72,null,"* Nota 2 - O SAT, a depender do grau de risco do serviço, irá variar entre 1%, para risco leve, de 2%, para risco médio, e de 3% para risco grave."]
[null,null,"I","SECONCI (Convenções Coletivas de Trabalho da construção)",{"$f":"'Encargos Sociais'!E21","v":0},0,null,"* Nota 3 - Os percentuais do Submódulo 2.2 incidem sobre o Módulo 1 e o Submódulo 2.1."]
[]
[null,"Submódulo 2.3 - Benefícios Mensais e Diários"]
[null,null,"A","Auxílio Transporte",null,{"$f":"HLOOKUP($B$5,'Dados Gerais'!$D$5:$BK$93,82)","v":0}]
[null,null,"B","Auxílio Alimentação",null,{"$f":"HLOOKUP($B$5,'Dados Gerais'!$D$5:$BK$93,89)","v":770}]
[null,null,"C","Assistência Médica e Familiar",null,{"$f":"HLOOKUP($B$5,'Dados Gerais'!$D$5:$BK$101,97)","v":237.92}]
[null,null,"D","Outros (Seguro de vida e auxílio funeral e auxílio odontológico)",null,{"$f":"HLOOKUP($B$5,'Dados Gerais'!$D$5:$BK$118,114)","v":12.36},null,"* Nota 1 - O valor informado deverá ser o custo real do benefício (descontado o valor eventualmente pago pelo empregado)."]
[null,null,null,null,null,null,null,"* Nota 2 - Observar a previsão dos benefícios contidos em Acordos, Convenções e Dissídios Coletivos de Trabalho e o disposto no art. 6º da IN 5/2017"]
[null,null,null,"QUADRO-RESUMO DO MÓDULO 2"]
[null,null,null,"2.1 - 13º Salário, Férias e Adicional de Férias - 13º Destacado - Calculado no Módulo 7 ",{"$f":"SUM(E20:E21)","v":3.03030303030303E-2},{"$f":"F20+F21","v":245.85}]
[null,null,null,"2.2 - Encargos Previdenciários (GPS), Fundo de Garantia por Tempo de Serviço (FGTS) e Contribuições",{"$f":"SUM(E24:E32)","v":0.34800000000000003},{"$f":"SUM(F24:F32)","v":3222.1500000000005}]
[null,null,null,"2.3 - Benefícios Mensais e Diários",null,{"$f":"SUM(F35:F38)","v":1020.28}]
[]
[null,null,null,"TOTAL DOS ENCARGOS E BENEFÍCIOS",null,{"$f":"SUM(F41:F43)","v":4488.2800000000007}]
[]
[null,"MÓDULO 3 - PREVISÃO PARA RESCISÃO",null,null,"Percentuais","Valor"]
[null,null,"A","Aviso Prévio Indenizado (Art. 7º, inciso XXI, da CF/1988 e arts. 477, 487, §1º, e 491 da CLT)",{"$f":"'Encargos Sociais'!E35","v":8.3333333333333332E-3},{"$f":"ROUND(E48*($F$16+$F$59),2)","v":73.760000000000005}]
[null,null,"B","Incidência do FGTS sobre o Aviso Prévio Indenizado (Súmula 305 TST)",{"$f":"'Encargos Sociais'!E36","v":6.6666666666666664E-4},{"$f":"ROUND(E49*($F$16+$F$59),2)","v":5.9},null,"* Nota 1 - Adotou-se os parâmetros do estudo do STF (http://www.stf.jus.br/arquivo/cms/sobrestfestudosci/anexo/encargos_sociais_03102007.pdf), onde 5% do pessoal é demitido pelo empregador no decurso do contrato (para estes, considerou-se o aviso prévio indenizado). Desprezou-se as demissões por justa causa e os pedidos de demissão."]
[null,null,"C","Multa do FGTS e Contribuição Social sobre o Aviso Prévio Indenizado (Art. 18, §1º, da Lei 8.036/1990 e art. 1º da LC nº 110/2001)",{"$f":"'Encargos Sociais'!E37","v":7.7170666666666644E-3},68.3,null,"* Nota 2 - No cálculo do percentual, considerou-se 36 dias, correspondendo à metade da duração média dos contratos (2 anos)"]
[null,null,"D","Aviso Prévio Trabalhado (Art. 488, parágrafo único, CLT)",{"$f":"'Encargos Sociais'!E38","v":1.2037037037037035E-2},106.54,null,"* Nota 3 - Incide sobre a Remuneração + 13º salário (1/12) + Férias (1/12) + Adicional de Férias (1/36) x 50% multa (40% para o empregado e 10% de contribuição social) x 8% FGTS"]
[null,null,"E","Incidência de GPS, FGTS e outras contribuições sobre o Aviso Prévio Trabalhado",{"$f":"'Encargos Sociais'!E39","v":4.1888888888888878E-3},37.07,null,"* Nota 4 - Os 95% restantes do cálculo, a um prazo médio de contrato de 4 anos. Assim, calcula-se 7 dias para o 1º ano de contrato e mais 3 dias para os 3 anos seguintes."]
[null,null,"F","Multa do FGTS e Contribuição Social sobre o Aviso Prévio Trabalhado",{"$f":"'Encargos Sociais'!E40","v":3.0505155555555549E-2},269.99]
[]
[null,null,null,"TOTAL DE PREVISÃO PARA RESCISÃO",null,{"$f":"SUM(F48:F53)","v":561.55999999999995}]
[]
[null,"MÓDULO 4 - CUSTO DO PROFISSIONAL AUSENTE",null,null,"Percentuais","Valor"]
[null,"Submódulo 4.1 - Ausências Legais"]
[null,null,"A","Férias (Arts. 129 e 130, inc. I, da CLT)",{"$f":"'Encargos Sociais'!E24","v":9.0909090909090912E-2},{"$f":"ROUND(E59*$F$16,2)","v":737.56},null,"* Nota 1 - As alíneas “A” a “F” referem-se somente ao custo que será pago ao repositor pelos dias \ntrabalhados quando da necessidade de substituir a mão de obra alocada na prestação do serviço."]
[null,null,"B","Ausências Legais (Arts. 131 e 473 da CLT)",{"$f":"'Encargos Sociais'!E25","v":7.9365079365079361E-3},64.39,null,"* Nota 2 - Adotou-se a estimativa do SINAPI de 2 dias por ano."]
[null,null,"C","Licença-Paternidade (Art. 7º, XIX, e art. 10, §1º, do ADCT, CF/1988 e Art. 1º, II, da Lei 11.770/2008)",{"$f":"'Encargos Sociais'!E26","v":8.2777777777777776E-4},6.72,null,"* Nota 3 - Utilizada a proporção de 50% para homens, 5 dias de afastamento, e a probabilidade de um trabalhador requerer a Licença Paternidade em 5,22%, conforme SINAPI (citando dados da PNAD 2015)"]
[null,null,"D","Ausência por Acidente de Trabalho (Art. 131, III, da CLT)",{"$f":"'Encargos Sociais'!E27","v":8.541666666666667E-4},6.93,null,"* Nota 4 - Utilzada a estatística de 1,96% dos contribuintes beneficiados com a emissão do auxílio, conforme Anuário Estatístico da Previdência Social. Afastamento de 15 dias a cargo da empresa."]
[null,null,"E","Afastamento Maternidade (Art. 71 da Lei nº 8.213/1991)",{"$f":"'Encargos Sociais'!E28","v":3.2925925925925922E-3},26.71,null,"* Nota 5 - Utilizada a proporção de 50% para mulheres, 180 dias de afastamento, e a probabilidade de uma trabalhadora requerer a Licença Maternidade em 4,91%, conforme SINAPI (citando dados do IBGE 2016)"]
[null,null,"F","Auxílio Enfermidade - Doença (Art. 59 da Lei nº 8.213/1991)",{"$f":"'Encargos Sociais'!E29","v":7.1222222222222225E-3},57.78,null,"* Nota 6 - Utilizada a estatística de 3,37% dos contribuintes beneficiados com o auxílio, conforme Anuário Estatístico da Previdência Social de 2015 (acrescidos de 2 dias ao ano, para os quais o trabalhador nem requer o benefício da Previdência - conforme SINAPI)"]
[]
[null,"Submódulo 4.2 - Intrajornada"]
[null,null,"A","Intervalo para repouso ou alimentação",{"$f":"'Encargos Sociais'!E32","v":0},{"$f":"ROUND(E67*$F$16,2)","v":0}]
[]
[null,null,null,"QUADRO-RESUMO DO MÓDULO 4",null,"Valor"]
[null,null,null,"4.1 - Ausências Legais",{"$f":"SUM(E59:E64)","v":0.11094235810485811},{"$f":"ROUND(E70*$F$16,2)","v":900.09}]
[null,null,null,"4.2 - Intrajornada",{"$f":"E67","v":0},{"$f":"ROUND(E71*$F$16,2)","v":0}]
[]
[null,null,null,"TOTAL DE PREVISÃO PARA RESCISÃO E INTERVALO INTRAJORNADA",null,{"$f":"SUM(F70:F71)","v":900.09}]
[]
[null,"MÓDULO 5 - INSUMOS DIVERSOS",null,null,null,"Valor"]
[null,null,"A","Uniformes - aquisição",null,{"$f":"ROUND(HLOOKUP($B$5,Uniformes!K6:DZ172,3)/12,2)","v":0}]
[null,null,"B","Materiais de consumo relacionados ao posto - aquisição",null,{"$f":"ROUND(HLOOKUP(B5,'Mat Cons'!I11:DX13,3)/12,2)","v":0}]
[null,null,"C","Materiais permanentes relacionados ao posto - remuneração da sua depreciação / manutenção",null,{"$f":"HLOOKUP(B5,'Mat Perm'!Q11:EF13,3)","v":0}]
[null,null,"D","Equipamentos relacionados ao posto - remuneração da sua depreciação / manutenção",null,{"$f":"HLOOKUP(B5,'Equip Rel'!Q11:EF13,3)","v":0}]
[null,null,"E","Equipamentos de Proteção Individual - EPI - aquisição",null,{"$f":"ROUND(HLOOKUP(B5,EPI!I3:DX37,3)/12,2)","v":0}]
[]
[null,null,null,"TOTAL DE INSUMOS DIVERSOS",null,{"$f":"SUM(F76:F81)","v":0},null,"* Nota - Valores mensais por empregado"]
[]
[null,"MÓDULO 6 - CUSTOS INDIRETOS, TRIBUTOS E LUCRO - BDI",null,null,"Percentuais","Valor"]
[null,null,"A","Custos Indiretos",{"$f":"BDI!E6","v":5.8400000000000001E-2}]
[null,null,"A.1","Administração Central",{"$f":"BDI!E7","v":2.1600000000000001E-2}]
[null,null,"A.2","Seguros, Garantias e Riscos",{"$f":"BDI!E8","v":3.6799999999999999E-2}]
[null,null,"B","Lucro",{"$f":"BDI!E10","v":3.3399999999999999E-2}]
[null,null,"C","Tributos",{"$f":"SUM(E90:E91)","v":0.124}]
[null,null,"C.1","Tributos Federais (COFINS, PIS e CPRB)",{"$f":"BDI!E18","v":7.3999999999999996E-2}]
[null,null,"C.2","Tributos Distritais (ISS)",{"$f":"BDI!E23","v":0.05},null,null,"* Nota - Utilizou-se o indicado pelo Sindicato da Arquitetura e da Engenharia (Sinaenco, 2008, p. 22), que adota um percentual redutor de 20% no cálculo dos custos tributários relativos às contribuições PIS e COFINS"]
[null,null,"D","Despesas Financeiras",{"$f":"BDI!E13","v":5.2519605742542552E-3}]
[]
[null,null,null,"TOTAL DE BDI",{"$f":"BDI!E26","v":0.25509999999999999},{"$f":"E94*E102","v":3587.4815039999999}]
[]
[null,null,null,"QUADRO-RESUMO DO CUSTO MENSAL POR EMPREGADO - SEM O 13º","Valor"]
[null,null,null,"Módulo 1 - Composição da Remuneração",{"$f":"F16","v":8113.11}]
[null,null,null,"Módulo 2 - Encargos e Benefícios Anuais, Mensais e Diários",{"$f":"F45","v":4488.2800000000007}]
[null,null,null,"Módulo 3 - Provisão para Rescisão",{"$f":"F55","v":561.55999999999995}]
[null,null,null,"Módulo 4 - Custo de Reposição do Profissional Ausente",{"$f":"F73","v":900.09}]
[null,null,null,"Módulo 5 - Insumos Diversos",{"$f":"F82","v":0}]
[null,null,null,"SUBTOTAL (A+B+C+D+E)",{"$f":"SUM(E97:E101)","v":14063.039999999999}]
[null,null,null,"Módulo 6 - Custos Indiretos, Tributos e Lucro",{"$f":"F94","v":3587.4815039999999}]
[]
[null,null,null,"TOTAL DO POSTO",{"$f":"SUM(E102:E103)","v":17650.521504}]
[]
[null,"MÓDULO 7 - DESTAQUE DO MÓDULO 2 - 13º SALÁRIO",null,null,"Percentuais","Valor"]
[null,null,"A","13º Salário",{"$f":"'Encargos Sociais'!E31","v":8.3333333333333329E-2},{"$f":"ROUND(E108*F$16,2)","v":676.09}]
[null,null,"B","Encargos Sociais sobre o 13º Salário - Taxa calculada no SUBMÓDULO 2.2",{"$f":"SUM($E$24:$E$32)","v":0.34800000000000003},{"$f":"ROUND(E109*$F$108,2)","v":235.28},null,"* Nota 1 - Provisiona-se, mensalmente, o proporcional a 1/12 dos valores referentes a gratificação natalina e adicional de férias."]
[null,null,"C","Reincidência de férias sobre o 13º Salário",{"$f":"E59","v":9.0909090909090912E-2},{"$f":"ROUND(E110*$F$108,2)","v":61.46}]
[null,null,"D","BDI sobre o 13º Salário - Taxa calculada no MÓDULO 6",{"$f":"E94","v":0.25509999999999999},{"$f":"ROUND(E111*($F$108+$F$109),2)","v":232.49}]
[]
[null,null,null,"TOTAL DO DESTAQUE DO 13º SALÁRIO",null,{"$f":"SUM(F108:F111)","v":1205.3200000000002}]
[]
[null,null,null,"QUADRO-RESUMO DO CUSTO MENSAL POR EMPREGADO","Valor"]
[null,null,null,"Custo total - sem o 13º Salário",{"$f":"E105","v":17650.521504}]
[null,null,null,"Destaque do 13º Salário (valor mensal)",{"$f":"F113","v":1205.3200000000002}]
[]
[null,null,null,"TOTAL DO POSTO",{"$f":"E116+E117","v":18855.841504}]

{"sheet":"11","index":14,"n_rows":119,"n_cols":8,"rows_kept":119,"cut":false,"hidden":false,"merged":[[106,1,106,3],[39,3,39,5],[46,1,46,3],[56,1,56,3],[68,3,68,5],[74,1,74,3],[83,1,83,3],[17,1,17,3],[1,1,1,5],[2,1,2,5],[4,1,4,2],[5,1,5,2],[7,1,7,3]]}
[]
[null,"PLANILHA DE ESTIMATIVA DE CUSTOS"]
[null,"Padrão IN 05/2017 e IN 07/2018 - MPDG"]
[]
[null,11,null,{"$f":"HLOOKUP($B$5,'Dados Gerais'!$D$5:$BK$20,6)","v":"ANALISTA DE INFRAESTRUTURA DE TI MASTER"},"QUANTIDADE",{"$f":"HLOOKUP($B$5,'Dados Gerais'!$D$5:$BK$20,10)","v":26}]
[null,"CCT",null,{"$f":"HLOOKUP($B$5,'Dados Gerais'!$D$5:$BK$20,15)","v":"SINDPD/DF X SINDESEI/DF 2021/2022 Nº DF000608/2021"},"DATA-BASE",{"$f":"'Dados Gerais'!F20","v":"2021-05-01"}]
[]
[null,"MÓDULO 1 - COMPOSIÇÃO DA REMUNERAÇÃO",null,null,null,"Valor"]
[null,null,"A","Salário-Base",null,{"$f":"HLOOKUP($B$5,'Dados Gerais'!$D$5:$BK$20,8)","v":10366.92}]
[null,null,"B","Adicional de Periculosidade",null,{"$f":"HLOOKUP($B$5,'Dados Gerais'!$D$5:$BK$37,25)","v":0}]
[null,null,"C","Adicional de Insalubridade",null,{"$f":"HLOOKUP($B$5,'Dados Gerais'!$D$5:$BK$37,31)","v":0}]
[null,null,"D","Adicional Noturno",null,{"$f":"HLOOKUP($B$5,'Dados Gerais'!$D$5:$BK$50,46)","v":0},null,"* Nota 1 - O Módulo 1 refere-se ao valor mensal devido ao empregado pela prestação do serviço no período de 12 meses."]
[null,null,"E","Adicional de Hora Extra",null,{"$f":"HLOOKUP($B$5,'Dados Gerais'!$D$5:$BK$67,63)","v":0},null,"* Nota 2 - O adicional de hora extra no feriado trabalhado foi suprimido pela Lei 13.467/17"]
[null,null,"F","Outros (especificar)",null,{"$f":"HLOOKUP($B$5,'Dados Gerais'!$D$5:$BK$59,33)","v":0},null,"* Nota 3 - ART. 7º, § 2º, DA LEI Nº 605/49.Sendo mensalista o obreiro, o adicional noturno pago de forma fixa já é considerado integrado para os efeitos do pagamento do repouso semanal remunerado, nos termos do art. 7º, § 2º, da Lei nº 605/49."]
[]
[null,null,null,"TOTAL DA REMUNERAÇÃO",null,{"$f":"SUM(F9:F14)","v":10366.92}]
[]
[null,"MÓDULO 2 - ENCARGOS E BENEFÍCIOS ANUAIS, MENSAIS E DIÁRIOS",null,null,"Percentuais","Valor"]
[null,"Submódulo 2.1 - 13º Salário, Férias e Adicional de Férias"]
[null,null,"A","13º Salário - Calculado no Módulo 7 - Destacado",0,{"$f":"ROUND(E20*F$16,2)","v":0},null,"* Nota 1 - Provisiona-se, mensalmente, o proporcional a 1/11 dos valores referentes a gratificação natalina, férias e adicional de férias."]
[null,null,"B","Adicional de Férias",{"$f":"'Encargos Sociais'!E30","v":3.03030303030303E-2},{"$f":"ROUND(E21*F$16,2)","v":314.14999999999998},null,"* Nota 2 - O adicional de férias contido no Submódulo 2.1 corresponde a 1/3 da remuneração que, por sua vez, é dividida por 11 contome Nota 1."]
[]
[null,"Submódulo 2.2 - Encargos Previdenciários (GPS), Fundo de Garantia por Tempo de Serviço (FGTS) e Outras Contribuições"]
[null,null,"A","INSS (art. 22, inciso I, Lei nº 8.212/91)",{"$f":"'Encargos Sociais'!E13","v":0.2},{"$f":"ROUND(E24*($F$16+$F$41+$F$73),2)","v":2366.2399999999998}]
[null,null,"B","Salário Educação (art. 3º, inciso I, Decreto nº 87.043/82)",{"$f":"'Encargos Sociais'!E14","v":2.5000000000000001E-2},{"$f":"ROUND(E25*($F$16+$F$41+$F$73),2)","v":295.77999999999997}]
[null,null,"C","SAT/RAT (art. 22, II, Lei 8.212/91 e Anexo V, Decreto 6.042/07) - Enquadramento 8211-3/00",{"$f":"'Encargos Sociais'!E15","v":0.01},118.31]
[null,null,"D","SESC ou SESI (art. 30, Lei nº 8.036/90 e art. 1º, Lei 8.154/90)",{"$f":"'Encargos Sociais'!E16","v":1.4999999999999999E-2},177.47]
[null,null,"E","SENAI ou SENAC (Decreto nº 2.318/86)",{"$f":"'Encargos Sociais'!E17","v":0.01},118.31]
[null,null,"F","SEBRAE (§ 3º, art. 8º, Lei 8.029/90, alterada pela Lei nº 8.154/90)",{"$f":"'Encargos Sociais'!E18","v":6.0000000000000001E-3},70.989999999999995]
[null,null,"G","INCRA (art. 1º, I, Decreto Lei 1.146/70 e Lei 7.787, de 30/06/89)",{"$f":"'Encargos Sociais'!E19","v":2E-3},23.66,null,"* Nota 1 - Os percentuais dos encargos previdenciários, do FGTS e demais contribuições são estabelecidos por legislação vigente."]
[null,null,"H","FGTS (Lei Complementar nº 110/01 e art. 30, Lei nº 8.036/90)",{"$f":"'Encargos Sociais'!E20","v":0.08},946.5,null,"* Nota 2 - O SAT, a depender do grau de risco do serviço, irá variar entre 1%, para risco leve, de 2%, para risco médio, e de 3% para risco grave."]
[null,null,"I","SECONCI (Convenções Coletivas de Trabalho da construção)",{"$f":"'Encargos Sociais'!E21","v":0},0,null,"* Nota 3 - Os percentuais do Submódulo 2.2 incidem sobre o Módulo 1 e o Submódulo 2.1."]
[]
[null,"Submódulo 2.3 - Benefícios Mensais e Diários"]
[null,null,"A","Auxílio Transporte",null,{"$f":"HLOOKUP($B$5,'Dados Gerais'!$D$5:$BK$93,82)","v":0}]
[null,null,"B","Auxílio Alimentação",null,{"$f":"HLOOKUP($B$5,'Dados Gerais'!$D$5:$BK$93,89)","v":770}]
[null,null,"C","Assistência Médica e Familiar",null,{"$f":"HLOOKUP($B$5,'Dados Gerais'!$D$5:$BK$101,97)","v":237.92}]
[null,null,"D","Outros (Seguro de vida e auxílio funeral e auxílio odontológico)",null,{"$f":"HLOOKUP($B$5,'Dados Gerais'!$D$5:$BK$118,114)","v":12.36},null,"* Nota 1 - O valor informado deverá ser o custo real do benefício (descontado o valor eventualmente pago pelo empregado)."]
[null,null,null,null,null,null,null,"* Nota 2 - Observar a previsão dos benefícios contidos em Acordos, Convenções e Dissídios Coletivos de Trabalho e o disposto no art. 6º da IN 5/2017"]
[null,null,null,"QUADRO-RESUMO DO MÓDULO 2"]
[null,null,null,"2.1 - 13º Salário, Férias e Adicional de Férias - 13º Destacado - Calculado no Módulo 7 ",{"$f":"SUM(E20:E21)","v":3.03030303030303E-2},{"$f":"F20+F21","v":314.14999999999998}]
[null,null,null,"2.2 - Encargos Previdenciários (GPS), Fundo de Garantia por Tempo de Serviço (FGTS) e Contribuições",{"$f":"SUM(E24:E32)","v":0.34800000000000003},{"$f":"SUM(F24:F32)","v":4117.2599999999984}]
[null,null,null,"2.3 - Benefícios Mensais e Diários",null,{"$f":"SUM(F35:F38)","v":1020.28}]
[]
[null,null,null,"TOTAL DOS ENCARGOS E BENEFÍCIOS",null,{"$f":"SUM(F41:F43)","v":5451.6899999999978}]
[]
[null,"MÓDULO 3 - PREVISÃO PARA RESCISÃO",null,null,"Percentuais","Valor"]
[null,null,"A","Aviso Prévio Indenizado (Art. 7º, inciso XXI, da CF/1988 e arts. 477, 487, §1º, e 491 da CLT)",{"$f":"'Encargos Sociais'!E35","v":8.3333333333333332E-3},{"$f":"ROUND(E48*($F$16+$F$59),2)","v":94.24}]
[null,null,"B","Incidência do FGTS sobre o Aviso Prévio Indenizado (Súmula 305 TST)",{"$f":"'Encargos Sociais'!E36","v":6.6666666666666664E-4},{"$f":"ROUND(E49*($F$16+$F$59),2)","v":7.54},null,"* Nota 1 - Adotou-se os parâmetros do estudo do STF (http://www.stf.jus.br/arquivo/cms/sobrestfestudosci/anexo/encargos_sociais_03102007.pdf), onde 5% do pessoal é demitido pelo empregador no decurso do contrato (para estes, considerou-se o aviso prévio indenizado). Desprezou-se as demissões por justa causa e os pedidos de demissão."]
[null,null,"C","Multa do FGTS e Contribuição Social sobre o Aviso Prévio Indenizado (Art. 18, §1º, da Lei 8.036/1990 e art. 1º da LC nº 110/2001)",{"$f":"'Encargos Sociais'!E37","v":7.7170666666666644E-3},87.28,null,"* Nota 2 - No cálculo do percentual, considerou-se 36 dias, correspondendo à metade da duração média dos contratos (2 anos)"]
[null,null,"D","Aviso Prévio Trabalhado (Art. 488, parágrafo único, CLT)",{"$f":"'Encargos Sociais'!E38","v":1.2037037037037035E-2},136.13,null,"* Nota 3 - Incide sobre a Remuneração + 13º salário (1/12) + Férias (1/12) + Adicional de Férias (1/36) x 50% multa (40% para o empregado e 10% de contribuição social) x 8% FGTS"]
[null,null,"E","Incidência de GPS, FGTS e outras contribuições sobre o Aviso Prévio Trabalhado",{"$f":"'Encargos Sociais'!E39","v":4.1888888888888878E-3},47.37,null,"* Nota 4 - Os 95% restantes do cálculo, a um prazo médio de contrato de 4 anos. Assim, calcula-se 7 dias para o 1º ano de contrato e mais 3 dias para os 3 anos seguintes."]
[null,null,"F","Multa do FGTS e Contribuição Social sobre o Aviso Prévio Trabalhado",{"$f":"'Encargos Sociais'!E40","v":3.0505155555555549E-2},344.99]
[]
[null,null,null,"TOTAL DE PREVISÃO PARA RESCISÃO",null,{"$f":"SUM(F48:F53)","v":717.55}]
[]
[null,"MÓDULO 4 - CUSTO DO PROFISSIONAL AUSENTE",null,null,"Percentuais","Valor"]
[null,"Submódulo 4.1 - Ausências Legais"]
[null,null,"A","Férias (Arts. 129 e 130, inc. I, da CLT)",{"$f":"'Encargos Sociais'!E24","v":9.0909090909090912E-2},{"$f":"ROUND(E59*$F$16,2)","v":942.45},null,"* Nota 1 - As alíneas “A” a “F” referem-se somente ao custo que será pago ao repositor pelos dias \ntrabalhados quando da necessidade de substituir a mão de obra alocada na prestação do serviço."]
[null,null,"B","Ausências Legais (Arts. 131 e 473 da CLT)",{"$f":"'Encargos Sociais'!E25","v":7.9365079365079361E-3},82.28,null,"* Nota 2 - Adotou-se a estimativa do SINAPI de 2 dias por ano."]
[null,null,"C","Licença-Paternidade (Art. 7º, XIX, e art. 10, §1º, do ADCT, CF/1988 e Art. 1º, II, da Lei 11.770/2008)",{"$f":"'Encargos Sociais'!E26","v":8.2777777777777776E-4},8.58,null,"* Nota 3 - Utilizada a proporção de 50% para homens, 5 dias de afastamento, e a probabilidade de um trabalhador requerer a Licença Paternidade em 5,22%, conforme SINAPI (citando dados da PNAD 2015)"]
[null,null,"D","Ausência por Acidente de Trabalho (Art. 131, III, da CLT)",{"$f":"'Encargos Sociais'!E27","v":8.541666666666667E-4},8.86,null,"* Nota 4 - Utilzada a estatística de 1,96% dos contribuintes beneficiados com a emissão do auxílio, conforme Anuário Estatístico da Previdência Social. Afastamento de 15 dias a cargo da empresa."]
[null,null,"E","Afastamento Maternidade (Art. 71 da Lei nº 8.213/1991)",{"$f":"'Encargos Sociais'!E28","v":3.2925925925925922E-3},34.130000000000003,null,"* Nota 5 - Utilizada a proporção de 50% para mulheres, 180 dias de afastamento, e a probabilidade de uma trabalhadora requerer a Licença Maternidade em 4,91%, conforme SINAPI (citando dados do IBGE 2016)"]
[null,null,"F","Auxílio Enfermidade - Doença (Art. 59 da Lei nº 8.213/1991)",{"$f":"'Encargos Sociais'!E29","v":7.1222222222222225E-3},73.84,null,"* Nota 6 - Utilizada a estatística de 3,37% dos contribuintes beneficiados com o auxílio, conforme Anuário Estatístico da Previdência Social de 2015 (acrescidos de 2 dias ao ano, para os quais o trabalhador nem requer o benefício da Previdência - conforme SINAPI)"]
[]
[null,"Submódulo 4.2 - Intrajornada"]
[null,null,"A","Intervalo para repouso ou alimentação",{"$f":"'Encargos Sociais'!E32","v":0},{"$f":"ROUND(E67*$F$16,2)","v":0}]
[]
[null,null,null,"QUADRO-RESUMO DO MÓDULO 4",null,"Valor"]
[null,null,null,"4.1 - Ausências Legais",{"$f":"SUM(E59:E64)","v":0.11094235810485811},{"$f":"ROUND(E70*$F$16,2)","v":1150.1300000000001}]
[null,null,null,"4.2 - Intrajornada",{"$f":"E67","v":0},{"$f":"ROUND(E71*$F$16,2)","v":0}]
[]
[null,null,null,"TOTAL DE PREVISÃO PARA RESCISÃO E INTERVALO INTRAJORNADA",null,{"$f":"SUM(F70:F71)","v":1150.1300000000001}]
[]
[null,"MÓDULO 5 - INSUMOS DIVERSOS",null,null,null,"Valor"]
[null,null,"A","Uniformes - aquisição",null,{"$f":"ROUND(HLOOKUP($B$5,Uniformes!K6:DZ172,3)/12,2)","v":0}]
[null,null,"B","Materiais de consumo relacionados ao posto - aquisição",null,{"$f":"ROUND(HLOOKUP(B5,'Mat Cons'!I11:DX13,3)/12,2)","v":0}]
[null,null,"C","Materiais permanentes relacionados ao posto - remuneração da sua depreciação / manutenção",null,{"$f":"HLOOKUP(B5,'Mat Perm'!Q11:EF13,3)","v":0}]
[null,null,"D","Equipamentos relacionados ao posto - remuneração da sua depreciação / manutenção",null,{"$f":"HLOOKUP(B5,'Equip Rel'!Q11:EF13,3)","v":0}]
[null,null,"E","Equipamentos de Proteção Individual - EPI - aquisição",null,{"$f":"ROUND(HLOOKUP(B5,EPI!I3:DX37,3)/12,2)","v":0}]
[]
[null,null,null,"TOTAL DE INSUMOS DIVERSOS",null,{"$f":"SUM(F76:F81)","v":0},null,"* Nota - Valores mensais por empregado"]
[]
[null,"MÓDULO 6 - CUSTOS INDIRETOS, TRIBUTOS E LUCRO - BDI",null,null,"Percentuais","Valor"]
[null,null,"A","Custos Indiretos",{"$f":"BDI!E6","v":5.8400000000000001E-2}]
[null,null,"A.1","Administração Central",{"$f":"BDI!E7","v":2.1600000000000001E-2}]
[null,null,"A.2","Seguros, Garantias e Riscos",{"$f":"BDI!E8","v":3.6799999999999999E-2}]
[null,null,"B","Lucro",{"$f":"BDI!E10","v":3.3399999999999999E-2}]
[null,null,"C","Tributos",{"$f":"SUM(E90:E91)","v":0.124}]
[null,null,"C.1","Tributos Federais (COFINS, PIS e CPRB)",{"$f":"BDI!E18","v":7.3999999999999996E-2}]
[null,null,"C.2","Tributos Distritais (ISS)",{"$f":"BDI!E23","v":0.05},null,null,"* Nota - Utilizou-se o indicado pelo Sindicato da Arquitetura e da Engenharia (Sinaenco, 2008, p. 22), que adota um percentual redutor de 20% no cálculo dos custos tributários relativos às contribuições PIS e COFINS"]
[null,null,"D","Despesas Financeiras",{"$f":"BDI!E13","v":5.2519605742542552E-3}]
[]
[null,null,null,"TOTAL DE BDI",{"$f":"BDI!E26","v":0.25509999999999999},{"$f":"E94*E102","v":4511.7725789999995}]
[]
[null,null,null,"QUADRO-RESUMO DO CUSTO MENSAL POR EMPREGADO - SEM O 13º","Valor"]
[null,null,null,"Módulo 1 - Composição da Remuneração",{"$f":"F16","v":10366.92}]
[null,null,null,"Módulo 2 - Encargos e Benefícios Anuais, Mensais e Diários",{"$f":"F45","v":5451.6899999999978}]
[null,null,null,"Módulo 3 - Provisão para Rescisão",{"$f":"F55","v":717.55}]
[null,null,null,"Módulo 4 - Custo de Reposição do Profissional Ausente",{"$f":"F73","v":1150.1300000000001}]
[null,null,null,"Módulo 5 - Insumos Diversos",{"$f":"F82","v":0}]
[null,null,null,"SUBTOTAL (A+B+C+D+E)",{"$f":"SUM(E97:E101)","v":17686.289999999997}]
[null,null,null,"Módulo 6 - Custos Indiretos, Tributos e Lucro",{"$f":"F94","v":4511.7725789999995}]
[]
[null,null,null,"TOTAL DO POSTO",{"$f":"SUM(E102:E103)","v":22198.062578999998}]
[]
[null,"MÓDULO 7 - DESTAQUE DO MÓDULO 2 - 13º SALÁRIO",null,null,"Percentuais","Valor"]
[null,null,"A","13º Salário",{"$f":"'Encargos Sociais'!E31","v":8.3333333333333329E-2},{"$f":"ROUND(E108*F$16,2)","v":863.91}]
[null,null,"B","Encargos Sociais sobre o 13º Salário - Taxa calculada no SUBMÓDULO 2.2",{"$f":"SUM($E$24:$E$32)","v":0.34800000000000003},{"$f":"ROUND(E109*$F$108,2)","v":300.64},null,"* Nota 1 - Provisiona-se, mensalmente, o proporcional a 1/12 dos valores referentes a gratificação natalina e adicional de férias."]
[null,null,"C","Reincidência de férias sobre o 13º Salário",{"$f":"E59","v":9.0909090909090912E-2},{"$f":"ROUND(E110*$F$108,2)","v":78.540000000000006}]
[null,null,"D","BDI sobre o 13º Salário - Taxa calculada no MÓDULO 6",{"$f":"E94","v":0.25509999999999999},{"$f":"ROUND(E111*($F$108+$F$109),2)","v":297.08}]
[]
[null,null,null,"TOTAL DO DESTAQUE DO 13º SALÁRIO",null,{"$f":"SUM(F108:F111)","v":1540.1699999999998}]
[]
[null,null,null,"QUADRO-RESUMO DO CUSTO MENSAL POR EMPREGADO","Valor"]
[null,null,null,"Custo total - sem o 13º Salário",{"$f":"E105","v":22198.062578999998}]
[null,null,null,"Destaque do 13º Salário (valor mensal)",{"$f":"F113","v":1540.1699999999998}]
[]
[null,null,null,"TOTAL DO POSTO",{"$f":"E116+E117","v":23738.232578999996}]

{"sheet":"12","index":15,"n_rows":119,"n_cols":8,"rows_kept":119,"cut":false,"hidden":false,"merged":[[106,1,106,3],[39,3,39,5],[46,1,46,3],[56,1,56,3],[68,3,68,5],[74,1,74,3],[83,1,83,3],[17,1,17,3],[1,1,1,5],[2,1,2,5],[4,1,4,2],[5,1,5,2],[7,1,7,3]]}
[]
[null,"PLANILHA DE ESTIMATIVA DE CUSTOS"]
[null,"Padrão IN 05/2017 e IN 07/2018 - MPDG"]
[]
[null,12,null,{"$f":"HLOOKUP($B$5,'Dados Gerais'!$D$5:$BK$20,6)","v":"SUPERVISOR TÉCNICO"},"QUANTIDADE",{"$f":"HLOOKUP($B$5,'Dados Gerais'!$D$5:$BK$20,10)","v":3}]
[null,"CCT",null,{"$f":"HLOOKUP($B$5,'Dados Gerais'!$D$5:$BK$20,15)","v":"SINDPD/DF X SINDESEI/DF 2021/2022 Nº DF000608/2021"},"DATA-BASE",{"$f":"'Dados Gerais'!F20","v":"2021-05-01"}]
[]
[null,"MÓDULO 1 - COMPOSIÇÃO DA REMUNERAÇÃO",null,null,null,"Valor"]
[null,null,"A","Salário-Base",null,{"$f":"HLOOKUP($B$5,'Dados Gerais'!$D$5:$BK$20,8)","v":13944.34}]
[null,null,"B","Adicional de Periculosidade",null,{"$f":"HLOOKUP($B$5,'Dados Gerais'!$D$5:$BK$37,25)","v":0}]
[null,null,"C","Adicional de Insalubridade",null,{"$f":"HLOOKUP($B$5,'Dados Gerais'!$D$5:$BK$37,31)","v":0}]
[null,null,"D","Adicional Noturno",null,{"$f":"HLOOKUP($B$5,'Dados Gerais'!$D$5:$BK$50,46)","v":0},null,"* Nota 1 - O Módulo 1 refere-se ao valor mensal devido ao empregado pela prestação do serviço no período de 12 meses."]
[null,null,"E","Adicional de Hora Extra",null,{"$f":"HLOOKUP($B$5,'Dados Gerais'!$D$5:$BK$67,63)","v":0},null,"* Nota 2 - O adicional de hora extra no feriado trabalhado foi suprimido pela Lei 13.467/17"]
[null,null,"F","Outros (especificar)",null,{"$f":"HLOOKUP($B$5,'Dados Gerais'!$D$5:$BK$59,33)","v":0},null,"* Nota 3 - ART. 7º, § 2º, DA LEI Nº 605/49.Sendo mensalista o obreiro, o adicional noturno pago de forma fixa já é considerado integrado para os efeitos do pagamento do repouso semanal remunerado, nos termos do art. 7º, § 2º, da Lei nº 605/49."]
[]
[null,null,null,"TOTAL DA REMUNERAÇÃO",null,{"$f":"SUM(F9:F14)","v":13944.34}]
[]
[null,"MÓDULO 2 - ENCARGOS E BENEFÍCIOS ANUAIS, MENSAIS E DIÁRIOS",null,null,"Percentuais","Valor"]
[null,"Submódulo 2.1 - 13º Salário, Férias e Adicional de Férias"]
[null,null,"A","13º Salário - Calculado no Módulo 7 - Destacado",0,{"$f":"ROUND(E20*F$16,2)","v":0},null,"* Nota 1 - Provisiona-se, mensalmente, o proporcional a 1/11 dos valores referentes a gratificação natalina, férias e adicional de férias."]
[null,null,"B","Adicional de Férias",{"$f":"'Encargos Sociais'!E30","v":3.03030303030303E-2},{"$f":"ROUND(E21*F$16,2)","v":422.56},null,"* Nota 2 - O adicional de férias contido no Submódulo 2.1 corresponde a 1/3 da remuneração que, por sua vez, é dividida por 11 contome Nota 1."]
[]
[null,"Submódulo 2.2 - Encargos Previdenciários (GPS), Fundo de Garantia por Tempo de Serviço (FGTS) e Outras Contribuições"]
[null,null,"A","INSS (art. 22, inciso I, Lei nº 8.212/91)",{"$f":"'Encargos Sociais'!E13","v":0.2},{"$f":"ROUND(E24*($F$16+$F$41+$F$73),2)","v":3182.78}]
[null,null,"B","Salário Educação (art. 3º, inciso I, Decreto nº 87.043/82)",{"$f":"'Encargos Sociais'!E14","v":2.5000000000000001E-2},{"$f":"ROUND(E25*($F$16+$F$41+$F$73),2)","v":397.85}]
[null,null,"C","SAT/RAT (art. 22, II, Lei 8.212/91 e Anexo V, Decreto 6.042/07) - Enquadramento 8211-3/00",{"$f":"'Encargos Sociais'!E15","v":0.01},159.13999999999999]
[null,null,"D","SESC ou SESI (art. 30, Lei nº 8.036/90 e art. 1º, Lei 8.154/90)",{"$f":"'Encargos Sociais'!E16","v":1.4999999999999999E-2},238.71]
[null,null,"E","SENAI ou SENAC (Decreto nº 2.318/86)",{"$f":"'Encargos Sociais'!E17","v":0.01},159.13999999999999]
[null,null,"F","SEBRAE (§ 3º, art. 8º, Lei 8.029/90, alterada pela Lei nº 8.154/90)",{"$f":"'Encargos Sociais'!E18","v":6.0000000000000001E-3},95.48]
[null,null,"G","INCRA (art. 1º, I, Decreto Lei 1.146/70 e Lei 7.787, de 30/06/89)",{"$f":"'Encargos Sociais'!E19","v":2E-3},31.83,null,"* Nota 1 - Os percentuais dos encargos previdenciários, do FGTS e demais contribuições são estabelecidos por legislação vigente."]
[null,null,"H","FGTS (Lei Complementar nº 110/01 e art. 30, Lei nº 8.036/90)",{"$f":"'Encargos Sociais'!E20","v":0.08},1273.1099999999999,null,"* Nota 2 - O SAT, a depender do grau de risco do serviço, irá variar entre 1%, para risco leve, de 2%, para risco médio, e de 3% para risco grave."]
[null,null,"I","SECONCI (Convenções Coletivas de Trabalho da construção)",{"$f":"'Encargos Sociais'!E21","v":0},0,null,"* Nota 3 - Os percentuais do Submódulo 2.2 incidem sobre o Módulo 1 e o Submódulo 2.1."]
[]
[null,"Submódulo 2.3 - Benefícios Mensais e Diários"]
[null,null,"A","Auxílio Transporte",null,{"$f":"HLOOKUP($B$5,'Dados Gerais'!$D$5:$BK$93,82)","v":0}]
[null,null,"B","Auxílio Alimentação",null,{"$f":"HLOOKUP($B$5,'Dados Gerais'!$D$5:$BK$93,89)","v":770}]
[null,null,"C","Assistência Médica e Familiar",null,{"$f":"HLOOKUP($B$5,'Dados Gerais'!$D$5:$BK$101,97)","v":237.92}]
[null,null,"D","Outros (Seguro de vida e auxílio funeral e auxílio odontológico)",null,{"$f":"HLOOKUP($B$5,'Dados Gerais'!$D$5:$BK$118,114)","v":12.36},null,"* Nota 1 - O valor informado deverá ser o custo real do benefício (descontado o valor eventualmente pago pelo empregado)."]
[null,null,null,null,null,null,null,"* Nota 2 - Observar a previsão dos benefícios contidos em Acordos, Convenções e Dissídios Coletivos de Trabalho e o disposto no art. 6º da IN 5/2017"]
[null,null,null,"QUADRO-RESUMO DO MÓDULO 2"]
[null,null,null,"2.1 - 13º Salário, Férias e Adicional de Férias - 13º Destacado - Calculado no Módulo 7 ",{"$f":"SUM(E20:E21)","v":3.03030303030303E-2},{"$f":"F20+F21","v":422.56}]
[null,null,null,"2.2 - Encargos Previdenciários (GPS), Fundo de Garantia por Tempo de Serviço (FGTS) e Contribuições",{"$f":"SUM(E24:E32)","v":0.34800000000000003},{"$f":"SUM(F24:F32)","v":5538.0399999999991}]
[null,null,null,"2.3 - Benefícios Mensais e Diários",null,{"$f":"SUM(F35:F38)","v":1020.28}]
[]
[null,null,null,"TOTAL DOS ENCARGOS E BENEFÍCIOS",null,{"$f":"SUM(F41:F43)","v":6980.8799999999992}]
[]
[null,"MÓDULO 3 - PREVISÃO PARA RESCISÃO",null,null,"Percentuais","Valor"]
[null,null,"A","Aviso Prévio Indenizado (Art. 7º, inciso XXI, da CF/1988 e arts. 477, 487, §1º, e 491 da CLT)",{"$f":"'Encargos Sociais'!E35","v":8.3333333333333332E-3},{"$f":"ROUND(E48*($F$16+$F$59),2)","v":126.77}]
[null,null,"B","Incidência do FGTS sobre o Aviso Prévio Indenizado (Súmula 305 TST)",{"$f":"'Encargos Sociais'!E36","v":6.6666666666666664E-4},{"$f":"ROUND(E49*($F$16+$F$59),2)","v":10.14},null,"* Nota 1 - Adotou-se os parâmetros do estudo do STF (http://www.stf.jus.br/arquivo/cms/sobrestfestudosci/anexo/encargos_sociais_03102007.pdf), onde 5% do pessoal é demitido pelo empregador no decurso do contrato (para estes, considerou-se o aviso prévio indenizado). Desprezou-se as demissões por justa causa e os pedidos de demissão."]
[null,null,"C","Multa do FGTS e Contribuição Social sobre o Aviso Prévio Indenizado (Art. 18, §1º, da Lei 8.036/1990 e art. 1º da LC nº 110/2001)",{"$f":"'Encargos Sociais'!E37","v":7.7170666666666644E-3},117.39,null,"* Nota 2 - No cálculo do percentual, considerou-se 36 dias, correspondendo à metade da duração média dos contratos (2 anos)"]
[null,null,"D","Aviso Prévio Trabalhado (Art. 488, parágrafo único, CLT)",{"$f":"'Encargos Sociais'!E38","v":1.2037037037037035E-2},183.11,null,"* Nota 3 - Incide sobre a Remuneração + 13º salário (1/12) + Férias (1/12) + Adicional de Férias (1/36) x 50% multa (40% para o empregado e 10% de contribuição social) x 8% FGTS"]
[null,null,"E","Incidência de GPS, FGTS e outras contribuições sobre o Aviso Prévio Trabalhado",{"$f":"'Encargos Sociais'!E39","v":4.1888888888888878E-3},63.72,null,"* Nota 4 - Os 95% restantes do cálculo, a um prazo médio de contrato de 4 anos. Assim, calcula-se 7 dias para o 1º ano de contrato e mais 3 dias para os 3 anos seguintes."]
[null,null,"F","Multa do FGTS e Contribuição Social sobre o Aviso Prévio Trabalhado",{"$f":"'Encargos Sociais'!E40","v":3.0505155555555549E-2},464.04]
[]
[null,null,null,"TOTAL DE PREVISÃO PARA RESCISÃO",null,{"$f":"SUM(F48:F53)","v":965.17000000000007}]
[]
[null,"MÓDULO 4 - CUSTO DO PROFISSIONAL AUSENTE",null,null,"Percentuais","Valor"]
[null,"Submódulo 4.1 - Ausências Legais"]
[null,null,"A","Férias (Arts. 129 e 130, inc. I, da CLT)",{"$f":"'Encargos Sociais'!E24","v":9.0909090909090912E-2},{"$f":"ROUND(E59*$F$16,2)","v":1267.67},null,"* Nota 1 - As alíneas “A” a “F” referem-se somente ao custo que será pago ao repositor pelos dias \ntrabalhados quando da necessidade de substituir a mão de obra alocada na prestação do serviço."]
[null,null,"B","Ausências Legais (Arts. 131 e 473 da CLT)",{"$f":"'Encargos Sociais'!E25","v":7.9365079365079361E-3},110.67,null,"* Nota 2 - Adotou-se a estimativa do SINAPI de 2 dias por ano."]
[null,null,"C","Licença-Paternidade (Art. 7º, XIX, e art. 10, §1º, do ADCT, CF/1988 e Art. 1º, II, da Lei 11.770/2008)",{"$f":"'Encargos Sociais'!E26","v":8.2777777777777776E-4},11.54,null,"* Nota 3 - Utilizada a proporção de 50% para homens, 5 dias de afastamento, e a probabilidade de um trabalhador requerer a Licença Paternidade em 5,22%, conforme SINAPI (citando dados da PNAD 2015)"]
[null,null,"D","Ausência por Acidente de Trabalho (Art. 131, III, da CLT)",{"$f":"'Encargos Sociais'!E27","v":8.541666666666667E-4},11.91,null,"* Nota 4 - Utilzada a estatística de 1,96% dos contribuintes beneficiados com a emissão do auxílio, conforme Anuário Estatístico da Previdência Social. Afastamento de 15 dias a cargo da empresa."]
[null,null,"E","Afastamento Maternidade (Art. 71 da Lei nº 8.213/1991)",{"$f":"'Encargos Sociais'!E28","v":3.2925925925925922E-3},45.91,null,"* Nota 5 - Utilizada a proporção de 50% para mulheres, 180 dias de afastamento, e a probabilidade de uma trabalhadora requerer a Licença Maternidade em 4,91%, conforme SINAPI (citando dados do IBGE 2016)"]
[null,null,"F","Auxílio Enfermidade - Doença (Art. 59 da Lei nº 8.213/1991)",{"$f":"'Encargos Sociais'!E29","v":7.1222222222222225E-3},99.31,null,"* Nota 6 - Utilizada a estatística de 3,37% dos contribuintes beneficiados com o auxílio, conforme Anuário Estatístico da Previdência Social de 2015 (acrescidos de 2 dias ao ano, para os quais o trabalhador nem requer o benefício da Previdência - conforme SINAPI)"]
[]
[null,"Submódulo 4.2 - Intrajornada"]
[null,null,"A","Intervalo para repouso ou alimentação",{"$f":"'Encargos Sociais'!E32","v":0},{"$f":"ROUND(E67*$F$16,2)","v":0}]
[]
[null,null,null,"QUADRO-RESUMO DO MÓDULO 4",null,"Valor"]
[null,null,null,"4.1 - Ausências Legais",{"$f":"SUM(E59:E64)","v":0.11094235810485811},{"$f":"ROUND(E70*$F$16,2)","v":1547.02}]
[null,null,null,"4.2 - Intrajornada",{"$f":"E67","v":0},{"$f":"ROUND(E71*$F$16,2)","v":0}]
[]
[null,null,null,"TOTAL DE PREVISÃO PARA RESCISÃO E INTERVALO INTRAJORNADA",null,{"$f":"SUM(F70:F71)","v":1547.02}]
[]
[null,"MÓDULO 5 - INSUMOS DIVERSOS",null,null,null,"Valor"]
[null,null,"A","Uniformes - aquisição",null,{"$f":"ROUND(HLOOKUP($B$5,Uniformes!K6:DZ172,3)/12,2)","v":0}]
[null,null,"B","Materiais de consumo relacionados ao posto - aquisição",null,{"$f":"ROUND(HLOOKUP(B5,'Mat Cons'!I11:DX13,3)/12,2)","v":0}]
[null,null,"C","Materiais permanentes relacionados ao posto - remuneração da sua depreciação / manutenção",null,{"$f":"HLOOKUP(B5,'Mat Perm'!Q11:EF13,3)","v":0}]
[null,null,"D","Equipamentos relacionados ao posto - remuneração da sua depreciação / manutenção",null,{"$f":"HLOOKUP(B5,'Equip Rel'!Q11:EF13,3)","v":0}]
[null,null,"E","Equipamentos de Proteção Individual - EPI - aquisição",null,{"$f":"ROUND(HLOOKUP(B5,EPI!I3:DX37,3)/12,2)","v":0}]
[]
[null,null,null,"TOTAL DE INSUMOS DIVERSOS",null,{"$f":"SUM(F76:F81)","v":0},null,"* Nota - Valores mensais por empregado"]
[]
[null,"MÓDULO 6 - CUSTOS INDIRETOS, TRIBUTOS E LUCRO - BDI",null,null,"Percentuais","Valor"]
[null,null,"A","Custos Indiretos",{"$f":"BDI!E6","v":5.8400000000000001E-2}]
[null,null,"A.1","Administração Central",{"$f":"BDI!E7","v":2.1600000000000001E-2}]
[null,null,"A.2","Seguros, Garantias e Riscos",{"$f":"BDI!E8","v":3.6799999999999999E-2}]
[null,null,"B","Lucro",{"$f":"BDI!E10","v":3.3399999999999999E-2}]
[null,null,"C","Tributos",{"$f":"SUM(E90:E91)","v":0.124}]
[null,null,"C.1","Tributos Federais (COFINS, PIS e CPRB)",{"$f":"BDI!E18","v":7.3999999999999996E-2}]
[null,null,"C.2","Tributos Distritais (ISS)",{"$f":"BDI!E23","v":0.05},null,null,"* Nota - Utilizou-se o indicado pelo Sindicato da Arquitetura e da Engenharia (Sinaenco, 2008, p. 22), que adota um percentual redutor de 20% no cálculo dos custos tributários relativos às contribuições PIS e COFINS"]
[null,null,"D","Despesas Financeiras",{"$f":"BDI!E13","v":5.2519605742542552E-3}]
[]
[null,null,null,"TOTAL DE BDI",{"$f":"BDI!E26","v":0.25509999999999999},{"$f":"E94*E102","v":5978.8832910000001}]
[]
[null,null,null,"QUADRO-RESUMO DO CUSTO MENSAL POR EMPREGADO - SEM O 13º","Valor"]
[null,null,null,"Módulo 1 - Composição da Remuneração",{"$f":"F16","v":13944.34}]
[null,null,null,"Módulo 2 - Encargos e Benefícios Anuais, Mensais e Diários",{"$f":"F45","v":6980.8799999999992}]
[null,null,null,"Módulo 3 - Provisão para Rescisão",{"$f":"F55","v":965.17000000000007}]
[null,null,null,"Módulo 4 - Custo de Reposição do Profissional Ausente",{"$f":"F73","v":1547.02}]
[null,null,null,"Módulo 5 - Insumos Diversos",{"$f":"F82","v":0}]
[null,null,null,"SUBTOTAL (A+B+C+D+E)",{"$f":"SUM(E97:E101)","v":23437.41}]
[null,null,null,"Módulo 6 - Custos Indiretos, Tributos e Lucro",{"$f":"F94","v":5978.8832910000001}]
[]
[null,null,null,"TOTAL DO POSTO",{"$f":"SUM(E102:E103)","v":29416.293291000002}]
[]
[null,"MÓDULO 7 - DESTAQUE DO MÓDULO 2 - 13º SALÁRIO",null,null,"Percentuais","Valor"]
[null,null,"A","13º Salário",{"$f":"'Encargos Sociais'!E31","v":8.3333333333333329E-2},{"$f":"ROUND(E108*F$16,2)","v":1162.03}]
[null,null,"B","Encargos Sociais sobre o 13º Salário - Taxa calculada no SUBMÓDULO 2.2",{"$f":"SUM($E$24:$E$32)","v":0.34800000000000003},{"$f":"ROUND(E109*$F$108,2)","v":404.39},null,"* Nota 1 - Provisiona-se, mensalmente, o proporcional a 1/12 dos valores referentes a gratificação natalina e adicional de férias."]
[null,null,"C","Reincidência de férias sobre o 13º Salário",{"$f":"E59","v":9.0909090909090912E-2},{"$f":"ROUND(E110*$F$108,2)","v":105.64}]
[null,null,"D","BDI sobre o 13º Salário - Taxa calculada no MÓDULO 6",{"$f":"E94","v":0.25509999999999999},{"$f":"ROUND(E111*($F$108+$F$109),2)","v":399.59}]
[]
[null,null,null,"TOTAL DO DESTAQUE DO 13º SALÁRIO",null,{"$f":"SUM(F108:F111)","v":2071.65}]
[]
[null,null,null,"QUADRO-RESUMO DO CUSTO MENSAL POR EMPREGADO","Valor"]
[null,null,null,"Custo total - sem o 13º Salário",{"$f":"E105","v":29416.293291000002}]
[null,null,null,"Destaque do 13º Salário (valor mensal)",{"$f":"F113","v":2071.65}]
[]
[null,null,null,"TOTAL DO POSTO",{"$f":"E116+E117","v":31487.943291000003}]

{"sheet":"Dados Gerais","index":16,"n_rows":118,"n_cols":63,"rows_kept":118,"cut":false,"hidden":false,"merged":[[2,1,2,2]]}
[]
[]
[null,"INFORMAÇÕES DE ENTRADA"]
[]
[null,null,null,1,2,3,4,5,6,7,8,9,10,11,12,13,14,15,16,17,18,19,20,21,22,23,24,25,26,27,28,29,30,31,32,33,34,35,36,37,38,39,40,41,42,43,44,45,46,47,48,49,50,51,52,53,54,55,56,57,58,59,60]
[null,"",null,"CARGO 1","CARGO 2","CARGO 3","CARGO 4","CARGO 5","CARGO 6","CARGO 7","CARGO 8","CARGO 9","CARGO 10","CARGO 11","CARGO 12","CARGO 13","CARGO 14","CARGO 15","CARGO 16","CARGO 17","CARGO 18","CARGO 19","CARGO 20","CARGO 21","CARGO 22","CARGO 23","CARGO 24","CARGO 25","CARGO 26","CARGO 27","CARGO 28","CARGO 29","CARGO 30","CARGO 31","CARGO 32","CARGO 33","CARGO 34","CARGO 35","CARGO 36","CARGO 37","CARGO 38","CARGO 39","CARGO 40","CARGO 41","CARGO 42","CARGO 43","CARGO 44","CARGO 45","CARGO 46","CARGO 47","CARGO 48","CARGO 49","CARGO 50","CARGO 51","CARGO 52","CARGO 53","CARGO 54","CARGO 55","CARGO 56","CARGO 57","CARGO 58","CARGO 59","CARGO 60"]
[null,"INFORMAÇÕES BÁSICAS"]
[]
[null,"DESCRIÇÃO DOS POSTOS DE SERVIÇO"]
[null,null,null,"TÉCNICO DE APOIO A OPERAÇÕES EM DATA CENTER (JORNADAS DE 7 ÀS 13H E DE 13 ÀS 19H)","TÉCNICO DE APOIO A OPERAÇÕES EM DATA CENTER (JORNADA DAS 19 À 1H)","TÉCNICO DE APOIO A OPERAÇÕES EM DATA CENTER (JORNADA DA 1H ÀS 7H)","TÉCNICO DE APOIO AO MONITORAMENTO DA INFRAESTRUTURA (JORNADAS DE 7 ÀS 13H E DE 13 ÀS 19H)","TÉCNICO DE APOIO AO MONITORAMENTO DA INFRAESTRUTURA (JORNADA DAS 19 À 1H)","TÉCNICO DE APOIO AO MONITORAMENTO DA INFRAESTRUTURA (JORNADA DA 1H ÀS 7H)","TÉCNICO INSTALADOR DE CABEAMENTO","TÉCNICO DE MANUTENÇÃO DE INFRAESTRUTURA DE REDE","ANALISTA DE INFRAESTRUTURA DE TI PLENO","ANALISTA DE INFRAESTRUTURA DE TI SÊNIOR","ANALISTA DE INFRAESTRUTURA DE TI MASTER","SUPERVISOR TÉCNICO"]
[null,"REMUNERAÇÕES"]
[null,null,null,2627.81,2627.81,2627.81,2627.81,2627.81,2627.81,2314.46,3130.93,6192.84,8113.11,10366.92,13944.34]
[null,"QUANTIDADE DE POSTOS"]
[null,null,null,6,3,3,6,3,3,7,8,6,26,26,3]
[null,"JORNADA"]
[null,null,"HORAS",180,180,180,180,180,180,{"$f":"44*5","v":220},220,220,220,220,220]
[null,null,"DIAS/MÊS",26,26,26,26,26,26,22,22,22,22,22,22]
[null,"CCT UTILIZADA"]
[null,null,"SINDICATOS E REFERÊNCIA","SINDPD/DF X SINDESEI/DF 2021/2022 Nº DF000608/2021","SINDPD/DF X SINDESEI/DF 2021/2022 Nº DF000608/2021","SINDPD/DF X SINDESEI/DF 2021/2022 Nº DF000608/2021","SINDPD/DF X SINDESEI/DF 2021/2022 Nº DF000608/2021","SINDPD/DF X SINDESEI/DF 2021/2022 Nº DF000608/2021","SINDPD/DF X SINDESEI/DF 2021/2022 Nº DF000608/2021","SINDPD/DF X SINDESEI/DF 2021/2022 Nº DF000608/2021","SINDPD/DF X SINDESEI/DF 2021/2022 Nº DF000608/2021","SINDPD/DF X SINDESEI/DF 2021/2022 Nº DF000608/2021","SINDPD/DF X SINDESEI/DF 2021/2022 Nº DF000608/2021","SINDPD/DF X SINDESEI/DF 2021/2022 Nº DF000608/2021","SINDPD/DF X SINDESEI/DF 2021/2022 Nº DF000608/2021"]
[null,null,"DATA-BASE","2021-05-01","2021-05-01","2021-05-01","2021-05-01","2021-05-01","2021-05-01","2021-05-01","2021-05-01","2021-05-01","2021-05-01","2021-05-01","2021-05-01"]
[]
[null,"ADICIONAIS LEGAIS E GRATIFICAÇÕES"]
[]
[null,"PERICULOSIDADE (PERCENTUAL)"]
[null,null,null,0,0,0,0,0,0,0,0,0,0,0,0]
[null,"BASE DE CÁLCULO DO ADICIONAL DE PERICULOSIDADE (SALÁRIO BÁSICO)"]
[null,null,null,{"$f":"D12","v":2627.81},{"$f":"E12","v":2627.81},{"$f":"F12","v":2627.81},2386.75,2386.75,2386.75,{"$f":"J12","v":2314.46},{"$f":"K12","v":3130.93},6192.84,8113.11,10366.92,13944.34]
[null,"VALOR MENSAL DO ADICIONAL DE PERICULOSIDADE"]
[null,null,null,{"$f":"ROUND(D25*D12,2)","v":0},{"$f":"ROUND(E25*E12,2)","v":0},{"$f":"ROUND(F25*F12,2)","v":0},0,0,0,{"$f":"ROUND(J25*J12,2)","v":0},{"$f":"ROUND(K25*K12,2)","v":0},0,0,0,0]
[null,"INSALUBRIDADE (PERCENTUAL)"]
[null,null,null,0,0,0,0,0,0,0,0,0,0,0,0]
[null,"BASE DE CÁLCULO DO ADICIONAL DE INSALUBRIDADE (SALÁRIO MÍNIMO LEGAL)"]
[null,null,null,1212,1212,1212,1212,1212,1212,1212,1212,1212,1212,1212,1212]
[null,"VALOR MENSAL DO ADICIONAL DE INSALUBRIDADE"]
[null,null,null,{"$f":"ROUND(D31*D12,2)","v":0},{"$f":"ROUND(E31*E12,2)","v":0},{"$f":"ROUND(F31*F12,2)","v":0},0,0,0,{"$f":"ROUND(J31*J12,2)","v":0},0,0,0,0,0]
[null,"GRATIFICAÇÃO - VALOR MENSAL (R$)"]
[null,null,null,0,0,0,0,0,0,0,0,0,0,0,0]
[]
[null,"ADICIONAL NOTURNO"]
[]
[null,"INCIDÊNCIA (PERCENTUAL)"]
[null,null,null,0.2,0.2,0.2,0.2,0.2,0.2,0.2,0.2,0.2,0.2,0.2,0.2]
[null,"HORAS REAIS POR DIA"]
[null,null,null,0,3,5,0,3,5,0,0,0,0,0,0]
[null,"HORAS FICTAS POR DIA"]
[null,null,null,{"$f":"D44*8/8","v":0},{"$f":"E44*8/8","v":3},{"$f":"F44*8/8","v":5},{"$f":"G44*8/8","v":0},3,{"$f":"I44*8/8","v":5},0,{"$f":"K44*8/8","v":0},0,0,0,0]
[null,"BASE DE CÁLCULO DO ADICIONAL NOTURNO (INCLUINDO ADICIONAIS E GRATIFICAÇÕES)"]
[null,null,null,{"$f":"D12+D29+D35+D37","v":2627.81},2627.81,{"$f":"F12+F29+F35+F37","v":2627.81},{"$f":"G12+G29+G35+G37","v":2627.81},2627.81,2627.81,2314.46,{"$f":"K12+K29+K35+K37","v":3130.93},6192.84,8113.11,10366.92,{"$f":"O12+O29+O35+O37","v":13944.34}]
[null,"VALOR MENSAL DO ADICIONAL NOTURNO (HORA NORMAL + HORA REDUZIDA) - POR POSTO"]
[null,null,null,{"$f":"ROUND(D46*D17*D42*D48/D16,2)","v":0},227.74,{"$f":"ROUND(F46*F17*F42*F48/F16,2)","v":379.57},{"$f":"ROUND(G46*G17*G42*G48/G16,2)","v":0},227.74,379.57,0,{"$f":"ROUND(K46*K17*K42*K48/K16,2)","v":0},0,0,0,{"$f":"ROUND(O46*O17*O42*O48/O16,2)","v":0}]
[]
[null,"ADICIONAL DE HORA EXTRA"]
[]
[null,"INCIDÊNCIA (PERCENTUAL 1)"]
[null,null,null,0.5,0.5,0.5,0.5,0.5,0.5,0.5,0.5,0.5,0.5,0.5,0.5]
[null,"HORAS EXTRAS POR MÊS (PERCENTUAL 1)"]
[null,null,null,0,0,0,0,0,0,0,0,0,0,0,0]
[null,"VALOR MENSAL DO ADICIONAL DE HORAS EXTRAS (PERCENTUAL 1) - POR POSTO"]
[null,null,null,{"$f":"ROUND(D57*D55*D12/D16,2)","v":0},{"$f":"ROUND(E57*E55*E12/E16,2)","v":0},{"$f":"ROUND(F57*F55*F12/F16,2)","v":0},0,0,0,{"$f":"ROUND(J57*J55*J12/J16,2)","v":0},{"$f":"ROUND(K57*K55*K12/K16,2)","v":0},0,0,0,0]
[null,"INCIDÊNCIA (PERCENTUAL 2)"]
[null,null,null,1,1,1,1,1,1,1,1,1,1,1,1]
[null,"HORAS EXTRAS POR MÊS (PERCENTUAL 2)"]
[null,null,null,0,0,0,0,0,0,0,0,0,0,0,0]
[null,"VALOR MENSAL DO ADICIONAL DE HORAS EXTRAS (PERCENTUAL 2) - POR POSTO"]
[null,null,null,{"$f":"ROUND(D63*D61*D12/D16,2)","v":0},{"$f":"ROUND(E63*E61*E12/E16,2)","v":0},{"$f":"ROUND(F63*F61*F12/F16,2)","v":0},0,0,0,{"$f":"ROUND(J63*J61*J12/J16,2)","v":0},{"$f":"ROUND(K63*K61*K12/K16,2)","v":0},0,0,0,0]
[null,"TOTAL MENSAL DOS ADICIONAIS DE HORAS EXTRAS - POR POSTO"]
[null,null,null,{"$f":"D65+D59","v":0},{"$f":"E65+E59","v":0},{"$f":"F65+F59","v":0},0,0,0,{"$f":"J65+J59","v":0},{"$f":"K65+K59","v":0},0,0,0,0]
[]
[null,"BENEFÍCIOS COMUNS - AUXÍLIO TRANSPORTE"]
[]
[null,"DISTRIBUIÇÃO ESTIMADA DE PROCEDÊNCIA"]
[null,null,"Cidade-satélite",0.68,0.68,0.68,0.68,0.68,0.68,0.68,0.68,0.68,0.68,0.68,0.68]
[null,null,"Região do entorno",0.32,0.32,0.32,0.32,0.32,0.32,0.32,0.32,0.32,0.32,0.32,0.32]
[null,null,"Esplanada - apenas para os que vêm do entorno",{"$f":"D73","v":0.32},{"$f":"E73","v":0.32},{"$f":"F73","v":0.32},{"$f":"G73","v":0.32},0.32,{"$f":"I73","v":0.32},0.32,{"$f":"K73","v":0.32},0.32,0.32,0.32,0.32]
[null,"VALORES DOS VALES"]
[null,null,"Cidade-satélite",5.5,5.5,5.5,{"$f":"D76","v":5.5},5.5,5.5,{"$f":"I76","v":5.5},{"$f":"I76","v":5.5},{"$f":"I76","v":5.5},5.5,{"$f":"M76","v":5.5},{"$f":"N76","v":5.5}]
[null,null,"Região do entorno",7.05,7.05,7.05,7.05,7.05,7.05,7.05,7.05,7.05,7.05,7.05,7.05]
[null,null,"Esplanada",2.75,2.75,2.75,2.75,2.75,2.75,2.75,{"$f":"I78","v":2.75},2.75,2.75,2.75,2.75]
[null,"VALOR MENSAL BRUTO DE PAGAMENTO - POR POSTO"]
[null,null,null,{"$f":"ROUND((D72*D76+D73*D77+D74*D78)*2*D17,2)","v":357.55},{"$f":"ROUND((E72*E76+E73*E77+E74*E78)*2*E17,2)","v":357.55},{"$f":"ROUND((F72*F76+F73*F77+F74*F78)*2*F17,2)","v":357.55},{"$f":"ROUND((G72*G76+G73*G77+G74*G78)*2*G17,2)","v":357.55},357.55,{"$f":"ROUND((I72*I76+I73*I77+I74*I78)*2*I17,2)","v":357.55},{"$f":"ROUND((J72*J76+J73*J77+J74*J78)*2*J17,2)","v":302.54000000000002},{"$f":"ROUND((K72*K76+K73*K77+K74*K78)*2*K17,2)","v":302.54000000000002},302.54000000000002,302.54000000000002,302.54000000000002,302.54000000000002]
[null,"PERCENTUAL DE DESCONTO"]
[null,null,null,0.06,0.06,0.06,0.06,0.06,0.06,0.06,0.06,0.06,0.06,0.06,0.06]
[null,"VALOR MENSAL DO DESCONTO - POR POSTO"]
[null,null,null,{"$f":"ROUND(D82*D12,2)","v":157.66999999999999},157.66999999999999,{"$f":"ROUND(F82*F12,2)","v":157.66999999999999},{"$f":"ROUND(G82*G12,2)","v":157.66999999999999},157.66999999999999,157.66999999999999,138.87,{"$f":"ROUND(K82*K12,2)","v":187.86},371.57,486.79,622.02,836.66]
[null,"VALOR MENSAL LÍQUIDO DO VALE TRANSPORTE - POR POSTO"]
[null,null,null,{"$f":"IF(D80>D84,D80-D84,0)","v":199.88000000000002},199.88000000000002,{"$f":"IF(F80>F84,F80-F84,0)","v":199.88000000000002},{"$f":"IF(G80>G84,G80-G84,0)","v":199.88000000000002},199.88000000000002,199.88000000000002,163.67000000000002,{"$f":"IF(K80>K84,K80-K84,0)","v":114.68},0,0,0,{"$f":"IF(O80>O84,O80-O84,0)","v":0}]
[null,null,null,{"$f":"D86*D14","v":1199.2800000000002},{"$f":"E86*E14","v":599.6400000000001},{"$f":"F86*F14","v":599.6400000000001},2962.54,2962.54,2962.54,{"$f":"J86*J14","v":1145.69},{"$f":"K86*K14","v":917.44},{"$f":"L86*L14","v":0},{"$f":"M86*M14","v":0}]
[null,"BENEFÍCIOS COMUNS - AUXÍLIO ALIMENTAÇÃO"]
[]
[null,null,"VALOR CCT",28.69,28.69,28.69,28.69,28.69,28.69,28.69,28.69,28.69,28.69,28.69,28.69]
[null,null,"VALOR CD",35,35,35,35,35,35,35,35,35,35,35,35]
[null,"VALOR MENSAL DO AUXÍLIO ALIMENTAÇÃO - POR POSTO"]
[null,null,null,{"$f":"ROUND(LARGE(D90:D91,1)*D17,2)","v":910},{"$f":"ROUND(LARGE(E90:E91,1)*E17,2)","v":910},{"$f":"ROUND(LARGE(F90:F91,1)*F17,2)","v":910},{"$f":"ROUND(LARGE(G90:G91,1)*G17,2)","v":910},910,{"$f":"ROUND(LARGE(I90:I91,1)*I17,2)","v":910},770,{"$f":"ROUND(LARGE(K90:K91,1)*K17,2)","v":770},770,770,770,770]
[null,null,null,{"$f":"D93*D14","v":5460},{"$f":"E93*E14","v":2730},{"$f":"F93*F14","v":2730},10339.56,10339.56,10339.56,{"$f":"J93*J14","v":5390},{"$f":"K93*K14","v":6160},{"$f":"L93*L14","v":4620},{"$f":"M93*M14","v":20020}]
[null,"BENEFÍCIOS ESPECIAIS - ASSISTÊNCIA MÉDICA E FAMILIAR"]
[]
[null,null,"OBRIGAÇÃO DE PAGTO x % CONTR. PATRONAL","SIM","SIM","SIM","SIM","SIM","SIM","SIM","SIM","SIM","SIM","SIM","SIM"]
[null,null,"VALOR CCT"]
[null,null,"VALOR MERCADO",{"$f":"(418.82+532.86)/2*0.6","v":285.50400000000002},{"$f":"(418.82+532.86)/2*0.6","v":285.50400000000002},285.50400000000002,285.50400000000002,285.50400000000002,285.50400000000002,285.50400000000002,285.50400000000002,{"$f":"(418.82+532.86)/2*0.5","v":237.92000000000002},{"$f":"(418.82+532.86)/2*0.5","v":237.92000000000002},{"$f":"(418.82+532.86)/2*0.5","v":237.92000000000002},237.92000000000002]
[null,"VALOR MENSAL DO AUXÍLIO ESPECIAL - ASSISTÊNCIA MÉDICA E FAMILIAR - POR POSTO"]
[null,null,null,{"$f":"IF(D97=\"SIM\",ROUND(SMALL(D98:D99,1),2),0)","v":285.5},{"$f":"IF(E97=\"SIM\",ROUND(SMALL(E98:E99,1),2),0)","v":285.5},285.5,285.5,285.5,285.5,285.5,285.5,237.92,237.92,237.92,237.92]
[]
[null,"BENEFÍCIOS ESPECIAIS - SEGURO DE VIDA E AUXÍLIO-FUNERAL, AUX ODONT, AUX CRECHE"]
[]
[null,"SEGURO DE VIDA E AUXÍLIO FUNERAL"]
[null,null,"OBRIGAÇÃO DE PAGTO","SIM","SIM","SIM","SIM","SIM","SIM","SIM","SIM","SIM","SIM","SIM","SIM"]
[null,null,"VALOR CCT"]
[null,null,"VALOR MERCADO",12.36,12.36,12.36,12.36,12.36,12.36,12.36,12.36,12.36,12.36,12.36,12.36]
[null,"VALOR MENSAL DO AUXÍLIO ESPECIAL - SEGURO DE VIDA E AUXÍLIO FUNERAL - POR POSTO"]
[null,null,null,{"$f":"IF(D106=\"SIM\",ROUND(SMALL(D107:D108,1),2),0)","v":12.36},{"$f":"IF(E106=\"SIM\",ROUND(SMALL(E107:E108,1),2),0)","v":12.36},{"$f":"IF(F106=\"SIM\",ROUND(SMALL(F107:F108,1),2),0)","v":12.36},{"$f":"IF(G106=\"SIM\",ROUND(SMALL(G107:G108,1),2),0)","v":12.36},12.36,12.36,12.36,{"$f":"IF(K106=\"SIM\",ROUND(SMALL(K107:K108,1),2),0)","v":12.36},12.36,12.36,12.36,{"$f":"IF(O106=\"SIM\",ROUND(SMALL(O107:O108,1),2),0)","v":12.36}]
[null,"AUXÍLIO ODONTOLÓGICO"]
[null,null,"OBRIGAÇÃO DE PAGTO","NÃO","NÃO","NÃO","NÃO","NÃO","NÃO","NÃO","NÃO","NÃO","NÃO","NÃO","NÃO"]
[null,null,"VALOR CCT",0,0,0,0,0,0,0,0,0,0,0,0]
[null,null,"VALOR MERCADO",0,0,0,0,0,0,0,0,0,0,0,0]
[null,"VALOR MENSAL DO AUXÍLIO ESPECIAL - SEGURO DE VIDA E AUX FUNERAL - POR POSTO"]
[null,null,null,{"$f":"IF(D112=\"SIM\",ROUND(SMALL(D113:D114,1),2)*D17,0)","v":0},{"$f":"IF(E112=\"SIM\",ROUND(SMALL(E113:E114,1),2)*E17,0)","v":0},{"$f":"IF(F112=\"SIM\",ROUND(SMALL(F113:F114,1),2)*F17,0)","v":0},0,0,0,{"$f":"IF(J112=\"SIM\",ROUND(SMALL(J113:J114,1),2)*J17,0)","v":0},{"$f":"IF(K112=\"SIM\",ROUND(SMALL(K113:K114,1),2)*K17,0)","v":0},0,0,0,0]
[null,"TOTAL MENSAL DOS AUXÍLIOS ESPECIAIS - POR POSTO"]
[null,null,null,{"$f":"D116+D110","v":12.36},12.36,{"$f":"F116+F110","v":12.36},{"$f":"G116+G110","v":12.36},12.36,{"$f":"I116+I110","v":12.36},12.36,{"$f":"K116+K110","v":12.36},12.36,12.36,12.36,{"$f":"O116+O110","v":12.36}]

{"sheet":"Encargos Sociais","index":17,"n_rows":45,"n_cols":7,"rows_kept":45,"cut":false,"hidden":false,"merged":[[1,1,1,3],[2,1,2,4]]}
[]
[]
[null,"ENCARGOS SOCIAIS SOBRE A MÃO DE OBRA"]
[null,null,null,null,"Percentuais"]
[]
[null,"Referência:"]
[null,null,"SINAPI OUT/2018"]
[]
[null,"Categorias:"]
[null,null,"TODAS"]
[]
[null,"GRUPO A: Encargos Sociais Básicos - Previdenciários (GPS), Fundo de Garantia por Tempo de Serviço (FGTS) e Outras Contribuições",null,null,{"$f":"ROUND(SUM(E13:E21),4)","v":0.34799999999999998}]
[null,null,"A","INSS (art. 22, inciso I, Lei nº 8.212/91)",0.2]
[null,null,"B","Salário Educação (art. 3º, inciso I, Decreto nº 87.043/82)",2.5000000000000001E-2]
[null,null,"C","SAT/RAT (art. 22, II, Lei 8.212/91 e Anexo V, Decreto 6.042/07) - Enquadramento 6209-1/00",0.01]
[null,null,"D","SESC ou SESI (art. 30, Lei nº 8.036/90 e art. 1º, Lei 8.154/90)",1.4999999999999999E-2]
[null,null,"E","SENAI ou SENAC (Decreto nº 2.318/86)",0.01]
[null,null,"F","SEBRAE (§ 3º, art. 8º, Lei 8.029/90, alterada pela Lei nº 8.154/90)",6.0000000000000001E-3,null,"* Nota 1 - Os percentuais dos encargos previdenciários, do FGTS e demais contribuições são estabelecidos por legislação vigente."]
[null,null,"G","INCRA (art. 1º, I, Decreto Lei 1.146/70 e Lei 7.787, de 30/06/89)",2E-3,null,"* Nota 2 - O SAT, a depender do grau de risco do serviço, irá variar entre 1%, para risco leve, de 2%, para risco médio, e de 3% para risco grave."]
[null,null,"H","FGTS (Lei Complementar nº 110/01 e art. 30, Lei nº 8.036/90)",0.08,null,"* Nota 3 - Os percentuais do Submódulo 2.2 incidem sobre o Módulo 1, o Submódulo 2.1, o Módulo 3, o Módulo 4 e o Módulo 6."]
[null,null,"I","SECONCI (Convenções Coletivas de Trabalho da construção)",0]
[]
[null,"GRUPO B: Encargos Sociais Relacionados ao Custo do Profissional Ausente - Ausências Legais",null,null,{"$f":"ROUND(SUM(E24:E32),4)","v":0.22459999999999999}]
[null,null,"A","Férias (Arts. 129 e 130, inc. I, da CLT)",{"$f":"1/11","v":9.0909090909090912E-2},null,"* Nota 1 - As alíneas “A” a “F” referem-se  ao custo que será pago pela empresa ao profissional ausente (férias e ausências legais)."]
[null,null,"B","Ausências Legais (Arts. 131 e 473 da CLT)",{"$f":"2/252","v":7.9365079365079361E-3},null,"* Nota 2 - Adotou-se a estimativa do SINAPI de 2 dias por ano. Em 252 dias úteis por ano."]
[null,null,"C","Licença-Paternidade (Art. 7º, XIX, e art. 10, §1º, do ADCT, CF/1988 e Art. 1º, II, da Lei 11.770/2008)",{"$f":"(5/(30*12))*0.0596","v":8.2777777777777776E-4},null,"* Nota 3 - Utilizada a proporção de 50% para homens, 5 dias de afastamento, e a probabilidade de um trabalhador requerer a Licença Paternidade em 5,96%, conforme SINAPI (Anuário Estatístico da Previdência Social - 2017)"]
[null,null,"D","Ausência por Acidente de Trabalho (Art. 131, III, da CLT)",{"$f":"0.0205*15/360","v":8.541666666666667E-4},null,"* Nota 4 - Utilzada a estatística de 2,05% dos contribuintes beneficiados com a emissão do auxílio, conforme Anuário Estatístico da Previdência Social. Afastamento de 15 dias a cargo da empresa."]
[null,null,"E","Afastamento Maternidade (Art. 71 da Lei nº 8.213/1991)",{"$f":"0.0508*(120/360)*(30+30*4/3)/360","v":3.2925925925925922E-3},null,"* Nota 5 - Utilizada a estimativa de 120 dias de afastamento, e a probabilidade de uma trabalhadora requerer a Licença Maternidade em 5,08%, conforme SINAPI (citando dados do IBGE 2017) - A própria previdência paga o benefício pelos 120 dias, contudo o empregador arca com o 13º e com as férias"]
[null,null,"F","Auxílio Enfermidade - Doença (Art. 59 da Lei nº 8.213/1991)",{"$f":"((0.0376*15)+2)/360","v":7.1222222222222225E-3},null,"* Nota 6 - Utilizada a estatística de 3,76% dos contribuintes beneficiados com o auxílio, conforme Anuário Estatístico da Previdência Social de 2016 (acrescidos de 2 dias ao ano, para os quais o trabalhador nem requer o benefício da Previdência - conforme SINAPI)"]
[null,null,"G","Adicional de Férias (componente do Submódulo 2.1)",{"$f":"1/3*1/11","v":3.03030303030303E-2},null,"* Nota 7 - O adicional de férias contido no Submódulo 2.1 corresponde a 1/3 da remuneração que, por sua vez, é dividida por 11 contome Nota 1."]
[null,null,"H","13º Salário (destacado na planilha de custos)",{"$f":"1/12","v":8.3333333333333329E-2},null,"* Nota 8 - Provisiona-se, mensalmente, o proporcional a 1/12 dos valores referentes a gratificação natalina e adicional de férias."]
[null,null,"I","Intervalo para repouso ou alimentação (componente do Submódulo 4.2)",0]
[]
[null,"GRUPO C: Encargos Sociais Relacionados à Previsão para Rescisão Trabalhista",null,null,{"$f":"ROUND(SUM(E35:E40),4)","v":6.3399999999999998E-2}]
[null,null,"A","Aviso Prévio Indenizado (Art. 7º, inciso XXI, da CF/1988 e arts. 477, 487, §1º, e 491 da CLT)",{"$f":"0.1*30/360","v":8.3333333333333332E-3},null,"* Nota 1 - Considerou-se demissões de 10% por ano para substituições, a um prazo estimado de contrato de 3 anos. Aviso prévio - 1º ano 30 dias. Considerou-se os 10% demitidos sem justa causa e recebendo aviso indenizado."]
[null,null,"B","Incidência do FGTS sobre o Aviso Prévio Indenizado (Súmula 305 TST)",{"$f":"E20*E35","v":6.6666666666666664E-4}]
[null,null,"C","Multa do FGTS sobre o Aviso Prévio Indenizado (Art. 18, §1º, da Lei 8.036/1990)",{"$f":"(1+1/12+1/12+1/36)*0.4*E20*0.2019","v":7.7170666666666644E-3},null,"* Nota 2 - Incide sobre a Remuneração + 13º salário (1/12) + Férias (1/12) + Adicional de Férias (1/36) x 40% multa para o empregador x 8% FGTS"]
[null,null,"D","Aviso Prévio Trabalhado (Art. 488, parágrafo único, CLT)",{"$f":"((7+2*3)*100%/360)/3","v":1.2037037037037035E-2},null,"* Nota 3 - Considerou-se demissões de 100% ao final do contrato, com um prazo médio estimado de 3 anos. Assim, calcula-se 7 dias para o 1º ano de contrato e mais 3 dias para os 2 anos seguintes. Total 13 dias."]
[null,null,"E","Incidência de GPS, FGTS e outras contribuições sobre o Aviso Prévio Trabalhado",{"$f":"E38*E12","v":4.1888888888888878E-3}]
[null,null,"F","Multa do FGTS sobre o Aviso Prévio Trabalhado",{"$f":"(1+1/12+1/12+1/36)*0.4*E20*(1-0.2019)","v":3.0505155555555549E-2},null,"* Nota 4 - Incide sobre a Remuneração + 13º salário (1/12) + Férias (1/12) + Adicional de Férias (1/36) x 40% multa para o empregador x 8% FGTS"]
[]
[null,"GRUPO D: Reincidências",null,null,{"$f":"ROUND(SUM(E43:E43),4)","v":7.8200000000000006E-2}]
[null,null,"A","Reincidência do Grupo A sobre o Grupo B",{"$f":"E12*E23","v":7.8160799999999989E-2}]
[]
[null,null,null,"SOMATÓRIO - ENCARGOS SOCIAIS SOBRE A MÃO DE OBRA",{"$f":"E42+E34+E23+E12","v":0.71419999999999995}]

{"sheet":"BDI","index":18,"n_rows":26,"n_cols":7,"rows_kept":26,"cut":false,"hidden":false,"merged":[[1,1,1,3],[2,1,2,4]]}
[]
[]
[null,"COMPOSIÇÃO DA TAXA DE CUSTOS INDIRETOS, TRIBUTOS E LUCRO - BDI"]
[null,"APLICAÇÃO: MÃO DE OBRA, 13º, MATERIAIS, EPC E EQUIPAMENTO DE REGISTRO DE FREQUÊNCIA",null,null,"Percentuais"]
[]
[null,"Custos Indiretos da Contratada",null,null,{"$f":"SUM(E7:E8)","v":5.8400000000000001E-2}]
[null,null,"A","Administração Central (despesas de gestão da empresa, escritório e treinamento de seu pessoal, e eventuais como máscaras obrigatórias)",2.1600000000000001E-2,null,"* Nota 1 - O Somatório da Administração Central com o Lucro deve ser inferior a 12%"]
[null,null,"B","Seguros, Garantias e Riscos (o risco foi majorado considerando o modelo híbrido, com risco de redutores na fatura mensal e mais 0,2 % )",{"$f":"3.48%+0.2%","v":3.6799999999999999E-2},null,"* Nota 2 - O risco previsto para o porte do contrato majorado em mais 0,20% devido ao não pagamento dos insumos componentes do custo do posto quando da ausência do mesmo."]
[]
[null,"Lucro",null,null,{"$f":"SUM(E11:E11)","v":3.3399999999999999E-2}]
[null,null,"A","Lucro Real sobre os Custos Administrados",3.3399999999999999E-2]
[]
[null,"Despesas Financeiras",null,null,{"$f":"E14","v":5.2519605742542552E-3}]
[null,null,"A","Cálculo Baseado no Prazo para a Restituição dos Desembolsos Realizados pelo Contratado e na Taxa de Retorno Arbitrada",{"$f":"(1+E16)^(E15/252)-1","v":5.2519605742542552E-3},null,"* Nota 1 - DF = [(1+TR)^(DU/252)]/100"]
[null,null,"A.1","Dias Úteis Considerados",11,null,"* Nota 2 - Diferença de dias entre o desembolso, pelo contratado, e o pagamento, pela Câmara"]
[null,null,"A.2","Taxa de Retorno",0.1275,null,"* Nota 3 - A taxa sugerida é a meta da SELIC"]
[]
[null,"Impostos - Tributos Federais",null,null,{"$f":"SUM(E19:E21)","v":7.3999999999999996E-2}]
[null,null,"A","Contribuição para o Financiamento da Seguridade Social - COFINS",{"$f":"0.8*7.6%","v":6.08E-2},null,"* Nota 1 - Redução de 20% considerando as deduções permitidas em Lei, conforme SENGE, citado pelo TCU - Acórdão 2622/2013"]
[null,null,"B","Programa de Integração Social - PIS",{"$f":"0.8*1.65%","v":1.3200000000000002E-2},null,"* Nota 2 - Redução de 20% considerando as deduções permitidas em Lei, conforme SENGE, citado pelo TCU - Acórdão 2622/2013"]
[null,null,"C","Contribuição Previdenciária sobre a Receita Bruta - CPRB",0,null,"* Nota 3 - Lei 12.546/2011 - Verificar atualizações e setores beneficiados"]
[]
[null,"Impostos - Tributos Distritais",null,null,{"$f":"SUM(E24:E24)","v":0.05}]
[null,null,"A","Imposto sobre Serviço de Qualquer Natureza - ISS",0.05]
[]
[null,null,null,"SOMATÓRIO - ENCARGOS SOCIAIS SOBRE A MÃO DE OBRA",{"$f":"ROUND((((1+E6)*(1+E10)*(1+E13)/(1-E18-E23))-1),4)","v":0.25509999999999999},null,"* Nota 1 - [(1+AC+SGR)*(1+L)*(1+DF)/(1-CONFINS-PIS-CPRB-ISS)]-1"]

{"sheet":"Uniformes","index":19,"n_rows":176,"n_cols":130,"rows_kept":176,"cut":false,"hidden":false,"merged":[[4,1,4,3],[5,1,5,7]]}
[null,null,"CÂMARA DOS DEPUTADOS"]
[null,null,"DEPARTAMENTO TÉCNICO"]
[null,null,"Coordenação de Planejamento e Gestão"]
[]
[]
[null,"UNIFORMES - AQUISIÇÃO",null,null,null,null,null,null,null,null,1,null,{"$f":"K6+1","v":2},null,{"$f":"M6+1","v":3},null,{"$f":"O6+1","v":4},null,{"$f":"Q6+1","v":5},null,{"$f":"S6+1","v":6},null,{"$f":"U6+1","v":7},null,{"$f":"W6+1","v":8},null,{"$f":"Y6+1","v":9},null,{"$f":"AA6+1","v":10},null,{"$f":"AC6+1","v":11},null,{"$f":"AE6+1","v":12},null,{"$f":"AG6+1","v":13},null,{"$f":"AI6+1","v":14},null,{"$f":"AK6+1","v":15},null,{"$f":"AM6+1","v":16},null,{"$f":"AO6+1","v":17},null,{"$f":"AQ6+1","v":18},null,{"$f":"AS6+1","v":19},null,{"$f":"AU6+1","v":20},null,{"$f":"AW6+1","v":21},null,{"$f":"AY6+1","v":22},null,{"$f":"BA6+1","v":23},null,{"$f":"BC6+1","v":24},null,{"$f":"BE6+1","v":25},null,{"$f":"BG6+1","v":26},null,{"$f":"BI6+1","v":27},null,{"$f":"BK6+1","v":28},null,{"$f":"BM6+1","v":29},null,{"$f":"BO6+1","v":30},null,{"$f":"BQ6+1","v":31},null,{"$f":"BS6+1","v":32},null,{"$f":"BU6+1","v":33},null,{"$f":"BW6+1","v":34},null,{"$f":"BY6+1","v":35},null,{"$f":"CA6+1","v":36},null,{"$f":"CC6+1","v":37},null,{"$f":"CE6+1","v":38},null,{"$f":"CG6+1","v":39},null,{"$f":"CI6+1","v":40},null,{"$f":"CK6+1","v":41},null,{"$f":"CM6+1","v":42},null,{"$f":"CO6+1","v":43},null,{"$f":"CQ6+1","v":44},null,{"$f":"CS6+1","v":45},null,{"$f":"CU6+1","v":46},null,{"$f":"CW6+1","v":47},null,{"$f":"CY6+1","v":48},null,{"$f":"DA6+1","v":49},null,{"$f":"DC6+1","v":50},null,{"$f":"DE6+1","v":51},null,{"$f":"DG6+1","v":52},null,{"$f":"DI6+1","v":53},null,{"$f":"DK6+1","v":54},null,{"$f":"DM6+1","v":55},null,{"$f":"DO6+1","v":56},null,{"$f":"DQ6+1","v":57},null,{"$f":"DS6+1","v":58},null,{"$f":"DU6+1","v":59},null,{"$f":"DW6+1","v":60}]
[]
[null,null,null,null,null,null,null,null,null,null,{"$f":"ROUND(SUM(L7:L191),2)","v":0},null,{"$f":"ROUND(SUM(N7:N191),2)","v":0},null,{"$f":"ROUND(SUM(P7:P191),2)","v":0},null,{"$f":"ROUND(SUM(R7:R191),2)","v":0},null,{"$f":"ROUND(SUM(T7:T191),2)","v":0},null,{"$f":"ROUND(SUM(V7:V191),2)","v":0},null,{"$f":"ROUND(SUM(X7:X191),2)","v":1038},null,{"$f":"ROUND(SUM(Z7:Z191),2)","v":1038},null,{"$f":"ROUND(SUM(AB7:AB191),2)","v":0},null,{"$f":"ROUND(SUM(AD7:AD191),2)","v":0},null,{"$f":"ROUND(SUM(AF7:AF191),2)","v":0},null,{"$f":"ROUND(SUM(AH7:AH191),2)","v":0},null,{"$f":"ROUND(SUM(AJ7:AJ191),2)","v":0},null,{"$f":"ROUND(SUM(AL7:AL191),2)","v":0},null,{"$f":"ROUND(SUM(AN7:AN191),2)","v":0},null,{"$f":"ROUND(SUM(AP7:AP191),2)","v":0},null,{"$f":"ROUND(SUM(AR7:AR191),2)","v":0},null,{"$f":"ROUND(SUM(AT7:AT191),2)","v":0},null,{"$f":"ROUND(SUM(AV7:AV191),2)","v":0},null,{"$f":"ROUND(SUM(AX7:AX191),2)","v":0},null,{"$f":"ROUND(SUM(AZ7:AZ191),2)","v":0},null,{"$f":"ROUND(SUM(BB7:BB191),2)","v":0},null,{"$f":"ROUND(SUM(BD7:BD191),2)","v":0},null,{"$f":"ROUND(SUM(BF7:BF191),2)","v":0},null,{"$f":"ROUND(SUM(BH7:BH191),2)","v":0},null,{"$f":"ROUND(SUM(BJ7:BJ191),2)","v":0},null,{"$f":"ROUND(SUM(BL7:BL191),2)","v":0},null,{"$f":"ROUND(SUM(BN7:BN191),2)","v":0},null,{"$f":"ROUND(SUM(BP7:BP191),2)","v":0},null,{"$f":"ROUND(SUM(BR7:BR191),2)","v":0},null,{"$f":"ROUND(SUM(BT7:BT191),2)","v":0},null,{"$f":"ROUND(SUM(BV7:BV191),2)","v":0},null,{"$f":"ROUND(SUM(BX7:BX191),2)","v":0},null,{"$f":"ROUND(SUM(BZ7:BZ191),2)","v":0},null,{"$f":"ROUND(SUM(CB7:CB191),2)","v":0},null,{"$f":"ROUND(SUM(CD7:CD191),2)","v":0},null,{"$f":"ROUND(SUM(CF7:CF191),2)","v":0},null,{"$f":"ROUND(SUM(CH7:CH191),2)","v":0},null,{"$f":"ROUND(SUM(CJ7:CJ191),2)","v":0},null,{"$f":"ROUND(SUM(CL7:CL191),2)","v":0},null,{"$f":"ROUND(SUM(CN7:CN191),2)","v":0},null,{"$f":"ROUND(SUM(CP7:CP191),2)","v":0},null,{"$f":"ROUND(SUM(CR7:CR191),2)","v":0},null,{"$f":"ROUND(SUM(CT7:CT191),2)","v":0},null,{"$f":"ROUND(SUM(CV7:CV191),2)","v":0},null,{"$f":"ROUND(SUM(CX7:CX191),2)","v":0},null,{"$f":"ROUND(SUM(CZ7:CZ191),2)","v":0},null,{"$f":"ROUND(SUM(DB7:DB191),2)","v":0},null,{"$f":"ROUND(SUM(DD7:DD191),2)","v":0},null,{"$f":"ROUND(SUM(DF7:DF191),2)","v":0},null,{"$f":"ROUND(SUM(DH7:DH191),2)","v":0},null,{"$f":"ROUND(SUM(DJ7:DJ191),2)","v":0},null,{"$f":"ROUND(SUM(DL7:DL191),2)","v":0},null,{"$f":"ROUND(SUM(DN7:DN191),2)","v":0},null,{"$f":"ROUND(SUM(DP7:DP191),2)","v":0},null,{"$f":"ROUND(SUM(DR7:DR191),2)","v":0},null,{"$f":"ROUND(SUM(DT7:DT191),2)","v":0},null,{"$f":"ROUND(SUM(DV7:DV191),2)","v":0},null,{"$f":"ROUND(SUM(DX7:DX191),2)","v":0},null,{"$f":"ROUND(SUM(DZ7:DZ191),2)","v":0}]
[null,null,"CATEGORIAS",null,null,null,null,"QUANTIDADE"]
[]
[]
[null,null,7,{"$f":"HLOOKUP($C12,'Dados Gerais'!$D$5:$BK$10,6)","v":"TÉCNICO INSTALADOR DE CABEAMENTO"},null,null,null,{"$f":"HLOOKUP($C12,'Dados Gerais'!$D$5:$BK$14,10)","v":7},null,null,{"$f":"IF($C12=K$6,1,0)","v":0},null,0,null,0,null,0,null,0,null,0,null,1,null,0,null,{"$f":"IF($C12=AA$6,1,0)","v":0},null,0,null,0,null,0,null,0,null,0,null,0,null,0,null,0,null,0,null,{"$f":"IF($C12=AU$6,1,0)","v":0},null,{"$f":"IF($C12=AW$6,1,0)","v":0},null,{"$f":"IF($C12=AY$6,1,0)","v":0},null,{"$f":"IF($C12=BA$6,1,0)","v":0},null,{"$f":"IF($C12=BC$6,1,0)","v":0},null,{"$f":"IF($C12=BE$6,1,0)","v":0},null,{"$f":"IF($C12=BG$6,1,0)","v":0},null,{"$f":"IF($C12=BI$6,1,0)","v":0},null,{"$f":"IF($C12=BK$6,1,0)","v":0},null,{"$f":"IF($C12=BM$6,1,0)","v":0},null,{"$f":"IF($C12=BO$6,1,0)","v":0},null,{"$f":"IF($C12=BQ$6,1,0)","v":0},null,{"$f":"IF($C12=BS$6,1,0)","v":0},null,{"$f":"IF($C12=BU$6,1,0)","v":0},null,{"$f":"IF($C12=BW$6,1,0)","v":0},null,{"$f":"IF($C12=BY$6,1,0)","v":0},null,{"$f":"IF($C12=CA$6,1,0)","v":0},null,{"$f":"IF($C12=CC$6,1,0)","v":0},null,{"$f":"IF($C12=CE$6,1,0)","v":0},null,{"$f":"IF($C12=CG$6,1,0)","v":0},null,{"$f":"IF($C12=CI$6,1,0)","v":0},null,{"$f":"IF($C12=CK$6,1,0)","v":0},null,{"$f":"IF($C12=CM$6,1,0)","v":0},null,{"$f":"IF($C12=CO$6,1,0)","v":0},null,{"$f":"IF($C12=CQ$6,1,0)","v":0},null,{"$f":"IF($C12=CS$6,1,0)","v":0},null,{"$f":"IF($C12=CU$6,1,0)","v":0},null,{"$f":"IF($C12=CW$6,1,0)","v":0},null,{"$f":"IF($C12=CY$6,1,0)","v":0},null,{"$f":"IF($C12=DA$6,1,0)","v":0},null,{"$f":"IF($C12=DC$6,1,0)","v":0},null,{"$f":"IF($C12=DE$6,1,0)","v":0},null,{"$f":"IF($C12=DG$6,1,0)","v":0},null,{"$f":"IF($C12=DI$6,1,0)","v":0},null,{"$f":"IF($C12=DK$6,1,0)","v":0},null,{"$f":"IF($C12=DM$6,1,0)","v":0},null,{"$f":"IF($C12=DO$6,1,0)","v":0},null,{"$f":"IF($C12=DQ$6,1,0)","v":0},null,{"$f":"IF($C12=DS$6,1,0)","v":0},null,{"$f":"IF($C12=DU$6,1,0)","v":0},null,{"$f":"IF($C12=DW$6,1,0)","v":0},null,{"$f":"IF($C12=DY$6,1,0)","v":0}]
[null,null,8,{"$f":"HLOOKUP($C13,'Dados Gerais'!$D$5:$BK$10,6)","v":"TÉCNICO DE MANUTENÇÃO DE INFRAESTRUTURA DE REDE"},null,null,null,{"$f":"HLOOKUP($C13,'Dados Gerais'!$D$5:$BK$14,10)","v":8},null,null,0,null,0,null,0,null,0,null,0,null,0,null,0,null,1,null,0,null,0,null,0,null,0,null,0,null,0,null,0,null,0,null,0,null,0,null,0,null,0,null,0,null,0,null,0,null,0,null,0,null,0,null,0,null,0,null,0,null,0,null,0,null,0,null,0,null,0,null,0,null,0,null,0,null,0,null,0,null,0,null,0,null,0,null,0,null,0,null,0,null,0,null,0,null,0,null,0,null,0,null,0,null,0,null,0,null,0,null,0,null,0,null,0,null,0,null,0,null,0]
[]
[]
[null,null,"ITEM","DESCRIÇÃO","QUANT ANUAL\nPOR POSTO","Nº DE POSTOS","QUANT ANUAL\nTOTAL","VALOR"]
[null,null,null,null,null,null,null,null,null,null,null,null,null,null,null,null,null,null,null,null,null,null,null,null,null,null,null,null,null,null,null,null,null,null,null,null,null,null,null,null,null,null,null,null,null,null,null,{"$f":"IF(SUM(AU$10:AU$10)>0,$E17*$H17,0)","v":0},null,{"$f":"IF(SUM(AW$10:AW$10)>0,$E17*$H17,0)","v":0},null,{"$f":"IF(SUM(AY$10:AY$10)>0,$E17*$H17,0)","v":0},null,{"$f":"IF(SUM(BA$10:BA$10)>0,$E17*$H17,0)","v":0},null,{"$f":"IF(SUM(BC$10:BC$10)>0,$E17*$H17,0)","v":0},null,{"$f":"IF(SUM(BE$10:BE$10)>0,$E17*$H17,0)","v":0},null,{"$f":"IF(SUM(BG$10:BG$10)>0,$E17*$H17,0)","v":0},null,{"$f":"IF(SUM(BI$10:BI$10)>0,$E17*$H17,0)","v":0},null,{"$f":"IF(SUM(BK$10:BK$10)>0,$E17*$H17,0)","v":0},null,{"$f":"IF(SUM(BM$10:BM$10)>0,$E17*$H17,0)","v":0},null,{"$f":"IF(SUM(BO$10:BO$10)>0,$E17*$H17,0)","v":0},null,{"$f":"IF(SUM(BQ$10:BQ$10)>0,$E17*$H17,0)","v":0},null,{"$f":"IF(SUM(BS$10:BS$10)>0,$E17*$H17,0)","v":0},null,{"$f":"IF(SUM(BU$10:BU$10)>0,$E17*$H17,0)","v":0},null,{"$f":"IF(SUM(BW$10:BW$10)>0,$E17*$H17,0)","v":0},null,{"$f":"IF(SUM(BY$10:BY$10)>0,$E17*$H17,0)","v":0},null,{"$f":"IF(SUM(CA$10:CA$10)>0,$E17*$H17,0)","v":0},null,{"$f":"IF(SUM(CC$10:CC$10)>0,$E17*$H17,0)","v":0},null,{"$f":"IF(SUM(CE$10:CE$10)>0,$E17*$H17,0)","v":0},null,{"$f":"IF(SUM(CG$10:CG$10)>0,$E17*$H17,0)","v":0},null,{"$f":"IF(SUM(CI$10:CI$10)>0,$E17*$H17,0)","v":0},null,{"$f":"IF(SUM(CK$10:CK$10)>0,$E17*$H17,0)","v":0},null,{"$f":"IF(SUM(CM$10:CM$10)>0,$E17*$H17,0)","v":0},null,{"$f":"IF(SUM(CO$10:CO$10)>0,$E17*$H17,0)","v":0},null,{"$f":"IF(SUM(CQ$10:CQ$10)>0,$E17*$H17,0)","v":0},null,{"$f":"IF(SUM(CS$10:CS$10)>0,$E17*$H17,0)","v":0},null,{"$f":"IF(SUM(CU$10:CU$10)>0,$E17*$H17,0)","v":0},null,{"$f":"IF(SUM(CW$10:CW$10)>0,$E17*$H17,0)","v":0},null,{"$f":"IF(SUM(CY$10:CY$10)>0,$E17*$H17,0)","v":0},null,{"$f":"IF(SUM(DA$10:DA$10)>0,$E17*$H17,0)","v":0},null,{"$f":"IF(SUM(DC$10:DC$10)>0,$E17*$H17,0)","v":0},null,{"$f":"IF(SUM(DE$10:DE$10)>0,$E17*$H17,0)","v":0},null,{"$f":"IF(SUM(DG$10:DG$10)>0,$E17*$H17,0)","v":0},null,{"$f":"IF(SUM(DI$10:DI$10)>0,$E17*$H17,0)","v":0},null,{"$f":"IF(SUM(DK$10:DK$10)>0,$E17*$H17,0)","v":0},null,{"$f":"IF(SUM(DM$10:DM$10)>0,$E17*$H17,0)","v":0},null,{"$f":"IF(SUM(DO$10:DO$10)>0,$E17*$H17,0)","v":0},null,{"$f":"IF(SUM(DQ$10:DQ$10)>0,$E17*$H17,0)","v":0},null,{"$f":"IF(SUM(DS$10:DS$10)>0,$E17*$H17,0)","v":0},null,{"$f":"IF(SUM(DU$10:DU$10)>0,$E17*$H17,0)","v":0},null,{"$f":"IF(SUM(DW$10:DW$10)>0,$E17*$H17,0)","v":0},null,{"$f":"IF(SUM(DY$10:DY$10)>0,$E17*$H17,0)","v":0}]
[null,null,null,"Camisa gola polo cor preta, 100% algodão (manga curta)",8,{"$f":"H12+H13","v":15},{"$f":"F18*E18","v":120},58.95,null,null,null,{"$f":"IF(SUM(K$12:K$14)>0,$E18*$H18,0)","v":0},null,{"$f":"IF(SUM(M$12:M$14)>0,$E18*$H18,0)","v":0},null,{"$f":"IF(SUM(O$12:O$14)>0,$E18*$H18,0)","v":0},null,{"$f":"IF(SUM(Q$12:Q$14)>0,$E18*$H18,0)","v":0},null,{"$f":"IF(SUM(S$12:S$14)>0,$E18*$H18,0)","v":0},null,{"$f":"IF(SUM(U$12:U$14)>0,$E18*$H18,0)","v":0},null,{"$f":"IF(SUM(W$12:W$14)>0,$E18*$H18,0)","v":471.6},null,{"$f":"IF(SUM(Y$12:Y$14)>0,$E18*$H18,0)","v":471.6},null,{"$f":"IF(SUM(AA$12:AA$14)>0,$E18*$H18,0)","v":0},null,{"$f":"IF(SUM(AC$12:AC$14)>0,$E18*$H18,0)","v":0},null,{"$f":"IF(SUM(AE$12:AE$14)>0,$E18*$H18,0)","v":0},null,{"$f":"IF(SUM(AG$12:AG$14)>0,$E18*$H18,0)","v":0},null,{"$f":"IF(SUM(AI$12:AI$14)>0,$E18*$H18,0)","v":0},null,{"$f":"IF(SUM(AK$12:AK$14)>0,$E18*$H18,0)","v":0},null,{"$f":"IF(SUM(AM$12:AM$14)>0,$E18*$H18,0)","v":0},null,{"$f":"IF(SUM(AO$12:AO$14)>0,$E18*$H18,0)","v":0},null,{"$f":"IF(SUM(AQ$12:AQ$14)>0,$E18*$H18,0)","v":0},null,{"$f":"IF(SUM(AS$12:AS$14)>0,$E18*$H18,0)","v":0},null,0,null,0,null,0,null,0,null,0,null,0,null,0,null,0,null,0,null,0,null,0,null,0,null,0,null,0,null,0,null,0,null,0,null,0,null,0,null,0,null,0,null,0,null,0,null,0,null,0,null,0,null,0,null,0,null,0,null,0,null,0,null,0,null,0,null,0,null,0,null,0,null,0,null,0,null,0,null,0,null,0,null,0]
[null,null,null,"Calça jeans azul escuro",4,{"$f":"F18","v":15},{"$f":"F19*E19","v":60},85.31,null,null,null,0,null,0,null,0,null,0,null,0,null,0,null,{"$f":"IF(SUM(W$12:W$14)>0,$E19*$H19,0)","v":341.24},null,341.24,null,0,null,0,null,0,null,0,null,0,null,0,null,0,null,0,null,0,null,0,null,0,null,0,null,0,null,0,null,0,null,0,null,0,null,0,null,0,null,0,null,0,null,0,null,0,null,0,null,0,null,0,null,0,null,0,null,0,null,0,null,0,null,0,null,0,null,0,null,0,null,0,null,0,null,0,null,0,null,0,null,0,null,0,null,0,null,0,null,0,null,0,null,0,null,0,null,0,null,0,null,0,null,0]
[null,null,null,"Meia social preta",10,{"$f":"F19","v":15},150,13.65,null,null,null,0,null,0,null,0,null,0,null,0,null,0,null,136.5,null,136.5,null,0,null,0,null,0,null,0,null,0,null,0,null,0,null,0,null,0,null,0,null,0,null,0,null,0,null,0,null,0,null,0,null,0,null,0,null,0,null,0,null,0,null,0,null,0,null,0,null,0,null,0,null,0,null,0,null,0,null,0,null,0,null,0,null,0,null,0,null,0,null,0,null,0,null,0,null,0,null,0,null,0,null,0,null,0,null,0,null,0,null,0,null,0,null,0,null,0,null,0,null,0,null,0]
[null,null,null,"Cinto preto",2,15,30,44.33,null,null,null,{"$f":"IF(SUM(K$12:K$14)>0,$E21*$H21,0)","v":0},null,0,null,0,null,0,null,0,null,0,null,88.66,null,88.66,null,0,null,0,null,0,null,0,null,0,null,0,null,0,null,0,null,0,null,0,null,0,null,0,null,0,null,0,null,0,null,0,null,0,null,0,null,0,null,0,null,0,null,0,null,0,null,0,null,0,null,0,null,0,null,0,null,0,null,0,null,0,null,0,null,0,null,0,null,0,null,0,null,0,null,0,null,0,null,0,null,0,null,0,null,0,null,0,null,0,null,0,null,0,null,0,null,0,null,0,null,0,null,0]
[null,null,null,null,null,null,null,null,null,null,null,{"$f":"IF(SUM(K$12:K$14)>0,$E22*$H22,0)","v":0},null,0,null,0,null,0,null,0,null,0,null,0,null,0,null,0,null,0,null,0,null,0,null,0,null,0,null,0,null,0,null,0,null,0,null,0,null,0,null,0,null,0,null,0,null,0,null,0,null,0,null,0,null,0,null,0,null,0,null,0,null,0,null,0,null,0,null,0,null,0,null,0,null,0,null,0,null,0,null,0,null,0,null,0,null,0,null,0,null,0,null,0,null,0,null,0,null,0,null,0,null,0,null,0,null,0,null,0,null,0,null,0,null,0,null,0,null,0]
[null,null,"CATEGORIAS",null,null,null,null,"QUANTIDADE"]
[]
[null,null,null,{"$f":"HLOOKUP($C25,'Dados Gerais'!$D$5:$BK$10,6)","v":{"$error":"#N/A"}},null,null,null,{"$f":"HLOOKUP($C25,'Dados Gerais'!$D$5:$BK$14,10)","v":{"$error":"#N/A"}},null,null,{"$f":"IF($C25=K$6,1,0)","v":0},null,0,null,0,null,0,null,0,null,0,null,0,null,0,null,0,null,0,null,0,null,0,null,0,null,0,null,0,null,0,null,0,null,0,null,0,null,0,null,0,null,0,null,0,null,0,null,0,null,0,null,0,null,0,null,0,null,{"$f":"IF($C25=BQ$6,1,0)","v":0},null,{"$f":"IF($C25=BS$6,1,0)","v":0},null,{"$f":"IF($C25=BU$6,1,0)","v":0},null,{"$f":"IF($C25=BW$6,1,0)","v":0},null,{"$f":"IF($C25=BY$6,1,0)","v":0},null,{"$f":"IF($C25=CA$6,1,0)","v":0},null,{"$f":"IF($C25=CC$6,1,0)","v":0},null,{"$f":"IF($C25=CE$6,1,0)","v":0},null,{"$f":"IF($C25=CG$6,1,0)","v":0},null,{"$f":"IF($C25=CI$6,1,0)","v":0},null,{"$f":"IF($C25=CK$6,1,0)","v":0},null,{"$f":"IF($C25=CM$6,1,0)","v":0},null,{"$f":"IF($C25=CO$6,1,0)","v":0},null,{"$f":"IF($C25=CQ$6,1,0)","v":0},null,{"$f":"IF($C25=CS$6,1,0)","v":0},null,{"$f":"IF($C25=CU$6,1,0)","v":0},null,{"$f":"IF($C25=CW$6,1,0)","v":0},null,{"$f":"IF($C25=CY$6,1,0)","v":0},null,{"$f":"IF($C25=DA$6,1,0)","v":0},null,{"$f":"IF($C25=DC$6,1,0)","v":0},null,{"$f":"IF($C25=DE$6,1,0)","v":0},null,{"$f":"IF($C25=DG$6,1,0)","v":0},null,{"$f":"IF($C25=DI$6,1,0)","v":0},null,{"$f":"IF($C25=DK$6,1,0)","v":0},null,{"$f":"IF($C25=DM$6,1,0)","v":0},null,{"$f":"IF($C25=DO$6,1,0)","v":0},null,{"$f":"IF($C25=DQ$6,1,0)","v":0},null,{"$f":"IF($C25=DS$6,1,0)","v":0},null,{"$f":"IF($C25=DU$6,1,0)","v":0},null,{"$f":"IF($C25=DW$6,1,0)","v":0},null,{"$f":"IF($C25=DY$6,1,0)","v":0}]
[]
[]
[null,null,"ITEM","DESCRIÇÃO","QUANT ANUAL\nPOR POSTO","Nº DE POSTOS","QUANT ANUAL\nTOTAL","VALOR"]
[null,null,null,null,null,null,null,null,null,null,null,null,null,null,null,null,null,null,null,null,null,null,null,null,null,null,null,null,null,null,null,null,null,null,null,null,null,null,null,null,null,null,null,null,null,null,null,null,null,null,null,null,null,null,null,null,null,null,null,null,null,null,null,null,null,null,null,{"$f":"IF(SUM(BO$10:BO$10)>0,$E29*$H29,0)","v":0},null,{"$f":"IF(SUM(BQ$10:BQ$10)>0,$E29*$H29,0)","v":0},null,{"$f":"IF(SUM(BS$10:BS$10)>0,$E29*$H29,0)","v":0},null,{"$f":"IF(SUM(BU$10:BU$10)>0,$E29*$H29,0)","v":0},null,{"$f":"IF(SUM(BW$10:BW$10)>0,$E29*$H29,0)","v":0},null,{"$f":"IF(SUM(BY$10:BY$10)>0,$E29*$H29,0)","v":0},null,{"$f":"IF(SUM(CA$10:CA$10)>0,$E29*$H29,0)","v":0},null,{"$f":"IF(SUM(CC$10:CC$10)>0,$E29*$H29,0)","v":0},null,{"$f":"IF(SUM(CE$10:CE$10)>0,$E29*$H29,0)","v":0},null,{"$f":"IF(SUM(CG$10:CG$10)>0,$E29*$H29,0)","v":0},null,{"$f":"IF(SUM(CI$10:CI$10)>0,$E29*$H29,0)","v":0},null,{"$f":"IF(SUM(CK$10:CK$10)>0,$E29*$H29,0)","v":0},null,{"$f":"IF(SUM(CM$10:CM$10)>0,$E29*$H29,0)","v":0},null,{"$f":"IF(SUM(CO$10:CO$10)>0,$E29*$H29,0)","v":0},null,{"$f":"IF(SUM(CQ$10:CQ$10)>0,$E29*$H29,0)","v":0},null,{"$f":"IF(SUM(CS$10:CS$10)>0,$E29*$H29,0)","v":0},null,{"$f":"IF(SUM(CU$10:CU$10)>0,$E29*$H29,0)","v":0},null,{"$f":"IF(SUM(CW$10:CW$10)>0,$E29*$H29,0)","v":0},null,{"$f":"IF(SUM(CY$10:CY$10)>0,$E29*$H29,0)","v":0},null,{"$f":"IF(SUM(DA$10:DA$10)>0,$E29*$H29,0)","v":0},null,{"$f":"IF(SUM(DC$10:DC$10)>0,$E29*$H29,0)","v":0},null,{"$f":"IF(SUM(DE$10:DE$10)>0,$E29*$H29,0)","v":0},null,{"$f":"IF(SUM(DG$10:DG$10)>0,$E29*$H29,0)","v":0},null,{"$f":"IF(SUM(DI$10:DI$10)>0,$E29*$H29,0)","v":0},null,{"$f":"IF(SUM(DK$10:DK$10)>0,$E29*$H29,0)","v":0},null,{"$f":"IF(SUM(DM$10:DM$10)>0,$E29*$H29,0)","v":0},null,{"$f":"IF(SUM(DO$10:DO$10)>0,$E29*$H29,0)","v":0},null,{"$f":"IF(SUM(DQ$10:DQ$10)>0,$E29*$H29,0)","v":0},null,{"$f":"IF(SUM(DS$10:DS$10)>0,$E29*$H29,0)","v":0},null,{"$f":"IF(SUM(DU$10:DU$10)>0,$E29*$H29,0)","v":0},null,{"$f":"IF(SUM(DW$10:DW$10)>0,$E29*$H29,0)","v":0},null,{"$f":"IF(SUM(DY$10:DY$10)>0,$E29*$H29,0)","v":0}]
[null,null,null,null,null,null,null,null,null,null,null,{"$f":"IF(SUM(K$24:K$27)>0,$E30*$H30,0)","v":0},null,{"$f":"IF(SUM(M$24:M$27)>0,$E30*$H30,0)","v":0},null,{"$f":"IF(SUM(O$24:O$27)>0,$E30*$H30,0)","v":0},null,{"$f":"IF(SUM(Q$24:Q$27)>0,$E30*$H30,0)","v":0},null,{"$f":"IF(SUM(S$24:S$27)>0,$E30*$H30,0)","v":0},null,{"$f":"IF(SUM(U$24:U$27)>0,$E30*$H30,0)","v":0},null,{"$f":"IF(SUM(W$24:W$27)>0,$E30*$H30,0)","v":0},null,{"$f":"IF(SUM(Y$24:Y$27)>0,$E30*$H30,0)","v":0},null,{"$f":"IF(SUM(AA$24:AA$27)>0,$E30*$H30,0)","v":0},null,{"$f":"IF(SUM(AC$24:AC$27)>0,$E30*$H30,0)","v":0},null,{"$f":"IF(SUM(AE$24:AE$27)>0,$E30*$H30,0)","v":0},null,{"$f":"IF(SUM(AG$24:AG$27)>0,$E30*$H30,0)","v":0},null,{"$f":"IF(SUM(AI$24:AI$27)>0,$E30*$H30,0)","v":0},null,{"$f":"IF(SUM(AK$24:AK$27)>0,$E30*$H30,0)","v":0},null,{"$f":"IF(SUM(AM$24:AM$27)>0,$E30*$H30,0)","v":0},null,{"$f":"IF(SUM(AO$24:AO$27)>0,$E30*$H30,0)","v":0},null,{"$f":"IF(SUM(AQ$24:AQ$27)>0,$E30*$H30,0)","v":0},null,{"$f":"IF(SUM(AS$24:AS$27)>0,$E30*$H30,0)","v":0},null,{"$f":"IF(SUM(AU$24:AU$27)>0,$E30*$H30,0)","v":0},null,{"$f":"IF(SUM(AW$24:AW$27)>0,$E30*$H30,0)","v":0},null,{"$f":"IF(SUM(AY$24:AY$27)>0,$E30*$H30,0)","v":0},null,{"$f":"IF(SUM(BA$24:BA$27)>0,$E30*$H30,0)","v":0},null,{"$f":"IF(SUM(BC$24:BC$27)>0,$E30*$H30,0)","v":0},null,{"$f":"IF(SUM(BE$24:BE$27)>0,$E30*$H30,0)","v":0},null,{"$f":"IF(SUM(BG$24:BG$27)>0,$E30*$H30,0)","v":0},null,{"$f":"IF(SUM(BI$24:BI$27)>0,$E30*$H30,0)","v":0},null,{"$f":"IF(SUM(BK$24:BK$27)>0,$E30*$H30,0)","v":0},null,{"$f":"IF(SUM(BM$24:BM$27)>0,$E30*$H30,0)","v":0},null,0,null,0,null,0,null,0,null,0,null,0,null,0,null,0,null,0,null,0,null,0,null,0,null,0,null,0,null,0,null,0,null,0,null,0,null,0,null,0,null,0,null,0,null,0,null,0,null,0,null,0,null,0,null,0,null,0,null,0,null,0,null,0]
[null,null,null,null,null,null,null,null,null,null,null,{"$f":"IF(SUM(K$24:K$27)>0,$E31*$H31,0)","v":0},null,{"$f":"IF(SUM(M$24:M$27)>0,$E31*$H31,0)","v":0},null,{"$f":"IF(SUM(O$24:O$27)>0,$E31*$H31,0)","v":0},null,{"$f":"IF(SUM(Q$24:Q$27)>0,$E31*$H31,0)","v":0},null,{"$f":"IF(SUM(S$24:S$27)>0,$E31*$H31,0)","v":0},null,{"$f":"IF(SUM(U$24:U$27)>0,$E31*$H31,0)","v":0},null,{"$f":"IF(SUM(W$24:W$27)>0,$E31*$H31,0)","v":0},null,{"$f":"IF(SUM(Y$24:Y$27)>0,$E31*$H31,0)","v":0},null,{"$f":"IF(SUM(AA$24:AA$27)>0,$E31*$H31,0)","v":0},null,{"$f":"IF(SUM(AC$24:AC$27)>0,$E31*$H31,0)","v":0},null,{"$f":"IF(SUM(AE$24:AE$27)>0,$E31*$H31,0)","v":0},null,{"$f":"IF(SUM(AG$24:AG$27)>0,$E31*$H31,0)","v":0},null,{"$f":"IF(SUM(AI$24:AI$27)>0,$E31*$H31,0)","v":0},null,{"$f":"IF(SUM(AK$24:AK$27)>0,$E31*$H31,0)","v":0},null,{"$f":"IF(SUM(AM$24:AM$27)>0,$E31*$H31,0)","v":0},null,{"$f":"IF(SUM(AO$24:AO$27)>0,$E31*$H31,0)","v":0},null,{"$f":"IF(SUM(AQ$24:AQ$27)>0,$E31*$H31,0)","v":0},null,{"$f":"IF(SUM(AS$24:AS$27)>0,$E31*$H31,0)","v":0},null,{"$f":"IF(SUM(AU$24:AU$27)>0,$E31*$H31,0)","v":0},null,0,null,0,null,0,null,0,null,0,null,0,null,0,null,0,null,0,null,0,null,0,null,0,null,0,null,0,null,0,null,0,null,0,null,0,null,0,null,0,null,0,null,0,null,0,null,0,null,0,null,0,null,0,null,0,null,0,null,0,null,0,null,0,null,0,null,0,null,0,null,0,null,0,null,0,null,0,null,0,null,0]
[null,null,null,null,null,null,null,null,null,null,null,0,null,{"$f":"IF(SUM(M$24:M$27)>0,$E32*$H32,0)","v":0},null,{"$f":"IF(SUM(O$24:O$27)>0,$E32*$H32,0)","v":0},null,{"$f":"IF(SUM(Q$24:Q$27)>0,$E32*$H32,0)","v":0},null,{"$f":"IF(SUM(S$24:S$27)>0,$E32*$H32,0)","v":0},null,{"$f":"IF(SUM(U$24:U$27)>0,$E32*$H32,0)","v":0},null,{"$f":"IF(SUM(W$24:W$27)>0,$E32*$H32,0)","v":0},null,{"$f":"IF(SUM(Y$24:Y$27)>0,$E32*$H32,0)","v":0},null,{"$f":"IF(SUM(AA$24:AA$27)>0,$E32*$H32,0)","v":0},null,{"$f":"IF(SUM(AC$24:AC$27)>0,$E32*$H32,0)","v":0},null,{"$f":"IF(SUM(AE$24:AE$27)>0,$E32*$H32,0)","v":0},null,{"$f":"IF(SUM(AG$24:AG$27)>0,$E32*$H32,0)","v":0},null,{"$f":"IF(SUM(AI$24:AI$27)>0,$E32*$H32,0)","v":0},null,{"$f":"IF(SUM(AK$24:AK$27)>0,$E32*$H32,0)","v":0},null,{"$f":"IF(SUM(AM$24:AM$27)>0,$E32*$H32,0)","v":0},null,{"$f":"IF(SUM(AO$24:AO$27)>0,$E32*$H32,0)","v":0},null,{"$f":"IF(SUM(AQ$24:AQ$27)>0,$E32*$H32,0)","v":0},null,{"$f":"IF(SUM(AS$24:AS$27)>0,$E32*$H32,0)","v":0},null,{"$f":"IF(SUM(AU$24:AU$27)>0,$E32*$H32,0)","v":0},null,0,null,0,null,0,null,0,null,0,null,0,null,0,null,0,null,0,null,0,null,0,null,0,null,0,null,0,null,0,null,0,null,0,null,0,null,0,null,0,null,0,null,0,null,0,null,0,null,0,null,0,null,0,null,0,null,0,null,0,null,0,null,0,null,0,null,0,null,0,null,0,null,0,null,0,null,0,null,0,null,0]
[null,null,null,null,null,null,null,null,null,null,null,0,null,{"$f":"IF(SUM(M$24:M$27)>0,$E33*$H33,0)","v":0},null,{"$f":"IF(SUM(O$24:O$27)>0,$E33*$H33,0)","v":0},null,{"$f":"IF(SUM(Q$24:Q$27)>0,$E33*$H33,0)","v":0},null,{"$f":"IF(SUM(S$24:S$27)>0,$E33*$H33,0)","v":0},null,{"$f":"IF(SUM(U$24:U$27)>0,$E33*$H33,0)","v":0},null,{"$f":"IF(SUM(W$24:W$27)>0,$E33*$H33,0)","v":0},null,{"$f":"IF(SUM(Y$24:Y$27)>0,$E33*$H33,0)","v":0},null,{"$f":"IF(SUM(AA$24:AA$27)>0,$E33*$H33,0)","v":0},null,{"$f":"IF(SUM(AC$24:AC$27)>0,$E33*$H33,0)","v":0},null,{"$f":"IF(SUM(AE$24:AE$27)>0,$E33*$H33,0)","v":0},null,{"$f":"IF(SUM(AG$24:AG$27)>0,$E33*$H33,0)","v":0},null,{"$f":"IF(SUM(AI$24:AI$27)>0,$E33*$H33,0)","v":0},null,{"$f":"IF(SUM(AK$24:AK$27)>0,$E33*$H33,0)","v":0},null,{"$f":"IF(SUM(AM$24:AM$27)>0,$E33*$H33,0)","v":0},null,{"$f":"IF(SUM(AO$24:AO$27)>0,$E33*$H33,0)","v":0},null,{"$f":"IF(SUM(AQ$24:AQ$27)>0,$E33*$H33,0)","v":0},null,{"$f":"IF(SUM(AS$24:AS$27)>0,$E33*$H33,0)","v":0},null,0,null,0,null,0,null,0,null,0,null,0,null,0,null,0,null,0,null,0,null,0,null,0,null,0,null,0,null,0,null,0,null,0,null,0,null,0,null,0,null,0,null,0,null,0,null,0,null,0,null,0,null,0,null,0,null,0,null,0,null,0,null,0,null,0,null,0,null,0,null,0,null,0,null,0,null,0,null,0,null,0,null,0]
[null,null,null,null,null,null,null,null,null,null,null,0,null,{"$f":"IF(SUM(M$24:M$27)>0,$E34*$H34,0)","v":0},null,{"$f":"IF(SUM(O$24:O$27)>0,$E34*$H34,0)","v":0},null,{"$f":"IF(SUM(Q$24:Q$27)>0,$E34*$H34,0)","v":0},null,{"$f":"IF(SUM(S$24:S$27)>0,$E34*$H34,0)","v":0},null,{"$f":"IF(SUM(U$24:U$27)>0,$E34*$H34,0)","v":0},null,{"$f":"IF(SUM(W$24:W$27)>0,$E34*$H34,0)","v":0},null,{"$f":"IF(SUM(Y$24:Y$27)>0,$E34*$H34,0)","v":0},null,{"$f":"IF(SUM(AA$24:AA$27)>0,$E34*$H34,0)","v":0},null,{"$f":"IF(SUM(AC$24:AC$27)>0,$E34*$H34,0)","v":0},null,{"$f":"IF(SUM(AE$24:AE$27)>0,$E34*$H34,0)","v":0},null,{"$f":"IF(SUM(AG$24:AG$27)>0,$E34*$H34,0)","v":0},null,{"$f":"IF(SUM(AI$24:AI$27)>0,$E34*$H34,0)","v":0},null,{"$f":"IF(SUM(AK$24:AK$27)>0,$E34*$H34,0)","v":0},null,{"$f":"IF(SUM(AM$24:AM$27)>0,$E34*$H34,0)","v":0},null,{"$f":"IF(SUM(AO$24:AO$27)>0,$E34*$H34,0)","v":0},null,{"$f":"IF(SUM(AQ$24:AQ$27)>0,$E34*$H34,0)","v":0},null,{"$f":"IF(SUM(AS$24:AS$27)>0,$E34*$H34,0)","v":0},null,0,null,0,null,0,null,0,null,0,null,0,null,0,null,0,null,0,null,0,null,0,null,0,null,0,null,0,null,0,null,0,null,0,null,0,null,0,null,0,null,0,null,0,null,0,null,0,null,0,null,0,null,0,null,0,null,0,null,0,null,0,null,0,null,0,null,0,null,0,null,0,null,0,null,0,null,0,null,0,null,0,null,0]
[null,null,"CATEGORIAS",null,null,null,null,"QUANTIDADE"]
[]
[null,null,null,{"$f":"HLOOKUP($C37,'Dados Gerais'!$D$5:$BK$10,6)","v":{"$error":"#N/A"}},null,null,null,{"$f":"HLOOKUP($C37,'Dados Gerais'!$D$5:$BK$14,10)","v":{"$error":"#N/A"}},null,null,{"$f":"IF($C37=K$6,1,0)","v":0},null,0,null,0,null,0,null,0,null,0,null,0,null,0,null,0,null,0,null,0,null,0,null,0,null,0,null,0,null,0,null,0,null,0,null,0,null,0,null,0,null,0,null,0,null,0,null,0,null,0,null,{"$f":"IF($C37=BK$6,1,0)","v":0},null,{"$f":"IF($C37=BM$6,1,0)","v":0},null,{"$f":"IF($C37=BO$6,1,0)","v":0},null,{"$f":"IF($C37=BQ$6,1,0)","v":0},null,{"$f":"IF($C37=BS$6,1,0)","v":0},null,{"$f":"IF($C37=BU$6,1,0)","v":0},null,{"$f":"IF($C37=BW$6,1,0)","v":0},null,{"$f":"IF($C37=BY$6,1,0)","v":0},null,{"$f":"IF($C37=CA$6,1,0)","v":0},null,{"$f":"IF($C37=CC$6,1,0)","v":0},null,{"$f":"IF($C37=CE$6,1,0)","v":0},null,{"$f":"IF($C37=CG$6,1,0)","v":0},null,{"$f":"IF($C37=CI$6,1,0)","v":0},null,{"$f":"IF($C37=CK$6,1,0)","v":0},null,{"$f":"IF($C37=CM$6,1,0)","v":0},null,{"$f":"IF($C37=CO$6,1,0)","v":0},null,{"$f":"IF($C37=CQ$6,1,0)","v":0},null,{"$f":"IF($C37=CS$6,1,0)","v":0},null,{"$f":"IF($C37=CU$6,1,0)","v":0},null,{"$f":"IF($C37=CW$6,1,0)","v":0},null,{"$f":"IF($C37=CY$6,1,0)","v":0},null,{"$f":"IF($C37=DA$6,1,0)","v":0},null,{"$f":"IF($C37=DC$6,1,0)","v":0},null,{"$f":"IF($C37=DE$6,1,0)","v":0},null,{"$f":"IF($C37=DG$6,1,0)","v":0},null,{"$f":"IF($C37=DI$6,1,0)","v":0},null,{"$f":"IF($C37=DK$6,1,0)","v":0},null,{"$f":"IF($C37=DM$6,1,0)","v":0},null,{"$f":"IF($C37=DO$6,1,0)","v":0},null,{"$f":"IF($C37=DQ$6,1,0)","v":0},null,{"$f":"IF($C37=DS$6,1,0)","v":0},null,{"$f":"IF($C37=DU$6,1,0)","v":0},null,{"$f":"IF($C37=DW$6,1,0)","v":0},null,{"$f":"IF($C37=DY$6,1,0)","v":0}]
[]
[]
[null,null,"ITEM","DESCRIÇÃO","QUANT ANUAL\nPOR POSTO","Nº DE POSTOS","QUANT ANUAL\nTOTAL","VALOR"]
[null,null,null,null,null,null,null,null,null,null,null,null,null,null,null,null,null,null,null,null,null,null,null,null,null,null,null,null,null,null,null,null,null,null,null,null,null,null,null,null,null,null,null,null,null,null,null,null,null,null,null,null,null,null,null,null,null,null,null,null,null,{"$f":"IF(SUM(BI$10:BI$10)>0,$E41*$H41,0)","v":0},null,{"$f":"IF(SUM(BK$10:BK$10)>0,$E41*$H41,0)","v":0},null,{"$f":"IF(SUM(BM$10:BM$10)>0,$E41*$H41,0)","v":0},null,{"$f":"IF(SUM(BO$10:BO$10)>0,$E41*$H41,0)","v":0},null,{"$f":"IF(SUM(BQ$10:BQ$10)>0,$E41*$H41,0)","v":0},null,{"$f":"IF(SUM(BS$10:BS$10)>0,$E41*$H41,0)","v":0},null,{"$f":"IF(SUM(BU$10:BU$10)>0,$E41*$H41,0)","v":0},null,{"$f":"IF(SUM(BW$10:BW$10)>0,$E41*$H41,0)","v":0},null,{"$f":"IF(SUM(BY$10:BY$10)>0,$E41*$H41,0)","v":0},null,{"$f":"IF(SUM(CA$10:CA$10)>0,$E41*$H41,0)","v":0},null,{"$f":"IF(SUM(CC$10:CC$10)>0,$E41*$H41,0)","v":0},null,{"$f":"IF(SUM(CE$10:CE$10)>0,$E41*$H41,0)","v":0},null,{"$f":"IF(SUM(CG$10:CG$10)>0,$E41*$H41,0)","v":0},null,{"$f":"IF(SUM(CI$10:CI$10)>0,$E41*$H41,0)","v":0},null,{"$f":"IF(SUM(CK$10:CK$10)>0,$E41*$H41,0)","v":0},null,{"$f":"IF(SUM(CM$10:CM$10)>0,$E41*$H41,0)","v":0},null,{"$f":"IF(SUM(CO$10:CO$10)>0,$E41*$H41,0)","v":0},null,{"$f":"IF(SUM(CQ$10:CQ$10)>0,$E41*$H41,0)","v":0},null,{"$f":"IF(SUM(CS$10:CS$10)>0,$E41*$H41,0)","v":0},null,{"$f":"IF(SUM(CU$10:CU$10)>0,$E41*$H41,0)","v":0},null,{"$f":"IF(SUM(CW$10:CW$10)>0,$E41*$H41,0)","v":0},null,{"$f":"IF(SUM(CY$10:CY$10)>0,$E41*$H41,0)","v":0},null,{"$f":"IF(SUM(DA$10:DA$10)>0,$E41*$H41,0)","v":0},null,{"$f":"IF(SUM(DC$10:DC$10)>0,$E41*$H41,0)","v":0},null,{"$f":"IF(SUM(DE$10:DE$10)>0,$E41*$H41,0)","v":0},null,{"$f":"IF(SUM(DG$10:DG$10)>0,$E41*$H41,0)","v":0},null,{"$f":"IF(SUM(DI$10:DI$10)>0,$E41*$H41,0)","v":0},null,{"$f":"IF(SUM(DK$10:DK$10)>0,$E41*$H41,0)","v":0},null,{"$f":"IF(SUM(DM$10:DM$10)>0,$E41*$H41,0)","v":0},null,{"$f":"IF(SUM(DO$10:DO$10)>0,$E41*$H41,0)","v":0},null,{"$f":"IF(SUM(DQ$10:DQ$10)>0,$E41*$H41,0)","v":0},null,{"$f":"IF(SUM(DS$10:DS$10)>0,$E41*$H41,0)","v":0},null,{"$f":"IF(SUM(DU$10:DU$10)>0,$E41*$H41,0)","v":0},null,{"$f":"IF(SUM(DW$10:DW$10)>0,$E41*$H41,0)","v":0},null,{"$f":"IF(SUM(DY$10:DY$10)>0,$E41*$H41,0)","v":0}]
[null,null,null,null,null,{"$f":"H37","v":{"$error":"#N/A"}},{"$f":"F42*E42","v":{"$error":"#N/A"}},null,null,null,null,{"$f":"IF(SUM(K$36:K$38)>0,$E42*$H42,0)","v":0},null,{"$f":"IF(SUM(M$36:M$38)>0,$E42*$H42,0)","v":0},null,{"$f":"IF(SUM(O$36:O$38)>0,$E42*$H42,0)","v":0},null,{"$f":"IF(SUM(Q$36:Q$38)>0,$E42*$H42,0)","v":0},null,{"$f":"IF(SUM(S$36:S$38)>0,$E42*$H42,0)","v":0},null,{"$f":"IF(SUM(U$36:U$38)>0,$E42*$H42,0)","v":0},null,{"$f":"IF(SUM(W$36:W$38)>0,$E42*$H42,0)","v":0},null,{"$f":"IF(SUM(Y$36:Y$38)>0,$E42*$H42,0)","v":0},null,{"$f":"IF(SUM(AA$36:AA$38)>0,$E42*$H42,0)","v":0},null,{"$f":"IF(SUM(AC$36:AC$38)>0,$E42*$H42,0)","v":0},null,{"$f":"IF(SUM(AE$36:AE$38)>0,$E42*$H42,0)","v":0},null,{"$f":"IF(SUM(AG$36:AG$38)>0,$E42*$H42,0)","v":0},null,{"$f":"IF(SUM(AI$36:AI$38)>0,$E42*$H42,0)","v":0},null,{"$f":"IF(SUM(AK$36:AK$38)>0,$E42*$H42,0)","v":0},null,{"$f":"IF(SUM(AM$36:AM$38)>0,$E42*$H42,0)","v":0},null,{"$f":"IF(SUM(AO$36:AO$38)>0,$E42*$H42,0)","v":0},null,{"$f":"IF(SUM(AQ$36:AQ$38)>0,$E42*$H42,0)","v":0},null,{"$f":"IF(SUM(AS$36:AS$38)>0,$E42*$H42,0)","v":0},null,{"$f":"IF(SUM(AU$36:AU$38)>0,$E42*$H42,0)","v":0},null,{"$f":"IF(SUM(AW$36:AW$38)>0,$E42*$H42,0)","v":0},null,{"$f":"IF(SUM(AY$36:AY$38)>0,$E42*$H42,0)","v":0},null,{"$f":"IF(SUM(BA$36:BA$38)>0,$E42*$H42,0)","v":0},null,{"$f":"IF(SUM(BC$36:BC$38)>0,$E42*$H42,0)","v":0},null,{"$f":"IF(SUM(BE$36:BE$38)>0,$E42*$H42,0)","v":0},null,{"$f":"IF(SUM(BG$36:BG$38)>0,$E42*$H42,0)","v":0},null,0,null,0,null,0,null,0,null,0,null,0,null,0,null,0,null,0,null,0,null,0,null,0,null,0,null,0,null,0,null,0,null,0,null,0,null,0,null,0,null,0,null,0,null,0,null,0,null,0,null,0,null,0,null,0,null,0,null,0,null,0,null,0,null,0,null,0,null,0]
[null,null,null,null,null,{"$f":"F42","v":{"$error":"#N/A"}},{"$error":"#N/A"},null,null,null,null,{"$f":"IF(SUM(K$36:K$38)>0,$E43*$H43,0)","v":0},null,{"$f":"IF(SUM(M$36:M$38)>0,$E43*$H43,0)","v":0},null,{"$f":"IF(SUM(O$36:O$38)>0,$E43*$H43,0)","v":0},null,{"$f":"IF(SUM(Q$36:Q$38)>0,$E43*$H43,0)","v":0},null,{"$f":"IF(SUM(S$36:S$38)>0,$E43*$H43,0)","v":0},null,{"$f":"IF(SUM(U$36:U$38)>0,$E43*$H43,0)","v":0},null,{"$f":"IF(SUM(W$36:W$38)>0,$E43*$H43,0)","v":0},null,{"$f":"IF(SUM(Y$36:Y$38)>0,$E43*$H43,0)","v":0},null,{"$f":"IF(SUM(AA$36:AA$38)>0,$E43*$H43,0)","v":0},null,{"$f":"IF(SUM(AC$36:AC$38)>0,$E43*$H43,0)","v":0},null,{"$f":"IF(SUM(AE$36:AE$38)>0,$E43*$H43,0)","v":0},null,{"$f":"IF(SUM(AG$36:AG$38)>0,$E43*$H43,0)","v":0},null,{"$f":"IF(SUM(AI$36:AI$38)>0,$E43*$H43,0)","v":0},null,{"$f":"IF(SUM(AK$36:AK$38)>0,$E43*$H43,0)","v":0},null,{"$f":"IF(SUM(AM$36:AM$38)>0,$E43*$H43,0)","v":0},null,{"$f":"IF(SUM(AO$36:AO$38)>0,$E43*$H43,0)","v":0},null,{"$f":"IF(SUM(AQ$36:AQ$38)>0,$E43*$H43,0)","v":0},null,{"$f":"IF(SUM(AS$36:AS$38)>0,$E43*$H43,0)","v":0},null,{"$f":"IF(SUM(AU$36:AU$38)>0,$E43*$H43,0)","v":0},null,0,null,0,null,0,null,0,null,0,null,0,null,0,null,0,null,0,null,0,null,0,null,0,null,0,null,0,null,0,null,0,null,0,null,0,null,0,null,0,null,0,null,0,null,0,null,0,null,0,null,0,null,0,null,0,null,0,null,0,null,0,null,0,null,0,null,0,null,0,null,0,null,0,null,0,null,0,null,0,null,0]
[null,null,null,null,null,{"$f":"F43","v":{"$error":"#N/A"}},{"$error":"#N/A"},null,null,null,null,0,null,{"$f":"IF(SUM(M$36:M$38)>0,$E44*$H44,0)","v":0},null,{"$f":"IF(SUM(O$36:O$38)>0,$E44*$H44,0)","v":0},null,{"$f":"IF(SUM(Q$36:Q$38)>0,$E44*$H44,0)","v":0},null,{"$f":"IF(SUM(S$36:S$38)>0,$E44*$H44,0)","v":0},null,{"$f":"IF(SUM(U$36:U$38)>0,$E44*$H44,0)","v":0},null,{"$f":"IF(SUM(W$36:W$38)>0,$E44*$H44,0)","v":0},null,{"$f":"IF(SUM(Y$36:Y$38)>0,$E44*$H44,0)","v":0},null,{"$f":"IF(SUM(AA$36:AA$38)>0,$E44*$H44,0)","v":0},null,{"$f":"IF(SUM(AC$36:AC$38)>0,$E44*$H44,0)","v":0},null,{"$f":"IF(SUM(AE$36:AE$38)>0,$E44*$H44,0)","v":0},null,{"$f":"IF(SUM(AG$36:AG$38)>0,$E44*$H44,0)","v":0},null,{"$f":"IF(SUM(AI$36:AI$38)>0,$E44*$H44,0)","v":0},null,{"$f":"IF(SUM(AK$36:AK$38)>0,$E44*$H44,0)","v":0},null,{"$f":"IF(SUM(AM$36:AM$38)>0,$E44*$H44,0)","v":0},null,{"$f":"IF(SUM(AO$36:AO$38)>0,$E44*$H44,0)","v":0},null,{"$f":"IF(SUM(AQ$36:AQ$38)>0,$E44*$H44,0)","v":0},null,{"$f":"IF(SUM(AS$36:AS$38)>0,$E44*$H44,0)","v":0},null,{"$f":"IF(SUM(AU$36:AU$38)>0,$E44*$H44,0)","v":0},null,0,null,0,null,0,null,0,null,0,null,0,null,0,null,0,null,0,null,0,null,0,null,0,null,0,null,0,null,0,null,0,null,0,null,0,null,0,null,0,null,0,null,0,null,0,null,0,null,0,null,0,null,0,null,0,null,0,null,0,null,0,null,0,null,0,null,0,null,0,null,0,null,0,null,0,null,0,null,0,null,0]
[null,null,null,null,null,{"$error":"#N/A"},{"$error":"#N/A"},null,null,null,null,0,null,{"$f":"IF(SUM(M$36:M$38)>0,$E45*$H45,0)","v":0},null,{"$f":"IF(SUM(O$36:O$38)>0,$E45*$H45,0)","v":0},null,{"$f":"IF(SUM(Q$36:Q$38)>0,$E45*$H45,0)","v":0},null,{"$f":"IF(SUM(S$36:S$38)>0,$E45*$H45,0)","v":0},null,{"$f":"IF(SUM(U$36:U$38)>0,$E45*$H45,0)","v":0},null,{"$f":"IF(SUM(W$36:W$38)>0,$E45*$H45,0)","v":0},null,{"$f":"IF(SUM(Y$36:Y$38)>0,$E45*$H45,0)","v":0},null,{"$f":"IF(SUM(AA$36:AA$38)>0,$E45*$H45,0)","v":0},null,{"$f":"IF(SUM(AC$36:AC$38)>0,$E45*$H45,0)","v":0},null,{"$f":"IF(SUM(AE$36:AE$38)>0,$E45*$H45,0)","v":0},null,{"$f":"IF(SUM(AG$36:AG$38)>0,$E45*$H45,0)","v":0},null,{"$f":"IF(SUM(AI$36:AI$38)>0,$E45*$H45,0)","v":0},null,{"$f":"IF(SUM(AK$36:AK$38)>0,$E45*$H45,0)","v":0},null,{"$f":"IF(SUM(AM$36:AM$38)>0,$E45*$H45,0)","v":0},null,{"$f":"IF(SUM(AO$36:AO$38)>0,$E45*$H45,0)","v":0},null,{"$f":"IF(SUM(AQ$36:AQ$38)>0,$E45*$H45,0)","v":0},null,{"$f":"IF(SUM(AS$36:AS$38)>0,$E45*$H45,0)","v":0},null,0,null,0,null,0,null,0,null,0,null,0,null,0,null,0,null,0,null,0,null,0,null,0,null,0,null,0,null,0,null,0,null,0,null,0,null,0,null,0,null,0,null,0,null,0,null,0,null,0,null,0,null,0,null,0,null,0,null,0,null,0,null,0,null,0,null,0,null,0,null,0,null,0,null,0,null,0,null,0,null,0,null,0]
[null,null,null,null,null,{"$error":"#N/A"},{"$error":"#N/A"},null,null,null,null,0,null,{"$f":"IF(SUM(M$36:M$38)>0,$E46*$H46,0)","v":0},null,{"$f":"IF(SUM(O$36:O$38)>0,$E46*$H46,0)","v":0},null,{"$f":"IF(SUM(Q$36:Q$38)>0,$E46*$H46,0)","v":0},null,{"$f":"IF(SUM(S$36:S$38)>0,$E46*$H46,0)","v":0},null,{"$f":"IF(SUM(U$36:U$38)>0,$E46*$H46,0)","v":0},null,{"$f":"IF(SUM(W$36:W$38)>0,$E46*$H46,0)","v":0},null,{"$f":"IF(SUM(Y$36:Y$38)>0,$E46*$H46,0)","v":0},null,{"$f":"IF(SUM(AA$36:AA$38)>0,$E46*$H46,0)","v":0},null,{"$f":"IF(SUM(AC$36:AC$38)>0,$E46*$H46,0)","v":0},null,{"$f":"IF(SUM(AE$36:AE$38)>0,$E46*$H46,0)","v":0},null,{"$f":"IF(SUM(AG$36:AG$38)>0,$E46*$H46,0)","v":0},null,{"$f":"IF(SUM(AI$36:AI$38)>0,$E46*$H46,0)","v":0},null,{"$f":"IF(SUM(AK$36:AK$38)>0,$E46*$H46,0)","v":0},null,{"$f":"IF(SUM(AM$36:AM$38)>0,$E46*$H46,0)","v":0},null,{"$f":"IF(SUM(AO$36:AO$38)>0,$E46*$H46,0)","v":0},null,{"$f":"IF(SUM(AQ$36:AQ$38)>0,$E46*$H46,0)","v":0},null,{"$f":"IF(SUM(AS$36:AS$38)>0,$E46*$H46,0)","v":0},null,0,null,0,null,0,null,0,null,0,null,0,null,0,null,0,null,0,null,0,null,0,null,0,null,0,null,0,null,0,null,0,null,0,null,0,null,0,null,0,null,0,null,0,null,0,null,0,null,0,null,0,null,0,null,0,null,0,null,0,null,0,null,0,null,0,null,0,null,0,null,0,null,0,null,0,null,0,null,0,null,0,null,0]
[null,null,null,null,null,{"$error":"#N/A"},{"$error":"#N/A"},null,null,null,null,0,null,{"$f":"IF(SUM(M$36:M$38)>0,$E47*$H47,0)","v":0},null,{"$f":"IF(SUM(O$36:O$38)>0,$E47*$H47,0)","v":0},null,{"$f":"IF(SUM(Q$36:Q$38)>0,$E47*$H47,0)","v":0},null,{"$f":"IF(SUM(S$36:S$38)>0,$E47*$H47,0)","v":0},null,{"$f":"IF(SUM(U$36:U$38)>0,$E47*$H47,0)","v":0},null,{"$f":"IF(SUM(W$36:W$38)>0,$E47*$H47,0)","v":0},null,{"$f":"IF(SUM(Y$36:Y$38)>0,$E47*$H47,0)","v":0},null,{"$f":"IF(SUM(AA$36:AA$38)>0,$E47*$H47,0)","v":0},null,{"$f":"IF(SUM(AC$36:AC$38)>0,$E47*$H47,0)","v":0},null,{"$f":"IF(SUM(AE$36:AE$38)>0,$E47*$H47,0)","v":0},null,{"$f":"IF(SUM(AG$36:AG$38)>0,$E47*$H47,0)","v":0},null,{"$f":"IF(SUM(AI$36:AI$38)>0,$E47*$H47,0)","v":0},null,{"$f":"IF(SUM(AK$36:AK$38)>0,$E47*$H47,0)","v":0},null,{"$f":"IF(SUM(AM$36:AM$38)>0,$E47*$H47,0)","v":0},null,{"$f":"IF(SUM(AO$36:AO$38)>0,$E47*$H47,0)","v":0},null,{"$f":"IF(SUM(AQ$36:AQ$38)>0,$E47*$H47,0)","v":0},null,{"$f":"IF(SUM(AS$36:AS$38)>0,$E47*$H47,0)","v":0},null,0,null,0,null,0,null,0,null,0,null,0,null,0,null,0,null,0,null,0,null,0,null,0,null,0,null,0,null,0,null,0,null,0,null,0,null,0,null,0,null,0,null,0,null,0,null,0,null,0,null,0,null,0,null,0,null,0,null,0,null,0,null,0,null,0,null,0,null,0,null,0,null,0,null,0,null,0,null,0,null,0,null,0]
[null,null,null,null,null,null,null,null,null,null,null,0,null,{"$f":"IF(SUM(M$36:M$38)>0,$E48*$H48,0)","v":0},null,{"$f":"IF(SUM(O$36:O$38)>0,$E48*$H48,0)","v":0},null,{"$f":"IF(SUM(Q$36:Q$38)>0,$E48*$H48,0)","v":0},null,{"$f":"IF(SUM(S$36:S$38)>0,$E48*$H48,0)","v":0},null,{"$f":"IF(SUM(U$36:U$38)>0,$E48*$H48,0)","v":0},null,{"$f":"IF(SUM(W$36:W$38)>0,$E48*$H48,0)","v":0},null,{"$f":"IF(SUM(Y$36:Y$38)>0,$E48*$H48,0)","v":0},null,{"$f":"IF(SUM(AA$36:AA$38)>0,$E48*$H48,0)","v":0},null,{"$f":"IF(SUM(AC$36:AC$38)>0,$E48*$H48,0)","v":0},null,{"$f":"IF(SUM(AE$36:AE$38)>0,$E48*$H48,0)","v":0},null,{"$f":"IF(SUM(AG$36:AG$38)>0,$E48*$H48,0)","v":0},null,{"$f":"IF(SUM(AI$36:AI$38)>0,$E48*$H48,0)","v":0},null,{"$f":"IF(SUM(AK$36:AK$38)>0,$E48*$H48,0)","v":0},null,{"$f":"IF(SUM(AM$36:AM$38)>0,$E48*$H48,0)","v":0},null,{"$f":"IF(SUM(AO$36:AO$38)>0,$E48*$H48,0)","v":0},null,{"$f":"IF(SUM(AQ$36:AQ$38)>0,$E48*$H48,0)","v":0},null,{"$f":"IF(SUM(AS$36:AS$38)>0,$E48*$H48,0)","v":0},null,0,null,0,null,0,null,0,null,0,null,0,null,0,null,0,null,0,null,0,null,0,null,0,null,0,null,0,null,0,null,0,null,0,null,0,null,0,null,0,null,0,null,0,null,0,null,0,null,0,null,0,null,0,null,0,null,0,null,0,null,0,null,0,null,0,null,0,null,0,null,0,null,0,null,0,null,0,null,0,null,0,null,0]
[null,null,"CATEGORIAS",null,null,null,null,"QUANTIDADE"]
[]
[null,null,null,{"$f":"HLOOKUP($C51,'Dados Gerais'!$D$5:$BK$10,6)","v":{"$error":"#N/A"}},null,null,null,{"$f":"HLOOKUP($C51,'Dados Gerais'!$D$5:$BK$14,10)","v":{"$error":"#N/A"}},null,null,{"$f":"IF($C51=K$6,1,0)","v":0},null,0,null,0,null,0,null,0,null,0,null,0,null,0,null,{"$f":"IF($C51=AA$6,1,0)","v":0},null,0,null,0,null,0,null,0,null,0,null,0,null,0,null,0,null,0,null,{"$f":"IF($C51=AU$6,1,0)","v":0},null,{"$f":"IF($C51=AW$6,1,0)","v":0},null,{"$f":"IF($C51=AY$6,1,0)","v":0},null,{"$f":"IF($C51=BA$6,1,0)","v":0},null,{"$f":"IF($C51=BC$6,1,0)","v":0},null,{"$f":"IF($C51=BE$6,1,0)","v":0},null,{"$f":"IF($C51=BG$6,1,0)","v":0},null,{"$f":"IF($C51=BI$6,1,0)","v":0},null,{"$f":"IF($C51=BK$6,1,0)","v":0},null,{"$f":"IF($C51=BM$6,1,0)","v":0},null,{"$f":"IF($C51=BO$6,1,0)","v":0},null,{"$f":"IF($C51=BQ$6,1,0)","v":0},null,{"$f":"IF($C51=BS$6,1,0)","v":0},null,{"$f":"IF($C51=BU$6,1,0)","v":0},null,{"$f":"IF($C51=BW$6,1,0)","v":0},null,{"$f":"IF($C51=BY$6,1,0)","v":0},null,{"$f":"IF($C51=CA$6,1,0)","v":0},null,{"$f":"IF($C51=CC$6,1,0)","v":0},null,{"$f":"IF($C51=CE$6,1,0)","v":0},null,{"$f":"IF($C51=CG$6,1,0)","v":0},null,{"$f":"IF($C51=CI$6,1,0)","v":0},null,{"$f":"IF($C51=CK$6,1,0)","v":0},null,{"$f":"IF($C51=CM$6,1,0)","v":0},null,{"$f":"IF($C51=CO$6,1,0)","v":0},null,{"$f":"IF($C51=CQ$6,1,0)","v":0},null,{"$f":"IF($C51=CS$6,1,0)","v":0},null,{"$f":"IF($C51=CU$6,1,0)","v":0},null,{"$f":"IF($C51=CW$6,1,0)","v":0},null,{"$f":"IF($C51=CY$6,1,0)","v":0},null,{"$f":"IF($C51=DA$6,1,0)","v":0},null,{"$f":"IF($C51=DC$6,1,0)","v":0},null,{"$f":"IF($C51=DE$6,1,0)","v":0},null,{"$f":"IF($C51=DG$6,1,0)","v":0},null,{"$f":"IF($C51=DI$6,1,0)","v":0},null,{"$f":"IF($C51=DK$6,1,0)","v":0},null,{"$f":"IF($C51=DM$6,1,0)","v":0},null,{"$f":"IF($C51=DO$6,1,0)","v":0},null,{"$f":"IF($C51=DQ$6,1,0)","v":0},null,{"$f":"IF($C51=DS$6,1,0)","v":0},null,{"$f":"IF($C51=DU$6,1,0)","v":0},null,{"$f":"IF($C51=DW$6,1,0)","v":0},null,{"$f":"IF($C51=DY$6,1,0)","v":0}]
[null,null,null,{"$f":"HLOOKUP($C52,'Dados Gerais'!$D$5:$BK$10,6)","v":{"$error":"#N/A"}},null,null,null,{"$f":"HLOOKUP($C52,'Dados Gerais'!$D$5:$BK$14,10)","v":{"$error":"#N/A"}},null,null,0,null,0,null,0,null,0,null,0,null,0,null,0,null,0,null,0,null,0,null,0,null,0,null,0,null,0,null,0,null,0,null,0,null,0,null,0,null,0,null,0,null,0,null,0,null,0,null,0,null,0,null,0,null,0,null,0,null,0,null,0,null,0,null,0,null,0,null,0,null,0,null,0,null,0,null,0,null,0,null,0,null,0,null,0,null,0,null,0,null,0,null,0,null,0,null,0,null,0,null,0,null,0,null,0,null,0,null,0,null,0,null,0,null,0,null,0,null,0]
[]
[]
[null,null,"ITEM","DESCRIÇÃO","QUANT ANUAL\nPOR POSTO","Nº DE POSTOS","QUANT ANUAL\nTOTAL","VALOR"]
[null,null,null,null,null,null,null,null,null,null,null,null,null,null,null,null,null,null,null,null,null,null,null,null,null,null,null,null,null,null,null,null,null,null,null,null,null,null,null,null,null,null,null,null,null,null,null,{"$f":"IF(SUM(AU$10:AU$10)>0,$E56*$H56,0)","v":0},null,{"$f":"IF(SUM(AW$10:AW$10)>0,$E56*$H56,0)","v":0},null,{"$f":"IF(SUM(AY$10:AY$10)>0,$E56*$H56,0)","v":0},null,{"$f":"IF(SUM(BA$10:BA$10)>0,$E56*$H56,0)","v":0},null,{"$f":"IF(SUM(BC$10:BC$10)>0,$E56*$H56,0)","v":0},null,{"$f":"IF(SUM(BE$10:BE$10)>0,$E56*$H56,0)","v":0},null,{"$f":"IF(SUM(BG$10:BG$10)>0,$E56*$H56,0)","v":0},null,{"$f":"IF(SUM(BI$10:BI$10)>0,$E56*$H56,0)","v":0},null,{"$f":"IF(SUM(BK$10:BK$10)>0,$E56*$H56,0)","v":0},null,{"$f":"IF(SUM(BM$10:BM$10)>0,$E56*$H56,0)","v":0},null,{"$f":"IF(SUM(BO$10:BO$10)>0,$E56*$H56,0)","v":0},null,{"$f":"IF(SUM(BQ$10:BQ$10)>0,$E56*$H56,0)","v":0},null,{"$f":"IF(SUM(BS$10:BS$10)>0,$E56*$H56,0)","v":0},null,{"$f":"IF(SUM(BU$10:BU$10)>0,$E56*$H56,0)","v":0},null,{"$f":"IF(SUM(BW$10:BW$10)>0,$E56*$H56,0)","v":0},null,{"$f":"IF(SUM(BY$10:BY$10)>0,$E56*$H56,0)","v":0},null,{"$f":"IF(SUM(CA$10:CA$10)>0,$E56*$H56,0)","v":0},null,{"$f":"IF(SUM(CC$10:CC$10)>0,$E56*$H56,0)","v":0},null,{"$f":"IF(SUM(CE$10:CE$10)>0,$E56*$H56,0)","v":0},null,{"$f":"IF(SUM(CG$10:CG$10)>0,$E56*$H56,0)","v":0},null,{"$f":"IF(SUM(CI$10:CI$10)>0,$E56*$H56,0)","v":0},null,{"$f":"IF(SUM(CK$10:CK$10)>0,$E56*$H56,0)","v":0},null,{"$f":"IF(SUM(CM$10:CM$10)>0,$E56*$H56,0)","v":0},null,{"$f":"IF(SUM(CO$10:CO$10)>0,$E56*$H56,0)","v":0},null,{"$f":"IF(SUM(CQ$10:CQ$10)>0,$E56*$H56,0)","v":0},null,{"$f":"IF(SUM(CS$10:CS$10)>0,$E56*$H56,0)","v":0},null,{"$f":"IF(SUM(CU$10:CU$10)>0,$E56*$H56,0)","v":0},null,{"$f":"IF(SUM(CW$10:CW$10)>0,$E56*$H56,0)","v":0},null,{"$f":"IF(SUM(CY$10:CY$10)>0,$E56*$H56,0)","v":0},null,{"$f":"IF(SUM(DA$10:DA$10)>0,$E56*$H56,0)","v":0},null,{"$f":"IF(SUM(DC$10:DC$10)>0,$E56*$H56,0)","v":0},null,{"$f":"IF(SUM(DE$10:DE$10)>0,$E56*$H56,0)","v":0},null,{"$f":"IF(SUM(DG$10:DG$10)>0,$E56*$H56,0)","v":0},null,{"$f":"IF(SUM(DI$10:DI$10)>0,$E56*$H56,0)","v":0},null,{"$f":"IF(SUM(DK$10:DK$10)>0,$E56*$H56,0)","v":0},null,{"$f":"IF(SUM(DM$10:DM$10)>0,$E56*$H56,0)","v":0},null,{"$f":"IF(SUM(DO$10:DO$10)>0,$E56*$H56,0)","v":0},null,{"$f":"IF(SUM(DQ$10:DQ$10)>0,$E56*$H56,0)","v":0},null,{"$f":"IF(SUM(DS$10:DS$10)>0,$E56*$H56,0)","v":0},null,{"$f":"IF(SUM(DU$10:DU$10)>0,$E56*$H56,0)","v":0},null,{"$f":"IF(SUM(DW$10:DW$10)>0,$E56*$H56,0)","v":0},null,{"$f":"IF(SUM(DY$10:DY$10)>0,$E56*$H56,0)","v":0}]
[null,null,null,null,null,{"$f":"H51+H52","v":{"$error":"#N/A"}},{"$f":"F57*E57","v":{"$error":"#N/A"}},null,null,null,null,{"$f":"IF(SUM(K$50:K$53)>0,$E57*$H57,0)","v":0},null,{"$f":"IF(SUM(M$50:M$53)>0,$E57*$H57,0)","v":0},null,{"$f":"IF(SUM(O$50:O$53)>0,$E57*$H57,0)","v":0},null,{"$f":"IF(SUM(Q$50:Q$53)>0,$E57*$H57,0)","v":0},null,{"$f":"IF(SUM(S$50:S$53)>0,$E57*$H57,0)","v":0},null,{"$f":"IF(SUM(U$50:U$53)>0,$E57*$H57,0)","v":0},null,{"$f":"IF(SUM(W$50:W$53)>0,$E57*$H57,0)","v":0},null,{"$f":"IF(SUM(Y$50:Y$53)>0,$E57*$H57,0)","v":0},null,{"$f":"IF(SUM(AA$50:AA$53)>0,$E57*$H57,0)","v":0},null,{"$f":"IF(SUM(AC$50:AC$53)>0,$E57*$H57,0)","v":0},null,{"$f":"IF(SUM(AE$50:AE$53)>0,$E57*$H57,0)","v":0},null,{"$f":"IF(SUM(AG$50:AG$53)>0,$E57*$H57,0)","v":0},null,{"$f":"IF(SUM(AI$50:AI$53)>0,$E57*$H57,0)","v":0},null,{"$f":"IF(SUM(AK$50:AK$53)>0,$E57*$H57,0)","v":0},null,{"$f":"IF(SUM(AM$50:AM$53)>0,$E57*$H57,0)","v":0},null,{"$f":"IF(SUM(AO$50:AO$53)>0,$E57*$H57,0)","v":0},null,{"$f":"IF(SUM(AQ$50:AQ$53)>0,$E57*$H57,0)","v":0},null,{"$f":"IF(SUM(AS$50:AS$53)>0,$E57*$H57,0)","v":0},null,0,null,0,null,0,null,0,null,0,null,0,null,0,null,0,null,0,null,0,null,0,null,0,null,0,null,0,null,0,null,0,null,0,null,0,null,0,null,0,null,0,null,0,null,0,null,0,null,0,null,0,null,0,null,0,null,0,null,0,null,0,null,0,null,0,null,0,null,0,null,0,null,0,null,0,null,0,null,0,null,0,null,0]
[null,null,null,null,null,{"$f":"F57","v":{"$error":"#N/A"}},{"$error":"#N/A"},null,null,null,null,{"$f":"IF(SUM(K$50:K$53)>0,$E58*$H58,0)","v":0},null,{"$f":"IF(SUM(M$50:M$53)>0,$E58*$H58,0)","v":0},null,{"$f":"IF(SUM(O$50:O$53)>0,$E58*$H58,0)","v":0},null,{"$f":"IF(SUM(Q$50:Q$53)>0,$E58*$H58,0)","v":0},null,{"$f":"IF(SUM(S$50:S$53)>0,$E58*$H58,0)","v":0},null,{"$f":"IF(SUM(U$50:U$53)>0,$E58*$H58,0)","v":0},null,{"$f":"IF(SUM(W$50:W$53)>0,$E58*$H58,0)","v":0},null,{"$f":"IF(SUM(Y$50:Y$53)>0,$E58*$H58,0)","v":0},null,{"$f":"IF(SUM(AA$50:AA$53)>0,$E58*$H58,0)","v":0},null,{"$f":"IF(SUM(AC$50:AC$53)>0,$E58*$H58,0)","v":0},null,{"$f":"IF(SUM(AE$50:AE$53)>0,$E58*$H58,0)","v":0},null,{"$f":"IF(SUM(AG$50:AG$53)>0,$E58*$H58,0)","v":0},null,{"$f":"IF(SUM(AI$50:AI$53)>0,$E58*$H58,0)","v":0},null,{"$f":"IF(SUM(AK$50:AK$53)>0,$E58*$H58,0)","v":0},null,{"$f":"IF(SUM(AM$50:AM$53)>0,$E58*$H58,0)","v":0},null,{"$f":"IF(SUM(AO$50:AO$53)>0,$E58*$H58,0)","v":0},null,{"$f":"IF(SUM(AQ$50:AQ$53)>0,$E58*$H58,0)","v":0},null,{"$f":"IF(SUM(AS$50:AS$53)>0,$E58*$H58,0)","v":0},null,0,null,0,null,0,null,0,null,0,null,0,null,0,null,0,null,0,null,0,null,0,null,0,null,0,null,0,null,0,null,0,null,0,null,0,null,0,null,0,null,0,null,0,null,0,null,0,null,0,null,0,null,0,null,0,null,0,null,0,null,0,null,0,null,0,null,0,null,0,null,0,null,0,null,0,null,0,null,0,null,0,null,0]
[null,null,null,null,null,{"$f":"F58","v":{"$error":"#N/A"}},{"$error":"#N/A"},null,null,null,null,0,null,{"$f":"IF(SUM(M$50:M$53)>0,$E59*$H59,0)","v":0},null,{"$f":"IF(SUM(O$50:O$53)>0,$E59*$H59,0)","v":0},null,{"$f":"IF(SUM(Q$50:Q$53)>0,$E59*$H59,0)","v":0},null,{"$f":"IF(SUM(S$50:S$53)>0,$E59*$H59,0)","v":0},null,{"$f":"IF(SUM(U$50:U$53)>0,$E59*$H59,0)","v":0},null,{"$f":"IF(SUM(W$50:W$53)>0,$E59*$H59,0)","v":0},null,{"$f":"IF(SUM(Y$50:Y$53)>0,$E59*$H59,0)","v":0},null,{"$f":"IF(SUM(AA$50:AA$53)>0,$E59*$H59,0)","v":0},null,{"$f":"IF(SUM(AC$50:AC$53)>0,$E59*$H59,0)","v":0},null,{"$f":"IF(SUM(AE$50:AE$53)>0,$E59*$H59,0)","v":0},null,{"$f":"IF(SUM(AG$50:AG$53)>0,$E59*$H59,0)","v":0},null,{"$f":"IF(SUM(AI$50:AI$53)>0,$E59*$H59,0)","v":0},null,{"$f":"IF(SUM(AK$50:AK$53)>0,$E59*$H59,0)","v":0},null,{"$f":"IF(SUM(AM$50:AM$53)>0,$E59*$H59,0)","v":0},null,{"$f":"IF(SUM(AO$50:AO$53)>0,$E59*$H59,0)","v":0},null,{"$f":"IF(SUM(AQ$50:AQ$53)>0,$E59*$H59,0)","v":0},null,{"$f":"IF(SUM(AS$50:AS$53)>0,$E59*$H59,0)","v":0},null,0,null,0,null,0,null,0,null,0,null,0,null,0,null,0,null,0,null,0,null,0,null,0,null,0,null,0,null,0,null,0,null,0,null,0,null,0,null,0,null,0,null,0,null,0,null,0,null,0,null,0,null,0,null,0,null,0,null,0,null,0,null,0,null,0,null,0,null,0,null,0,null,0,null,0,null,0,null,0,null,0,null,0]
[null,null,null,null,null,{"$error":"#N/A"},{"$error":"#N/A"},null,null,null,null,0,null,{"$f":"IF(SUM(M$50:M$53)>0,$E60*$H60,0)","v":0},null,{"$f":"IF(SUM(O$50:O$53)>0,$E60*$H60,0)","v":0},null,{"$f":"IF(SUM(Q$50:Q$53)>0,$E60*$H60,0)","v":0},null,{"$f":"IF(SUM(S$50:S$53)>0,$E60*$H60,0)","v":0},null,{"$f":"IF(SUM(U$50:U$53)>0,$E60*$H60,0)","v":0},null,{"$f":"IF(SUM(W$50:W$53)>0,$E60*$H60,0)","v":0},null,{"$f":"IF(SUM(Y$50:Y$53)>0,$E60*$H60,0)","v":0},null,{"$f":"IF(SUM(AA$50:AA$53)>0,$E60*$H60,0)","v":0},null,{"$f":"IF(SUM(AC$50:AC$53)>0,$E60*$H60,0)","v":0},null,{"$f":"IF(SUM(AE$50:AE$53)>0,$E60*$H60,0)","v":0},null,{"$f":"IF(SUM(AG$50:AG$53)>0,$E60*$H60,0)","v":0},null,{"$f":"IF(SUM(AI$50:AI$53)>0,$E60*$H60,0)","v":0},null,{"$f":"IF(SUM(AK$50:AK$53)>0,$E60*$H60,0)","v":0},null,{"$f":"IF(SUM(AM$50:AM$53)>0,$E60*$H60,0)","v":0},null,{"$f":"IF(SUM(AO$50:AO$53)>0,$E60*$H60,0)","v":0},null,{"$f":"IF(SUM(AQ$50:AQ$53)>0,$E60*$H60,0)","v":0},null,{"$f":"IF(SUM(AS$50:AS$53)>0,$E60*$H60,0)","v":0},null,0,null,0,null,0,null,0,null,0,null,0,null,0,null,0,null,0,null,0,null,0,null,0,null,0,null,0,null,0,null,0,null,0,null,0,null,0,null,0,null,0,null,0,null,0,null,0,null,0,null,0,null,0,null,0,null,0,null,0,null,0,null,0,null,0,null,0,null,0,null,0,null,0,null,0,null,0,null,0,null,0,null,0]
[null,null,null,null,null,{"$error":"#N/A"},{"$error":"#N/A"},null,null,null,null,0,null,{"$f":"IF(SUM(M$50:M$53)>0,$E61*$H61,0)","v":0},null,{"$f":"IF(SUM(O$50:O$53)>0,$E61*$H61,0)","v":0},null,{"$f":"IF(SUM(Q$50:Q$53)>0,$E61*$H61,0)","v":0},null,{"$f":"IF(SUM(S$50:S$53)>0,$E61*$H61,0)","v":0},null,{"$f":"IF(SUM(U$50:U$53)>0,$E61*$H61,0)","v":0},null,{"$f":"IF(SUM(W$50:W$53)>0,$E61*$H61,0)","v":0},null,{"$f":"IF(SUM(Y$50:Y$53)>0,$E61*$H61,0)","v":0},null,{"$f":"IF(SUM(AA$50:AA$53)>0,$E61*$H61,0)","v":0},null,{"$f":"IF(SUM(AC$50:AC$53)>0,$E61*$H61,0)","v":0},null,{"$f":"IF(SUM(AE$50:AE$53)>0,$E61*$H61,0)","v":0},null,{"$f":"IF(SUM(AG$50:AG$53)>0,$E61*$H61,0)","v":0},null,{"$f":"IF(SUM(AI$50:AI$53)>0,$E61*$H61,0)","v":0},null,{"$f":"IF(SUM(AK$50:AK$53)>0,$E61*$H61,0)","v":0},null,{"$f":"IF(SUM(AM$50:AM$53)>0,$E61*$H61,0)","v":0},null,{"$f":"IF(SUM(AO$50:AO$53)>0,$E61*$H61,0)","v":0},null,{"$f":"IF(SUM(AQ$50:AQ$53)>0,$E61*$H61,0)","v":0},null,{"$f":"IF(SUM(AS$50:AS$53)>0,$E61*$H61,0)","v":0},null,0,null,0,null,0,null,0,null,0,null,0,null,0,null,0,null,0,null,0,null,0,null,0,null,0,null,0,null,0,null,0,null,0,null,0,null,0,null,0,null,0,null,0,null,0,null,0,null,0,null,0,null,0,null,0,null,0,null,0,null,0,null,0,null,0,null,0,null,0,null,0,null,0,null,0,null,0,null,0,null,0,null,0]
[null,null,null,null,null,null,null,null,null,null,null,0,null,{"$f":"IF(SUM(M$50:M$53)>0,$E62*$H62,0)","v":0},null,{"$f":"IF(SUM(O$50:O$53)>0,$E62*$H62,0)","v":0},null,{"$f":"IF(SUM(Q$50:Q$53)>0,$E62*$H62,0)","v":0},null,{"$f":"IF(SUM(S$50:S$53)>0,$E62*$H62,0)","v":0},null,{"$f":"IF(SUM(U$50:U$53)>0,$E62*$H62,0)","v":0},null,{"$f":"IF(SUM(W$50:W$53)>0,$E62*$H62,0)","v":0},null,{"$f":"IF(SUM(Y$50:Y$53)>0,$E62*$H62,0)","v":0},null,{"$f":"IF(SUM(AA$50:AA$53)>0,$E62*$H62,0)","v":0},null,{"$f":"IF(SUM(AC$50:AC$53)>0,$E62*$H62,0)","v":0},null,{"$f":"IF(SUM(AE$50:AE$53)>0,$E62*$H62,0)","v":0},null,{"$f":"IF(SUM(AG$50:AG$53)>0,$E62*$H62,0)","v":0},null,{"$f":"IF(SUM(AI$50:AI$53)>0,$E62*$H62,0)","v":0},null,{"$f":"IF(SUM(AK$50:AK$53)>0,$E62*$H62,0)","v":0},null,{"$f":"IF(SUM(AM$50:AM$53)>0,$E62*$H62,0)","v":0},null,{"$f":"IF(SUM(AO$50:AO$53)>0,$E62*$H62,0)","v":0},null,{"$f":"IF(SUM(AQ$50:AQ$53)>0,$E62*$H62,0)","v":0},null,{"$f":"IF(SUM(AS$50:AS$53)>0,$E62*$H62,0)","v":0},null,0,null,0,null,0,null,0,null,0,null,0,null,0,null,0,null,0,null,0,null,0,null,0,null,0,null,0,null,0,null,0,null,0,null,0,null,0,null,0,null,0,null,0,null,0,null,0,null,0,null,0,null,0,null,0,null,0,null,0,null,0,null,0,null,0,null,0,null,0,null,0,null,0,null,0,null,0,null,0,null,0,null,0]
[null,null,"CATEGORIAS",null,null,null,null,"QUANTIDADE"]
[]
[null,null,null,{"$f":"HLOOKUP($C65,'Dados Gerais'!$D$5:$BK$10,6)","v":{"$error":"#N/A"}},null,null,null,{"$f":"HLOOKUP($C65,'Dados Gerais'!$D$5:$BK$14,10)","v":{"$error":"#N/A"}},null,null,{"$f":"IF($C65=K$6,1,0)","v":0},null,0,null,0,null,0,null,0,null,0,null,0,null,0,null,0,null,0,null,0,null,0,null,0,null,0,null,0,null,0,null,0,null,0,null,0,null,{"$f":"IF($C65=AW$6,1,0)","v":0},null,{"$f":"IF($C65=AY$6,1,0)","v":0},null,{"$f":"IF($C65=BA$6,1,0)","v":0},null,{"$f":"IF($C65=BC$6,1,0)","v":0},null,{"$f":"IF($C65=BE$6,1,0)","v":0},null,{"$f":"IF($C65=BG$6,1,0)","v":0},null,{"$f":"IF($C65=BI$6,1,0)","v":0},null,{"$f":"IF($C65=BK$6,1,0)","v":0},null,{"$f":"IF($C65=BM$6,1,0)","v":0},null,{"$f":"IF($C65=BO$6,1,0)","v":0},null,{"$f":"IF($C65=BQ$6,1,0)","v":0},null,{"$f":"IF($C65=BS$6,1,0)","v":0},null,{"$f":"IF($C65=BU$6,1,0)","v":0},null,{"$f":"IF($C65=BW$6,1,0)","v":0},null,{"$f":"IF($C65=BY$6,1,0)","v":0},null,{"$f":"IF($C65=CA$6,1,0)","v":0},null,{"$f":"IF($C65=CC$6,1,0)","v":0},null,{"$f":"IF($C65=CE$6,1,0)","v":0},null,{"$f":"IF($C65=CG$6,1,0)","v":0},null,{"$f":"IF($C65=CI$6,1,0)","v":0},null,{"$f":"IF($C65=CK$6,1,0)","v":0},null,{"$f":"IF($C65=CM$6,1,0)","v":0},null,{"$f":"IF($C65=CO$6,1,0)","v":0},null,{"$f":"IF($C65=CQ$6,1,0)","v":0},null,{"$f":"IF($C65=CS$6,1,0)","v":0},null,{"$f":"IF($C65=CU$6,1,0)","v":0},null,{"$f":"IF($C65=CW$6,1,0)","v":0},null,{"$f":"IF($C65=CY$6,1,0)","v":0},null,{"$f":"IF($C65=DA$6,1,0)","v":0},null,{"$f":"IF($C65=DC$6,1,0)","v":0},null,{"$f":"IF($C65=DE$6,1,0)","v":0},null,{"$f":"IF($C65=DG$6,1,0)","v":0},null,{"$f":"IF($C65=DI$6,1,0)","v":0},null,{"$f":"IF($C65=DK$6,1,0)","v":0},null,{"$f":"IF($C65=DM$6,1,0)","v":0},null,{"$f":"IF($C65=DO$6,1,0)","v":0},null,{"$f":"IF($C65=DQ$6,1,0)","v":0},null,{"$f":"IF($C65=DS$6,1,0)","v":0},null,{"$f":"IF($C65=DU$6,1,0)","v":0},null,{"$f":"IF($C65=DW$6,1,0)","v":0},null,{"$f":"IF($C65=DY$6,1,0)","v":0}]
[]
[]
[null,null,"ITEM","DESCRIÇÃO","QUANT ANUAL\nPOR POSTO","Nº DE POSTOS","QUANT ANUAL\nTOTAL","VALOR"]
[null,null,null,null,null,null,null,null,null,null,null,null,null,null,null,null,null,null,null,null,null,null,null,null,null,null,null,null,null,null,null,null,null,null,null,null,null,null,null,null,null,null,null,null,null,null,null,{"$f":"IF(SUM(AU$10:AU$10)>0,$E69*$H69,0)","v":0},null,{"$f":"IF(SUM(AW$10:AW$10)>0,$E69*$H69,0)","v":0},null,{"$f":"IF(SUM(AY$10:AY$10)>0,$E69*$H69,0)","v":0},null,{"$f":"IF(SUM(BA$10:BA$10)>0,$E69*$H69,0)","v":0},null,{"$f":"IF(SUM(BC$10:BC$10)>0,$E69*$H69,0)","v":0},null,{"$f":"IF(SUM(BE$10:BE$10)>0,$E69*$H69,0)","v":0},null,{"$f":"IF(SUM(BG$10:BG$10)>0,$E69*$H69,0)","v":0},null,{"$f":"IF(SUM(BI$10:BI$10)>0,$E69*$H69,0)","v":0},null,{"$f":"IF(SUM(BK$10:BK$10)>0,$E69*$H69,0)","v":0},null,{"$f":"IF(SUM(BM$10:BM$10)>0,$E69*$H69,0)","v":0},null,{"$f":"IF(SUM(BO$10:BO$10)>0,$E69*$H69,0)","v":0},null,{"$f":"IF(SUM(BQ$10:BQ$10)>0,$E69*$H69,0)","v":0},null,{"$f":"IF(SUM(BS$10:BS$10)>0,$E69*$H69,0)","v":0},null,{"$f":"IF(SUM(BU$10:BU$10)>0,$E69*$H69,0)","v":0},null,{"$f":"IF(SUM(BW$10:BW$10)>0,$E69*$H69,0)","v":0},null,{"$f":"IF(SUM(BY$10:BY$10)>0,$E69*$H69,0)","v":0},null,{"$f":"IF(SUM(CA$10:CA$10)>0,$E69*$H69,0)","v":0},null,{"$f":"IF(SUM(CC$10:CC$10)>0,$E69*$H69,0)","v":0},null,{"$f":"IF(SUM(CE$10:CE$10)>0,$E69*$H69,0)","v":0},null,{"$f":"IF(SUM(CG$10:CG$10)>0,$E69*$H69,0)","v":0},null,{"$f":"IF(SUM(CI$10:CI$10)>0,$E69*$H69,0)","v":0},null,{"$f":"IF(SUM(CK$10:CK$10)>0,$E69*$H69,0)","v":0},null,{"$f":"IF(SUM(CM$10:CM$10)>0,$E69*$H69,0)","v":0},null,{"$f":"IF(SUM(CO$10:CO$10)>0,$E69*$H69,0)","v":0},null,{"$f":"IF(SUM(CQ$10:CQ$10)>0,$E69*$H69,0)","v":0},null,{"$f":"IF(SUM(CS$10:CS$10)>0,$E69*$H69,0)","v":0},null,{"$f":"IF(SUM(CU$10:CU$10)>0,$E69*$H69,0)","v":0},null,{"$f":"IF(SUM(CW$10:CW$10)>0,$E69*$H69,0)","v":0},null,{"$f":"IF(SUM(CY$10:CY$10)>0,$E69*$H69,0)","v":0},null,{"$f":"IF(SUM(DA$10:DA$10)>0,$E69*$H69,0)","v":0},null,{"$f":"IF(SUM(DC$10:DC$10)>0,$E69*$H69,0)","v":0},null,{"$f":"IF(SUM(DE$10:DE$10)>0,$E69*$H69,0)","v":0},null,{"$f":"IF(SUM(DG$10:DG$10)>0,$E69*$H69,0)","v":0},null,{"$f":"IF(SUM(DI$10:DI$10)>0,$E69*$H69,0)","v":0},null,{"$f":"IF(SUM(DK$10:DK$10)>0,$E69*$H69,0)","v":0},null,{"$f":"IF(SUM(DM$10:DM$10)>0,$E69*$H69,0)","v":0},null,{"$f":"IF(SUM(DO$10:DO$10)>0,$E69*$H69,0)","v":0},null,{"$f":"IF(SUM(DQ$10:DQ$10)>0,$E69*$H69,0)","v":0},null,{"$f":"IF(SUM(DS$10:DS$10)>0,$E69*$H69,0)","v":0},null,{"$f":"IF(SUM(DU$10:DU$10)>0,$E69*$H69,0)","v":0},null,{"$f":"IF(SUM(DW$10:DW$10)>0,$E69*$H69,0)","v":0},null,{"$f":"IF(SUM(DY$10:DY$10)>0,$E69*$H69,0)","v":0}]
[null,null,null,null,null,{"$f":"H65","v":{"$error":"#N/A"}},{"$f":"F70*E70","v":{"$error":"#N/A"}},null,null,null,null,{"$f":"IF(SUM(K$64:K$66)>0,$E70*$H70,0)","v":0},null,{"$f":"IF(SUM(M$64:M$66)>0,$E70*$H70,0)","v":0},null,{"$f":"IF(SUM(O$64:O$66)>0,$E70*$H70,0)","v":0},null,{"$f":"IF(SUM(Q$64:Q$66)>0,$E70*$H70,0)","v":0},null,{"$f":"IF(SUM(S$64:S$66)>0,$E70*$H70,0)","v":0},null,{"$f":"IF(SUM(U$64:U$66)>0,$E70*$H70,0)","v":0},null,{"$f":"IF(SUM(W$64:W$66)>0,$E70*$H70,0)","v":0},null,{"$f":"IF(SUM(Y$64:Y$66)>0,$E70*$H70,0)","v":0},null,{"$f":"IF(SUM(AA$64:AA$66)>0,$E70*$H70,0)","v":0},null,{"$f":"IF(SUM(AC$64:AC$66)>0,$E70*$H70,0)","v":0},null,{"$f":"IF(SUM(AE$64:AE$66)>0,$E70*$H70,0)","v":0},null,{"$f":"IF(SUM(AG$64:AG$66)>0,$E70*$H70,0)","v":0},null,{"$f":"IF(SUM(AI$64:AI$66)>0,$E70*$H70,0)","v":0},null,{"$f":"IF(SUM(AK$64:AK$66)>0,$E70*$H70,0)","v":0},null,{"$f":"IF(SUM(AM$64:AM$66)>0,$E70*$H70,0)","v":0},null,{"$f":"IF(SUM(AO$64:AO$66)>0,$E70*$H70,0)","v":0},null,{"$f":"IF(SUM(AQ$64:AQ$66)>0,$E70*$H70,0)","v":0},null,{"$f":"IF(SUM(AS$64:AS$66)>0,$E70*$H70,0)","v":0},null,0,null,0,null,0,null,0,null,0,null,0,null,0,null,0,null,0,null,0,null,0,null,0,null,0,null,0,null,0,null,0,null,0,null,0,null,0,null,0,null,0,null,0,null,0,null,0,null,0,null,0,null,0,null,0,null,0,null,0,null,0,null,0,null,0,null,0,null,0,null,0,null,0,null,0,null,0,null,0,null,0,null,0]
[null,null,null,null,null,{"$f":"F70","v":{"$error":"#N/A"}},{"$error":"#N/A"},null,null,null,null,{"$f":"IF(SUM(K$64:K$66)>0,$E71*$H71,0)","v":0},null,{"$f":"IF(SUM(M$64:M$66)>0,$E71*$H71,0)","v":0},null,{"$f":"IF(SUM(O$64:O$66)>0,$E71*$H71,0)","v":0},null,{"$f":"IF(SUM(Q$64:Q$66)>0,$E71*$H71,0)","v":0},null,{"$f":"IF(SUM(S$64:S$66)>0,$E71*$H71,0)","v":0},null,{"$f":"IF(SUM(U$64:U$66)>0,$E71*$H71,0)","v":0},null,{"$f":"IF(SUM(W$64:W$66)>0,$E71*$H71,0)","v":0},null,{"$f":"IF(SUM(Y$64:Y$66)>0,$E71*$H71,0)","v":0},null,{"$f":"IF(SUM(AA$64:AA$66)>0,$E71*$H71,0)","v":0},null,{"$f":"IF(SUM(AC$64:AC$66)>0,$E71*$H71,0)","v":0},null,{"$f":"IF(SUM(AE$64:AE$66)>0,$E71*$H71,0)","v":0},null,{"$f":"IF(SUM(AG$64:AG$66)>0,$E71*$H71,0)","v":0},null,{"$f":"IF(SUM(AI$64:AI$66)>0,$E71*$H71,0)","v":0},null,{"$f":"IF(SUM(AK$64:AK$66)>0,$E71*$H71,0)","v":0},null,{"$f":"IF(SUM(AM$64:AM$66)>0,$E71*$H71,0)","v":0},null,{"$f":"IF(SUM(AO$64:AO$66)>0,$E71*$H71,0)","v":0},null,{"$f":"IF(SUM(AQ$64:AQ$66)>0,$E71*$H71,0)","v":0},null,{"$f":"IF(SUM(AS$64:AS$66)>0,$E71*$H71,0)","v":0},null,0,null,0,null,0,null,0,null,0,null,0,null,0,null,0,null,0,null,0,null,0,null,0,null,0,null,0,null,0,null,0,null,0,null,0,null,0,null,0,null,0,null,0,null,0,null,0,null,0,null,0,null,0,null,0,null,0,null,0,null,0,null,0,null,0,null,0,null,0,null,0,null,0,null,0,null,0,null,0,null,0,null,0]
[null,null,null,null,null,{"$f":"F71","v":{"$error":"#N/A"}},{"$error":"#N/A"},null,null,null,null,0,null,{"$f":"IF(SUM(M$64:M$66)>0,$E72*$H72,0)","v":0},null,{"$f":"IF(SUM(O$64:O$66)>0,$E72*$H72,0)","v":0},null,{"$f":"IF(SUM(Q$64:Q$66)>0,$E72*$H72,0)","v":0},null,{"$f":"IF(SUM(S$64:S$66)>0,$E72*$H72,0)","v":0},null,{"$f":"IF(SUM(U$64:U$66)>0,$E72*$H72,0)","v":0},null,{"$f":"IF(SUM(W$64:W$66)>0,$E72*$H72,0)","v":0},null,{"$f":"IF(SUM(Y$64:Y$66)>0,$E72*$H72,0)","v":0},null,{"$f":"IF(SUM(AA$64:AA$66)>0,$E72*$H72,0)","v":0},null,{"$f":"IF(SUM(AC$64:AC$66)>0,$E72*$H72,0)","v":0},null,{"$f":"IF(SUM(AE$64:AE$66)>0,$E72*$H72,0)","v":0},null,{"$f":"IF(SUM(AG$64:AG$66)>0,$E72*$H72,0)","v":0},null,{"$f":"IF(SUM(AI$64:AI$66)>0,$E72*$H72,0)","v":0},null,{"$f":"IF(SUM(AK$64:AK$66)>0,$E72*$H72,0)","v":0},null,{"$f":"IF(SUM(AM$64:AM$66)>0,$E72*$H72,0)","v":0},null,{"$f":"IF(SUM(AO$64:AO$66)>0,$E72*$H72,0)","v":0},null,{"$f":"IF(SUM(AQ$64:AQ$66)>0,$E72*$H72,0)","v":0},null,{"$f":"IF(SUM(AS$64:AS$66)>0,$E72*$H72,0)","v":0},null,0,null,0,null,0,null,0,null,0,null,0,null,0,null,0,null,0,null,0,null,0,null,0,null,0,null,0,null,0,null,0,null,0,null,0,null,0,null,0,null,0,null,0,null,0,null,0,null,0,null,0,null,0,null,0,null,0,null,0,null,0,null,0,null,0,null,0,null,0,null,0,null,0,null,0,null,0,null,0,null,0,null,0]
[null,null,null,null,null,{"$f":"F71","v":{"$error":"#N/A"}},{"$f":"F73*E73","v":{"$error":"#N/A"}},null,null,null,null,0,null,{"$f":"IF(SUM(M$64:M$66)>0,$E73*$H73,0)","v":0},null,{"$f":"IF(SUM(O$64:O$66)>0,$E73*$H73,0)","v":0},null,{"$f":"IF(SUM(Q$64:Q$66)>0,$E73*$H73,0)","v":0},null,{"$f":"IF(SUM(S$64:S$66)>0,$E73*$H73,0)","v":0},null,{"$f":"IF(SUM(U$64:U$66)>0,$E73*$H73,0)","v":0},null,{"$f":"IF(SUM(W$64:W$66)>0,$E73*$H73,0)","v":0},null,{"$f":"IF(SUM(Y$64:Y$66)>0,$E73*$H73,0)","v":0},null,{"$f":"IF(SUM(AA$64:AA$66)>0,$E73*$H73,0)","v":0},null,{"$f":"IF(SUM(AC$64:AC$66)>0,$E73*$H73,0)","v":0},null,{"$f":"IF(SUM(AE$64:AE$66)>0,$E73*$H73,0)","v":0},null,{"$f":"IF(SUM(AG$64:AG$66)>0,$E73*$H73,0)","v":0},null,{"$f":"IF(SUM(AI$64:AI$66)>0,$E73*$H73,0)","v":0},null,{"$f":"IF(SUM(AK$64:AK$66)>0,$E73*$H73,0)","v":0},null,{"$f":"IF(SUM(AM$64:AM$66)>0,$E73*$H73,0)","v":0},null,{"$f":"IF(SUM(AO$64:AO$66)>0,$E73*$H73,0)","v":0},null,{"$f":"IF(SUM(AQ$64:AQ$66)>0,$E73*$H73,0)","v":0},null,{"$f":"IF(SUM(AS$64:AS$66)>0,$E73*$H73,0)","v":0},null,0,null,0,null,0,null,0,null,0,null,0,null,0,null,0,null,0,null,0,null,0,null,0,null,0,null,0,null,0,null,0,null,0,null,0,null,0,null,0,null,0,null,0,null,0,null,0,null,0,null,0,null,0,null,0,null,0,null,0,null,0,null,0,null,0,null,0,null,0,null,0,null,0,null,0,null,0,null,0,null,0,null,0]
[null,null,null,null,null,{"$f":"F72","v":{"$error":"#N/A"}},{"$error":"#N/A"},null,null,null,null,0,null,{"$f":"IF(SUM(M$64:M$66)>0,$E74*$H74,0)","v":0},null,{"$f":"IF(SUM(O$64:O$66)>0,$E74*$H74,0)","v":0},null,{"$f":"IF(SUM(Q$64:Q$66)>0,$E74*$H74,0)","v":0},null,{"$f":"IF(SUM(S$64:S$66)>0,$E74*$H74,0)","v":0},null,{"$f":"IF(SUM(U$64:U$66)>0,$E74*$H74,0)","v":0},null,{"$f":"IF(SUM(W$64:W$66)>0,$E74*$H74,0)","v":0},null,{"$f":"IF(SUM(Y$64:Y$66)>0,$E74*$H74,0)","v":0},null,{"$f":"IF(SUM(AA$64:AA$66)>0,$E74*$H74,0)","v":0},null,{"$f":"IF(SUM(AC$64:AC$66)>0,$E74*$H74,0)","v":0},null,{"$f":"IF(SUM(AE$64:AE$66)>0,$E74*$H74,0)","v":0},null,{"$f":"IF(SUM(AG$64:AG$66)>0,$E74*$H74,0)","v":0},null,{"$f":"IF(SUM(AI$64:AI$66)>0,$E74*$H74,0)","v":0},null,{"$f":"IF(SUM(AK$64:AK$66)>0,$E74*$H74,0)","v":0},null,{"$f":"IF(SUM(AM$64:AM$66)>0,$E74*$H74,0)","v":0},null,{"$f":"IF(SUM(AO$64:AO$66)>0,$E74*$H74,0)","v":0},null,{"$f":"IF(SUM(AQ$64:AQ$66)>0,$E74*$H74,0)","v":0},null,{"$f":"IF(SUM(AS$64:AS$66)>0,$E74*$H74,0)","v":0},null,0,null,0,null,0,null,0,null,0,null,0,null,0,null,0,null,0,null,0,null,0,null,0,null,0,null,0,null,0,null,0,null,0,null,0,null,0,null,0,null,0,null,0,null,0,null,0,null,0,null,0,null,0,null,0,null,0,null,0,null,0,null,0,null,0,null,0,null,0,null,0,null,0,null,0,null,0,null,0,null,0,null,0]
[null,null,null,null,null,null,null,null,null,null,null,0,null,{"$f":"IF(SUM(M$64:M$66)>0,$E75*$H75,0)","v":0},null,{"$f":"IF(SUM(O$64:O$66)>0,$E75*$H75,0)","v":0},null,{"$f":"IF(SUM(Q$64:Q$66)>0,$E75*$H75,0)","v":0},null,{"$f":"IF(SUM(S$64:S$66)>0,$E75*$H75,0)","v":0},null,{"$f":"IF(SUM(U$64:U$66)>0,$E75*$H75,0)","v":0},null,{"$f":"IF(SUM(W$64:W$66)>0,$E75*$H75,0)","v":0},null,{"$f":"IF(SUM(Y$64:Y$66)>0,$E75*$H75,0)","v":0},null,{"$f":"IF(SUM(AA$64:AA$66)>0,$E75*$H75,0)","v":0},null,{"$f":"IF(SUM(AC$64:AC$66)>0,$E75*$H75,0)","v":0},null,{"$f":"IF(SUM(AE$64:AE$66)>0,$E75*$H75,0)","v":0},null,{"$f":"IF(SUM(AG$64:AG$66)>0,$E75*$H75,0)","v":0},null,{"$f":"IF(SUM(AI$64:AI$66)>0,$E75*$H75,0)","v":0},null,{"$f":"IF(SUM(AK$64:AK$66)>0,$E75*$H75,0)","v":0},null,{"$f":"IF(SUM(AM$64:AM$66)>0,$E75*$H75,0)","v":0},null,{"$f":"IF(SUM(AO$64:AO$66)>0,$E75*$H75,0)","v":0},null,{"$f":"IF(SUM(AQ$64:AQ$66)>0,$E75*$H75,0)","v":0},null,{"$f":"IF(SUM(AS$64:AS$66)>0,$E75*$H75,0)","v":0},null,0,null,0,null,0,null,0,null,0,null,0,null,0,null,0,null,0,null,0,null,0,null,0,null,0,null,0,null,0,null,0,null,0,null,0,null,0,null,0,null,0,null,0,null,0,null,0,null,0,null,0,null,0,null,0,null,0,null,0,null,0,null,0,null,0,null,0,null,0,null,0,null,0,null,0,null,0,null,0,null,0,null,0]
[null,null,"CATEGORIAS",null,null,null,null,"QUANTIDADE"]
[]
[null,null,null,{"$f":"HLOOKUP($C78,'Dados Gerais'!$D$5:$BK$10,6)","v":{"$error":"#N/A"}},null,null,null,{"$f":"HLOOKUP($C78,'Dados Gerais'!$D$5:$BK$14,10)","v":{"$error":"#N/A"}},null,null,{"$f":"IF($C78=K$6,1,0)","v":0},null,0,null,0,null,0,null,0,null,0,null,0,null,0,null,0,null,0,null,0,null,0,null,0,null,0,null,0,null,0,null,0,null,0,null,{"$f":"IF($C78=AU$6,1,0)","v":0},null,{"$f":"IF($C78=AW$6,1,0)","v":0},null,{"$f":"IF($C78=AY$6,1,0)","v":0},null,{"$f":"IF($C78=BA$6,1,0)","v":0},null,{"$f":"IF($C78=BC$6,1,0)","v":0},null,{"$f":"IF($C78=BE$6,1,0)","v":0},null,{"$f":"IF($C78=BG$6,1,0)","v":0},null,{"$f":"IF($C78=BI$6,1,0)","v":0},null,{"$f":"IF($C78=BK$6,1,0)","v":0},null,{"$f":"IF($C78=BM$6,1,0)","v":0},null,{"$f":"IF($C78=BO$6,1,0)","v":0},null,{"$f":"IF($C78=BQ$6,1,0)","v":0},null,{"$f":"IF($C78=BS$6,1,0)","v":0},null,{"$f":"IF($C78=BU$6,1,0)","v":0},null,{"$f":"IF($C78=BW$6,1,0)","v":0},null,{"$f":"IF($C78=BY$6,1,0)","v":0},null,{"$f":"IF($C78=CA$6,1,0)","v":0},null,{"$f":"IF($C78=CC$6,1,0)","v":0},null,{"$f":"IF($C78=CE$6,1,0)","v":0},null,{"$f":"IF($C78=CG$6,1,0)","v":0},null,{"$f":"IF($C78=CI$6,1,0)","v":0},null,{"$f":"IF($C78=CK$6,1,0)","v":0},null,{"$f":"IF($C78=CM$6,1,0)","v":0},null,{"$f":"IF($C78=CO$6,1,0)","v":0},null,{"$f":"IF($C78=CQ$6,1,0)","v":0},null,{"$f":"IF($C78=CS$6,1,0)","v":0},null,{"$f":"IF($C78=CU$6,1,0)","v":0},null,{"$f":"IF($C78=CW$6,1,0)","v":0},null,{"$f":"IF($C78=CY$6,1,0)","v":0},null,{"$f":"IF($C78=DA$6,1,0)","v":0},null,{"$f":"IF($C78=DC$6,1,0)","v":0},null,{"$f":"IF($C78=DE$6,1,0)","v":0},null,{"$f":"IF($C78=DG$6,1,0)","v":0},null,{"$f":"IF($C78=DI$6,1,0)","v":0},null,{"$f":"IF($C78=DK$6,1,0)","v":0},null,{"$f":"IF($C78=DM$6,1,0)","v":0},null,{"$f":"IF($C78=DO$6,1,0)","v":0},null,{"$f":"IF($C78=DQ$6,1,0)","v":0},null,{"$f":"IF($C78=DS$6,1,0)","v":0},null,{"$f":"IF($C78=DU$6,1,0)","v":0},null,{"$f":"IF($C78=DW$6,1,0)","v":0},null,{"$f":"IF($C78=DY$6,1,0)","v":0}]
[]
[]
[null,null,"ITEM","DESCRIÇÃO","QUANT ANUAL\nPOR POSTO","Nº DE POSTOS","QUANT ANUAL\nTOTAL","VALOR"]
[null,null,null,null,null,null,null,null,null,null,null,null,null,null,null,null,null,null,null,null,null,null,null,null,null,null,null,null,null,null,null,null,null,null,null,null,null,null,null,null,null,null,null,null,null,null,null,{"$f":"IF(SUM(AU$10:AU$10)>0,$E82*$H82,0)","v":0},null,{"$f":"IF(SUM(AW$10:AW$10)>0,$E82*$H82,0)","v":0},null,{"$f":"IF(SUM(AY$10:AY$10)>0,$E82*$H82,0)","v":0},null,{"$f":"IF(SUM(BA$10:BA$10)>0,$E82*$H82,0)","v":0},null,{"$f":"IF(SUM(BC$10:BC$10)>0,$E82*$H82,0)","v":0},null,{"$f":"IF(SUM(BE$10:BE$10)>0,$E82*$H82,0)","v":0},null,{"$f":"IF(SUM(BG$10:BG$10)>0,$E82*$H82,0)","v":0},null,{"$f":"IF(SUM(BI$10:BI$10)>0,$E82*$H82,0)","v":0},null,{"$f":"IF(SUM(BK$10:BK$10)>0,$E82*$H82,0)","v":0},null,{"$f":"IF(SUM(BM$10:BM$10)>0,$E82*$H82,0)","v":0},null,{"$f":"IF(SUM(BO$10:BO$10)>0,$E82*$H82,0)","v":0},null,{"$f":"IF(SUM(BQ$10:BQ$10)>0,$E82*$H82,0)","v":0},null,{"$f":"IF(SUM(BS$10:BS$10)>0,$E82*$H82,0)","v":0},null,{"$f":"IF(SUM(BU$10:BU$10)>0,$E82*$H82,0)","v":0},null,{"$f":"IF(SUM(BW$10:BW$10)>0,$E82*$H82,0)","v":0},null,{"$f":"IF(SUM(BY$10:BY$10)>0,$E82*$H82,0)","v":0},null,{"$f":"IF(SUM(CA$10:CA$10)>0,$E82*$H82,0)","v":0},null,{"$f":"IF(SUM(CC$10:CC$10)>0,$E82*$H82,0)","v":0},null,{"$f":"IF(SUM(CE$10:CE$10)>0,$E82*$H82,0)","v":0},null,{"$f":"IF(SUM(CG$10:CG$10)>0,$E82*$H82,0)","v":0},null,{"$f":"IF(SUM(CI$10:CI$10)>0,$E82*$H82,0)","v":0},null,{"$f":"IF(SUM(CK$10:CK$10)>0,$E82*$H82,0)","v":0},null,{"$f":"IF(SUM(CM$10:CM$10)>0,$E82*$H82,0)","v":0},null,{"$f":"IF(SUM(CO$10:CO$10)>0,$E82*$H82,0)","v":0},null,{"$f":"IF(SUM(CQ$10:CQ$10)>0,$E82*$H82,0)","v":0},null,{"$f":"IF(SUM(CS$10:CS$10)>0,$E82*$H82,0)","v":0},null,{"$f":"IF(SUM(CU$10:CU$10)>0,$E82*$H82,0)","v":0},null,{"$f":"IF(SUM(CW$10:CW$10)>0,$E82*$H82,0)","v":0},null,{"$f":"IF(SUM(CY$10:CY$10)>0,$E82*$H82,0)","v":0},null,{"$f":"IF(SUM(DA$10:DA$10)>0,$E82*$H82,0)","v":0},null,{"$f":"IF(SUM(DC$10:DC$10)>0,$E82*$H82,0)","v":0},null,{"$f":"IF(SUM(DE$10:DE$10)>0,$E82*$H82,0)","v":0},null,{"$f":"IF(SUM(DG$10:DG$10)>0,$E82*$H82,0)","v":0},null,{"$f":"IF(SUM(DI$10:DI$10)>0,$E82*$H82,0)","v":0},null,{"$f":"IF(SUM(DK$10:DK$10)>0,$E82*$H82,0)","v":0},null,{"$f":"IF(SUM(DM$10:DM$10)>0,$E82*$H82,0)","v":0},null,{"$f":"IF(SUM(DO$10:DO$10)>0,$E82*$H82,0)","v":0},null,{"$f":"IF(SUM(DQ$10:DQ$10)>0,$E82*$H82,0)","v":0},null,{"$f":"IF(SUM(DS$10:DS$10)>0,$E82*$H82,0)","v":0},null,{"$f":"IF(SUM(DU$10:DU$10)>0,$E82*$H82,0)","v":0},null,{"$f":"IF(SUM(DW$10:DW$10)>0,$E82*$H82,0)","v":0},null,{"$f":"IF(SUM(DY$10:DY$10)>0,$E82*$H82,0)","v":0}]
[null,null,null,null,null,{"$f":"H78","v":{"$error":"#N/A"}},{"$f":"F83*E83","v":{"$error":"#N/A"}},null,null,null,null,{"$f":"IF(SUM(K$77:K$79)>0,$E83*$H83,0)","v":0},null,{"$f":"IF(SUM(M$77:M$79)>0,$E83*$H83,0)","v":0},null,{"$f":"IF(SUM(O$77:O$79)>0,$E83*$H83,0)","v":0},null,{"$f":"IF(SUM(Q$77:Q$79)>0,$E83*$H83,0)","v":0},null,{"$f":"IF(SUM(S$77:S$79)>0,$E83*$H83,0)","v":0},null,{"$f":"IF(SUM(U$77:U$79)>0,$E83*$H83,0)","v":0},null,{"$f":"IF(SUM(W$77:W$79)>0,$E83*$H83,0)","v":0},null,{"$f":"IF(SUM(Y$77:Y$79)>0,$E83*$H83,0)","v":0},null,{"$f":"IF(SUM(AA$77:AA$79)>0,$E83*$H83,0)","v":0},null,{"$f":"IF(SUM(AC$77:AC$79)>0,$E83*$H83,0)","v":0},null,{"$f":"IF(SUM(AE$77:AE$79)>0,$E83*$H83,0)","v":0},null,{"$f":"IF(SUM(AG$77:AG$79)>0,$E83*$H83,0)","v":0},null,{"$f":"IF(SUM(AI$77:AI$79)>0,$E83*$H83,0)","v":0},null,{"$f":"IF(SUM(AK$77:AK$79)>0,$E83*$H83,0)","v":0},null,{"$f":"IF(SUM(AM$77:AM$79)>0,$E83*$H83,0)","v":0},null,{"$f":"IF(SUM(AO$77:AO$79)>0,$E83*$H83,0)","v":0},null,{"$f":"IF(SUM(AQ$77:AQ$79)>0,$E83*$H83,0)","v":0},null,{"$f":"IF(SUM(AS$77:AS$79)>0,$E83*$H83,0)","v":0},null,0,null,0,null,0,null,0,null,0,null,0,null,0,null,0,null,0,null,0,null,0,null,0,null,0,null,0,null,0,null,0,null,0,null,0,null,0,null,0,null,0,null,0,null,0,null,0,null,0,null,0,null,0,null,0,null,0,null,0,null,0,null,0,null,0,null,0,null,0,null,0,null,0,null,0,null,0,null,0,null,0,null,0]
[null,null,null,null,null,{"$f":"F83","v":{"$error":"#N/A"}},{"$error":"#N/A"},null,null,null,null,{"$f":"IF(SUM(K$77:K$79)>0,$E84*$H84,0)","v":0},null,0,null,0,null,0,null,0,null,0,null,0,null,0,null,0,null,0,null,0,null,0,null,0,null,0,null,0,null,0,null,0,null,0,null,0,null,0,null,0,null,0,null,0,null,0,null,0,null,0,null,0,null,0,null,0,null,0,null,0,null,0,null,0,null,0,null,0,null,0,null,0,null,0,null,0,null,0,null,0,null,0,null,0,null,0,null,0,null,0,null,0,null,0,null,0,null,0,null,0,null,0,null,0,null,0,null,0,null,0,null,0,null,0,null,0,null,0]
[null,null,null,null,null,{"$f":"F84","v":{"$error":"#N/A"}},{"$error":"#N/A"},null,null,null,null,0,null,{"$f":"IF(SUM(M$77:M$79)>0,$E85*$H85,0)","v":0},null,0,null,0,null,0,null,0,null,0,null,0,null,0,null,0,null,0,null,0,null,0,null,0,null,0,null,0,null,0,null,0,null,0,null,0,null,0,null,0,null,0,null,0,null,0,null,0,null,0,null,0,null,0,null,0,null,0,null,0,null,0,null,0,null,0,null,0,null,0,null,0,null,0,null,0,null,0,null,0,null,0,null,0,null,0,null,0,null,0,null,0,null,0,null,0,null,0,null,0,null,0,null,0,null,0,null,0,null,0,null,0,null,0,null,0]
[null,null,null,null,null,{"$error":"#N/A"},{"$error":"#N/A"},null,null,null,null,0,null,0,null,0,null,0,null,0,null,0,null,0,null,0,null,0,null,0,null,0,null,0,null,0,null,0,null,0,null,0,null,0,null,0,null,0,null,0,null,0,null,0,null,0,null,0,null,0,null,0,null,0,null,0,null,0,null,0,null,0,null,0,null,0,null,0,null,0,null,0,null,0,null,0,null,0,null,0,null,0,null,0,null,0,null,0,null,0,null,0,null,0,null,0,null,0,null,0,null,0,null,0,null,0,null,0,null,0,null,0,null,0,null,0,null,0,null,0]
[null,null,null,null,null,{"$error":"#N/A"},{"$error":"#N/A"},null,null,null,null,0,null,0,null,0,null,0,null,0,null,0,null,0,null,0,null,0,null,0,null,0,null,0,null,0,null,0,null,0,null,0,null,0,null,0,null,0,null,0,null,0,null,0,null,0,null,0,null,0,null,0,null,0,null,0,null,0,null,0,null,0,null,0,null,0,null,0,null,0,null,0,null,0,null,0,null,0,null,0,null,0,null,0,null,0,null,0,null,0,null,0,null,0,null,0,null,0,null,0,null,0,null,0,null,0,null,0,null,0,null,0,null,0,null,0,null,0,null,0]
[null,null,null,null,null,null,null,null,null,null,null,0,null,0,null,0,null,0,null,0,null,0,null,0,null,0,null,0,null,0,null,0,null,0,null,0,null,0,null,0,null,0,null,0,null,0,null,0,null,0,null,0,null,0,null,0,null,0,null,0,null,0,null,0,null,0,null,0,null,0,null,0,null,0,null,0,null,0,null,0,null,0,null,0,null,0,null,0,null,0,null,0,null,0,null,0,null,0,null,0,null,0,null,0,null,0,null,0,null,0,null,0,null,0,null,0,null,0,null,0,null,0,null,0,null,0,null,0,null,0]
[null,null,"CATEGORIAS",null,null,null,null,"QUANTIDADE"]
[]
[null,null,null,{"$f":"HLOOKUP($C91,'Dados Gerais'!$D$5:$BK$10,6)","v":{"$error":"#N/A"}},null,null,null,{"$f":"HLOOKUP($C91,'Dados Gerais'!$D$5:$BK$14,10)","v":{"$error":"#N/A"}},null,null,{"$f":"IF($C91=K$6,1,0)","v":0},null,0,null,0,null,0,null,0,null,0,null,0,null,0,null,0,null,0,null,0,null,0,null,0,null,0,null,0,null,0,null,0,null,0,null,{"$f":"IF($C91=AU$6,1,0)","v":0},null,{"$f":"IF($C91=AW$6,1,0)","v":0},null,{"$f":"IF($C91=AY$6,1,0)","v":0},null,{"$f":"IF($C91=BA$6,1,0)","v":0},null,{"$f":"IF($C91=BC$6,1,0)","v":0},null,{"$f":"IF($C91=BE$6,1,0)","v":0},null,{"$f":"IF($C91=BG$6,1,0)","v":0},null,{"$f":"IF($C91=BI$6,1,0)","v":0},null,{"$f":"IF($C91=BK$6,1,0)","v":0},null,{"$f":"IF($C91=BM$6,1,0)","v":0},null,{"$f":"IF($C91=BO$6,1,0)","v":0},null,{"$f":"IF($C91=BQ$6,1,0)","v":0},null,{"$f":"IF($C91=BS$6,1,0)","v":0},null,{"$f":"IF($C91=BU$6,1,0)","v":0},null,{"$f":"IF($C91=BW$6,1,0)","v":0},null,{"$f":"IF($C91=BY$6,1,0)","v":0},null,{"$f":"IF($C91=CA$6,1,0)","v":0},null,{"$f":"IF($C91=CC$6,1,0)","v":0},null,{"$f":"IF($C91=CE$6,1,0)","v":0},null,{"$f":"IF($C91=CG$6,1,0)","v":0},null,{"$f":"IF($C91=CI$6,1,0)","v":0},null,{"$f":"IF($C91=CK$6,1,0)","v":0},null,{"$f":"IF($C91=CM$6,1,0)","v":0},null,{"$f":"IF($C91=CO$6,1,0)","v":0},null,{"$f":"IF($C91=CQ$6,1,0)","v":0},null,{"$f":"IF($C91=CS$6,1,0)","v":0},null,{"$f":"IF($C91=CU$6,1,0)","v":0},null,{"$f":"IF($C91=CW$6,1,0)","v":0},null,{"$f":"IF($C91=CY$6,1,0)","v":0},null,{"$f":"IF($C91=DA$6,1,0)","v":0},null,{"$f":"IF($C91=DC$6,1,0)","v":0},null,{"$f":"IF($C91=DE$6,1,0)","v":0},null,{"$f":"IF($C91=DG$6,1,0)","v":0},null,{"$f":"IF($C91=DI$6,1,0)","v":0},null,{"$f":"IF($C91=DK$6,1,0)","v":0},null,{"$f":"IF($C91=DM$6,1,0)","v":0},null,{"$f":"IF($C91=DO$6,1,0)","v":0},null,{"$f":"IF($C91=DQ$6,1,0)","v":0},null,{"$f":"IF($C91=DS$6,1,0)","v":0},null,{"$f":"IF($C91=DU$6,1,0)","v":0},null,{"$f":"IF($C91=DW$6,1,0)","v":0},null,{"$f":"IF($C91=DY$6,1,0)","v":0}]
[]
[]
[null,null,"ITEM","DESCRIÇÃO","QUANT ANUAL\nPOR POSTO","Nº DE POSTOS","QUANT ANUAL\nTOTAL","VALOR"]
[null,null,null,null,null,null,null,null,null,null,null,null,null,null,null,null,null,null,null,null,null,null,null,null,null,null,null,null,null,null,null,null,null,null,null,null,null,null,null,null,null,null,null,null,null,null,null,{"$f":"IF(SUM(AU$10:AU$10)>0,$E95*$H95,0)","v":0},null,{"$f":"IF(SUM(AW$10:AW$10)>0,$E95*$H95,0)","v":0},null,{"$f":"IF(SUM(AY$10:AY$10)>0,$E95*$H95,0)","v":0},null,{"$f":"IF(SUM(BA$10:BA$10)>0,$E95*$H95,0)","v":0},null,{"$f":"IF(SUM(BC$10:BC$10)>0,$E95*$H95,0)","v":0},null,{"$f":"IF(SUM(BE$10:BE$10)>0,$E95*$H95,0)","v":0},null,{"$f":"IF(SUM(BG$10:BG$10)>0,$E95*$H95,0)","v":0},null,{"$f":"IF(SUM(BI$10:BI$10)>0,$E95*$H95,0)","v":0},null,{"$f":"IF(SUM(BK$10:BK$10)>0,$E95*$H95,0)","v":0},null,{"$f":"IF(SUM(BM$10:BM$10)>0,$E95*$H95,0)","v":0},null,{"$f":"IF(SUM(BO$10:BO$10)>0,$E95*$H95,0)","v":0},null,{"$f":"IF(SUM(BQ$10:BQ$10)>0,$E95*$H95,0)","v":0},null,{"$f":"IF(SUM(BS$10:BS$10)>0,$E95*$H95,0)","v":0},null,{"$f":"IF(SUM(BU$10:BU$10)>0,$E95*$H95,0)","v":0},null,{"$f":"IF(SUM(BW$10:BW$10)>0,$E95*$H95,0)","v":0},null,{"$f":"IF(SUM(BY$10:BY$10)>0,$E95*$H95,0)","v":0},null,{"$f":"IF(SUM(CA$10:CA$10)>0,$E95*$H95,0)","v":0},null,{"$f":"IF(SUM(CC$10:CC$10)>0,$E95*$H95,0)","v":0},null,{"$f":"IF(SUM(CE$10:CE$10)>0,$E95*$H95,0)","v":0},null,{"$f":"IF(SUM(CG$10:CG$10)>0,$E95*$H95,0)","v":0},null,{"$f":"IF(SUM(CI$10:CI$10)>0,$E95*$H95,0)","v":0},null,{"$f":"IF(SUM(CK$10:CK$10)>0,$E95*$H95,0)","v":0},null,{"$f":"IF(SUM(CM$10:CM$10)>0,$E95*$H95,0)","v":0},null,{"$f":"IF(SUM(CO$10:CO$10)>0,$E95*$H95,0)","v":0},null,{"$f":"IF(SUM(CQ$10:CQ$10)>0,$E95*$H95,0)","v":0},null,{"$f":"IF(SUM(CS$10:CS$10)>0,$E95*$H95,0)","v":0},null,{"$f":"IF(SUM(CU$10:CU$10)>0,$E95*$H95,0)","v":0},null,{"$f":"IF(SUM(CW$10:CW$10)>0,$E95*$H95,0)","v":0},null,{"$f":"IF(SUM(CY$10:CY$10)>0,$E95*$H95,0)","v":0},null,{"$f":"IF(SUM(DA$10:DA$10)>0,$E95*$H95,0)","v":0},null,{"$f":"IF(SUM(DC$10:DC$10)>0,$E95*$H95,0)","v":0},null,{"$f":"IF(SUM(DE$10:DE$10)>0,$E95*$H95,0)","v":0},null,{"$f":"IF(SUM(DG$10:DG$10)>0,$E95*$H95,0)","v":0},null,{"$f":"IF(SUM(DI$10:DI$10)>0,$E95*$H95,0)","v":0},null,{"$f":"IF(SUM(DK$10:DK$10)>0,$E95*$H95,0)","v":0},null,{"$f":"IF(SUM(DM$10:DM$10)>0,$E95*$H95,0)","v":0},null,{"$f":"IF(SUM(DO$10:DO$10)>0,$E95*$H95,0)","v":0},null,{"$f":"IF(SUM(DQ$10:DQ$10)>0,$E95*$H95,0)","v":0},null,{"$f":"IF(SUM(DS$10:DS$10)>0,$E95*$H95,0)","v":0},null,{"$f":"IF(SUM(DU$10:DU$10)>0,$E95*$H95,0)","v":0},null,{"$f":"IF(SUM(DW$10:DW$10)>0,$E95*$H95,0)","v":0},null,{"$f":"IF(SUM(DY$10:DY$10)>0,$E95*$H95,0)","v":0}]
[null,null,null,null,null,{"$f":"H91","v":{"$error":"#N/A"}},{"$f":"F96*E96","v":{"$error":"#N/A"}},null,null,null,null,{"$f":"IF(SUM(K$90:K$92)>0,$E96*$H96,0)","v":0},null,{"$f":"IF(SUM(M$90:M$92)>0,$E96*$H96,0)","v":0},null,{"$f":"IF(SUM(O$90:O$92)>0,$E96*$H96,0)","v":0},null,{"$f":"IF(SUM(Q$90:Q$92)>0,$E96*$H96,0)","v":0},null,{"$f":"IF(SUM(S$90:S$92)>0,$E96*$H96,0)","v":0},null,{"$f":"IF(SUM(U$90:U$92)>0,$E96*$H96,0)","v":0},null,{"$f":"IF(SUM(W$90:W$92)>0,$E96*$H96,0)","v":0},null,{"$f":"IF(SUM(Y$90:Y$92)>0,$E96*$H96,0)","v":0},null,{"$f":"IF(SUM(AA$90:AA$92)>0,$E96*$H96,0)","v":0},null,{"$f":"IF(SUM(AC$90:AC$92)>0,$E96*$H96,0)","v":0},null,{"$f":"IF(SUM(AE$90:AE$92)>0,$E96*$H96,0)","v":0},null,{"$f":"IF(SUM(AG$90:AG$92)>0,$E96*$H96,0)","v":0},null,{"$f":"IF(SUM(AI$90:AI$92)>0,$E96*$H96,0)","v":0},null,{"$f":"IF(SUM(AK$90:AK$92)>0,$E96*$H96,0)","v":0},null,{"$f":"IF(SUM(AM$90:AM$92)>0,$E96*$H96,0)","v":0},null,{"$f":"IF(SUM(AO$90:AO$92)>0,$E96*$H96,0)","v":0},null,{"$f":"IF(SUM(AQ$90:AQ$92)>0,$E96*$H96,0)","v":0},null,{"$f":"IF(SUM(AS$90:AS$92)>0,$E96*$H96,0)","v":0},null,0,null,0,null,0,null,0,null,0,null,0,null,0,null,0,null,0,null,0,null,0,null,0,null,0,null,0,null,0,null,0,null,0,null,0,null,0,null,0,null,0,null,0,null,0,null,0,null,0,null,0,null,0,null,0,null,0,null,0,null,0,null,0,null,0,null,0,null,0,null,0,null,0,null,0,null,0,null,0,null,0,null,0]
[null,null,null,null,null,{"$f":"F96","v":{"$error":"#N/A"}},{"$error":"#N/A"},null,null,null,null,{"$f":"IF(SUM(K$90:K$92)>0,$E97*$H97,0)","v":0},null,0,null,0,null,0,null,0,null,0,null,0,null,0,null,0,null,0,null,0,null,0,null,0,null,0,null,0,null,0,null,0,null,0,null,0,null,0,null,0,null,0,null,0,null,0,null,0,null,0,null,0,null,0,null,0,null,0,null,0,null,0,null,0,null,0,null,0,null,0,null,0,null,0,null,0,null,0,null,0,null,0,null,0,null,0,null,0,null,0,null,0,null,0,null,0,null,0,null,0,null,0,null,0,null,0,null,0,null,0,null,0,null,0,null,0,null,0]
[null,null,null,null,null,{"$f":"F97","v":{"$error":"#N/A"}},{"$error":"#N/A"},null,null,null,null,0,null,{"$f":"IF(SUM(M$90:M$92)>0,$E98*$H98,0)","v":0},null,0,null,0,null,0,null,0,null,0,null,0,null,0,null,0,null,0,null,0,null,0,null,0,null,0,null,0,null,0,null,0,null,0,null,0,null,0,null,0,null,0,null,0,null,0,null,0,null,0,null,0,null,0,null,0,null,0,null,0,null,0,null,0,null,0,null,0,null,0,null,0,null,0,null,0,null,0,null,0,null,0,null,0,null,0,null,0,null,0,null,0,null,0,null,0,null,0,null,0,null,0,null,0,null,0,null,0,null,0,null,0,null,0,null,0]
[null,null,null,null,null,{"$error":"#N/A"},{"$error":"#N/A"},null,null,null,null,0,null,0,null,0,null,0,null,0,null,0,null,0,null,0,null,0,null,0,null,0,null,0,null,0,null,0,null,0,null,0,null,0,null,0,null,0,null,0,null,0,null,0,null,0,null,0,null,0,null,0,null,0,null,0,null,0,null,0,null,0,null,0,null,0,null,0,null,0,null,0,null,0,null,0,null,0,null,0,null,0,null,0,null,0,null,0,null,0,null,0,null,0,null,0,null,0,null,0,null,0,null,0,null,0,null,0,null,0,null,0,null,0,null,0,null,0,null,0]
[null,null,null,null,null,{"$error":"#N/A"},{"$error":"#N/A"},null,null,null,null,0,null,0,null,0,null,0,null,0,null,0,null,0,null,0,null,0,null,0,null,0,null,0,null,0,null,0,null,0,null,0,null,0,null,0,null,0,null,0,null,0,null,0,null,0,null,0,null,0,null,0,null,0,null,0,null,0,null,0,null,0,null,0,null,0,null,0,null,0,null,0,null,0,null,0,null,0,null,0,null,0,null,0,null,0,null,0,null,0,null,0,null,0,null,0,null,0,null,0,null,0,null,0,null,0,null,0,null,0,null,0,null,0,null,0,null,0,null,0]
[null,null,null,null,null,{"$f":"F100","v":{"$error":"#N/A"}},{"$error":"#N/A"},null,null,null,null,0,null,0,null,0,null,0,null,0,null,0,null,0,null,0,null,0,null,0,null,0,null,0,null,0,null,0,null,0,null,0,null,0,null,0,null,0,null,0,null,0,null,0,null,0,null,0,null,0,null,0,null,0,null,0,null,0,null,0,null,0,null,0,null,0,null,0,null,0,null,0,null,0,null,0,null,0,null,0,null,0,null,0,null,0,null,0,null,0,null,0,null,0,null,0,null,0,null,0,null,0,null,0,null,0,null,0,null,0,null,0,null,0,null,0,null,0,null,0]
[null,null,null,null,null,null,null,null,null,null,null,0,null,0,null,0,null,0,null,0,null,0,null,0,null,0,null,0,null,0,null,0,null,0,null,0,null,0,null,0,null,0,null,0,null,0,null,0,null,0,null,0,null,0,null,0,null,0,null,0,null,0,null,0,null,0,null,0,null,0,null,0,null,0,null,0,null,0,null,0,null,0,null,0,null,0,null,0,null,0,null,0,null,0,null,0,null,0,null,0,null,0,null,0,null,0,null,0,null,0,null,0,null,0,null,0,null,0,null,0,null,0,null,0,null,0,null,0,null,0]
[null,null,"CATEGORIAS",null,null,null,null,"QUANTIDADE"]
[]
[null,null,null,{"$f":"HLOOKUP($C105,'Dados Gerais'!$D$5:$BK$10,6)","v":{"$error":"#N/A"}},null,null,null,{"$f":"HLOOKUP($C105,'Dados Gerais'!$D$5:$BK$14,10)","v":{"$error":"#N/A"}},null,null,{"$f":"IF($C105=K$6,1,0)","v":0},null,0,null,0,null,0,null,0,null,0,null,0,null,0,null,0,null,0,null,0,null,0,null,0,null,0,null,0,null,0,null,0,null,0,null,{"$f":"IF($C105=AU$6,1,0)","v":0},null,{"$f":"IF($C105=AW$6,1,0)","v":0},null,{"$f":"IF($C105=AY$6,1,0)","v":0},null,{"$f":"IF($C105=BA$6,1,0)","v":0},null,{"$f":"IF($C105=BC$6,1,0)","v":0},null,{"$f":"IF($C105=BE$6,1,0)","v":0},null,{"$f":"IF($C105=BG$6,1,0)","v":0},null,{"$f":"IF($C105=BI$6,1,0)","v":0},null,{"$f":"IF($C105=BK$6,1,0)","v":0},null,{"$f":"IF($C105=BM$6,1,0)","v":0},null,{"$f":"IF($C105=BO$6,1,0)","v":0},null,{"$f":"IF($C105=BQ$6,1,0)","v":0},null,{"$f":"IF($C105=BS$6,1,0)","v":0},null,{"$f":"IF($C105=BU$6,1,0)","v":0},null,{"$f":"IF($C105=BW$6,1,0)","v":0},null,{"$f":"IF($C105=BY$6,1,0)","v":0},null,{"$f":"IF($C105=CA$6,1,0)","v":0},null,{"$f":"IF($C105=CC$6,1,0)","v":0},null,{"$f":"IF($C105=CE$6,1,0)","v":0},null,{"$f":"IF($C105=CG$6,1,0)","v":0},null,{"$f":"IF($C105=CI$6,1,0)","v":0},null,{"$f":"IF($C105=CK$6,1,0)","v":0},null,{"$f":"IF($C105=CM$6,1,0)","v":0},null,{"$f":"IF($C105=CO$6,1,0)","v":0},null,{"$f":"IF($C105=CQ$6,1,0)","v":0},null,{"$f":"IF($C105=CS$6,1,0)","v":0},null,{"$f":"IF($C105=CU$6,1,0)","v":0},null,{"$f":"IF($C105=CW$6,1,0)","v":0},null,{"$f":"IF($C105=CY$6,1,0)","v":0},null,{"$f":"IF($C105=DA$6,1,0)","v":0},null,{"$f":"IF($C105=DC$6,1,0)","v":0},null,{"$f":"IF($C105=DE$6,1,0)","v":0},null,{"$f":"IF($C105=DG$6,1,0)","v":0},null,{"$f":"IF($C105=DI$6,1,0)","v":0},null,{"$f":"IF($C105=DK$6,1,0)","v":0},null,{"$f":"IF($C105=DM$6,1,0)","v":0},null,{"$f":"IF($C105=DO$6,1,0)","v":0},null,{"$f":"IF($C105=DQ$6,1,0)","v":0},null,{"$f":"IF($C105=DS$6,1,0)","v":0},null,{"$f":"IF($C105=DU$6,1,0)","v":0},null,{"$f":"IF($C105=DW$6,1,0)","v":0},null,{"$f":"IF($C105=DY$6,1,0)","v":0}]
[]
[]
[null,null,"ITEM","DESCRIÇÃO","QUANT ANUAL\nPOR POSTO","Nº DE POSTOS","QUANT ANUAL\nTOTAL","VALOR"]
[null,null,null,null,null,null,null,null,null,null,null,null,null,null,null,null,null,null,null,null,null,null,null,null,null,null,null,null,null,null,null,null,null,null,null,null,null,null,null,null,null,null,null,null,null,null,null,{"$f":"IF(SUM(AU$10:AU$10)>0,$E109*$H109,0)","v":0},null,{"$f":"IF(SUM(AW$10:AW$10)>0,$E109*$H109,0)","v":0},null,{"$f":"IF(SUM(AY$10:AY$10)>0,$E109*$H109,0)","v":0},null,{"$f":"IF(SUM(BA$10:BA$10)>0,$E109*$H109,0)","v":0},null,{"$f":"IF(SUM(BC$10:BC$10)>0,$E109*$H109,0)","v":0},null,{"$f":"IF(SUM(BE$10:BE$10)>0,$E109*$H109,0)","v":0},null,{"$f":"IF(SUM(BG$10:BG$10)>0,$E109*$H109,0)","v":0},null,{"$f":"IF(SUM(BI$10:BI$10)>0,$E109*$H109,0)","v":0},null,{"$f":"IF(SUM(BK$10:BK$10)>0,$E109*$H109,0)","v":0},null,{"$f":"IF(SUM(BM$10:BM$10)>0,$E109*$H109,0)","v":0},null,{"$f":"IF(SUM(BO$10:BO$10)>0,$E109*$H109,0)","v":0},null,{"$f":"IF(SUM(BQ$10:BQ$10)>0,$E109*$H109,0)","v":0},null,{"$f":"IF(SUM(BS$10:BS$10)>0,$E109*$H109,0)","v":0},null,{"$f":"IF(SUM(BU$10:BU$10)>0,$E109*$H109,0)","v":0},null,{"$f":"IF(SUM(BW$10:BW$10)>0,$E109*$H109,0)","v":0},null,{"$f":"IF(SUM(BY$10:BY$10)>0,$E109*$H109,0)","v":0},null,{"$f":"IF(SUM(CA$10:CA$10)>0,$E109*$H109,0)","v":0},null,{"$f":"IF(SUM(CC$10:CC$10)>0,$E109*$H109,0)","v":0},null,{"$f":"IF(SUM(CE$10:CE$10)>0,$E109*$H109,0)","v":0},null,{"$f":"IF(SUM(CG$10:CG$10)>0,$E109*$H109,0)","v":0},null,{"$f":"IF(SUM(CI$10:CI$10)>0,$E109*$H109,0)","v":0},null,{"$f":"IF(SUM(CK$10:CK$10)>0,$E109*$H109,0)","v":0},null,{"$f":"IF(SUM(CM$10:CM$10)>0,$E109*$H109,0)","v":0},null,{"$f":"IF(SUM(CO$10:CO$10)>0,$E109*$H109,0)","v":0},null,{"$f":"IF(SUM(CQ$10:CQ$10)>0,$E109*$H109,0)","v":0},null,{"$f":"IF(SUM(CS$10:CS$10)>0,$E109*$H109,0)","v":0},null,{"$f":"IF(SUM(CU$10:CU$10)>0,$E109*$H109,0)","v":0},null,{"$f":"IF(SUM(CW$10:CW$10)>0,$E109*$H109,0)","v":0},null,{"$f":"IF(SUM(CY$10:CY$10)>0,$E109*$H109,0)","v":0},null,{"$f":"IF(SUM(DA$10:DA$10)>0,$E109*$H109,0)","v":0},null,{"$f":"IF(SUM(DC$10:DC$10)>0,$E109*$H109,0)","v":0},null,{"$f":"IF(SUM(DE$10:DE$10)>0,$E109*$H109,0)","v":0},null,{"$f":"IF(SUM(DG$10:DG$10)>0,$E109*$H109,0)","v":0},null,{"$f":"IF(SUM(DI$10:DI$10)>0,$E109*$H109,0)","v":0},null,{"$f":"IF(SUM(DK$10:DK$10)>0,$E109*$H109,0)","v":0},null,{"$f":"IF(SUM(DM$10:DM$10)>0,$E109*$H109,0)","v":0},null,{"$f":"IF(SUM(DO$10:DO$10)>0,$E109*$H109,0)","v":0},null,{"$f":"IF(SUM(DQ$10:DQ$10)>0,$E109*$H109,0)","v":0},null,{"$f":"IF(SUM(DS$10:DS$10)>0,$E109*$H109,0)","v":0},null,{"$f":"IF(SUM(DU$10:DU$10)>0,$E109*$H109,0)","v":0},null,{"$f":"IF(SUM(DW$10:DW$10)>0,$E109*$H109,0)","v":0},null,{"$f":"IF(SUM(DY$10:DY$10)>0,$E109*$H109,0)","v":0}]
[null,null,null,null,null,{"$f":"H105","v":{"$error":"#N/A"}},{"$f":"F110*E110","v":{"$error":"#N/A"}},null,null,null,null,{"$f":"IF(SUM(K$104:K$106)>0,$E110*$H110,0)","v":0},null,{"$f":"IF(SUM(M$104:M$106)>0,$E110*$H110,0)","v":0},null,{"$f":"IF(SUM(O$104:O$106)>0,$E110*$H110,0)","v":0},null,{"$f":"IF(SUM(Q$104:Q$106)>0,$E110*$H110,0)","v":0},null,{"$f":"IF(SUM(S$104:S$106)>0,$E110*$H110,0)","v":0},null,{"$f":"IF(SUM(U$104:U$106)>0,$E110*$H110,0)","v":0},null,{"$f":"IF(SUM(W$104:W$106)>0,$E110*$H110,0)","v":0},null,{"$f":"IF(SUM(Y$104:Y$106)>0,$E110*$H110,0)","v":0},null,{"$f":"IF(SUM(AA$104:AA$106)>0,$E110*$H110,0)","v":0},null,{"$f":"IF(SUM(AC$104:AC$106)>0,$E110*$H110,0)","v":0},null,{"$f":"IF(SUM(AE$104:AE$106)>0,$E110*$H110,0)","v":0},null,{"$f":"IF(SUM(AG$104:AG$106)>0,$E110*$H110,0)","v":0},null,{"$f":"IF(SUM(AI$104:AI$106)>0,$E110*$H110,0)","v":0},null,{"$f":"IF(SUM(AK$104:AK$106)>0,$E110*$H110,0)","v":0},null,{"$f":"IF(SUM(AM$104:AM$106)>0,$E110*$H110,0)","v":0},null,{"$f":"IF(SUM(AO$104:AO$106)>0,$E110*$H110,0)","v":0},null,{"$f":"IF(SUM(AQ$104:AQ$106)>0,$E110*$H110,0)","v":0},null,{"$f":"IF(SUM(AS$104:AS$106)>0,$E110*$H110,0)","v":0},null,0,null,0,null,0,null,0,null,0,null,0,null,0,null,0,null,0,null,0,null,0,null,0,null,0,null,0,null,0,null,0,null,0,null,0,null,0,null,0,null,0,null,0,null,0,null,0,null,0,null,0,null,0,null,0,null,0,null,0,null,0,null,0,null,0,null,0,null,0,null,0,null,0,null,0,null,0,null,0,null,0,null,0]
[null,null,null,null,null,{"$f":"F110","v":{"$error":"#N/A"}},{"$error":"#N/A"},null,null,null,null,{"$f":"IF(SUM(K$104:K$106)>0,$E111*$H111,0)","v":0},null,0,null,0,null,0,null,0,null,0,null,0,null,0,null,0,null,0,null,0,null,0,null,0,null,0,null,0,null,0,null,0,null,0,null,0,null,0,null,0,null,0,null,0,null,0,null,0,null,0,null,0,null,0,null,0,null,0,null,0,null,0,null,0,null,0,null,0,null,0,null,0,null,0,null,0,null,0,null,0,null,0,null,0,null,0,null,0,null,0,null,0,null,0,null,0,null,0,null,0,null,0,null,0,null,0,null,0,null,0,null,0,null,0,null,0,null,0]
[null,null,null,null,null,{"$f":"F111","v":{"$error":"#N/A"}},{"$error":"#N/A"},null,null,null,null,0,null,{"$f":"IF(SUM(M$104:M$106)>0,$E112*$H112,0)","v":0},null,0,null,0,null,0,null,0,null,0,null,0,null,0,null,0,null,0,null,0,null,0,null,0,null,0,null,0,null,0,null,0,null,0,null,0,null,0,null,0,null,0,null,0,null,0,null,0,null,0,null,0,null,0,null,0,null,0,null,0,null,0,null,0,null,0,null,0,null,0,null,0,null,0,null,0,null,0,null,0,null,0,null,0,null,0,null,0,null,0,null,0,null,0,null,0,null,0,null,0,null,0,null,0,null,0,null,0,null,0,null,0,null,0,null,0]
[null,null,null,null,null,{"$error":"#N/A"},{"$error":"#N/A"},null,null,null,null,0,null,0,null,0,null,0,null,0,null,0,null,0,null,0,null,0,null,0,null,0,null,0,null,0,null,0,null,0,null,0,null,0,null,0,null,0,null,0,null,0,null,0,null,0,null,0,null,0,null,0,null,0,null,0,null,0,null,0,null,0,null,0,null,0,null,0,null,0,null,0,null,0,null,0,null,0,null,0,null,0,null,0,null,0,null,0,null,0,null,0,null,0,null,0,null,0,null,0,null,0,null,0,null,0,null,0,null,0,null,0,null,0,null,0,null,0,null,0]
[null,null,null,null,null,{"$error":"#N/A"},{"$error":"#N/A"},null,null,null,null,0,null,0,null,0,null,0,null,0,null,0,null,0,null,0,null,0,null,0,null,0,null,0,null,0,null,0,null,0,null,0,null,0,null,0,null,0,null,0,null,0,null,0,null,0,null,0,null,0,null,0,null,0,null,0,null,0,null,0,null,0,null,0,null,0,null,0,null,0,null,0,null,0,null,0,null,0,null,0,null,0,null,0,null,0,null,0,null,0,null,0,null,0,null,0,null,0,null,0,null,0,null,0,null,0,null,0,null,0,null,0,null,0,null,0,null,0,null,0]
[null,null,null,null,null,{"$f":"F114","v":{"$error":"#N/A"}},{"$error":"#N/A"},null,null,null,null,0,null,0,null,0,null,0,null,0,null,0,null,0,null,0,null,0,null,0,null,0,null,0,null,0,null,0,null,0,null,0,null,0,null,0,null,0,null,0,null,0,null,0,null,0,null,0,null,0,null,0,null,0,null,0,null,0,null,0,null,0,null,0,null,0,null,0,null,0,null,0,null,0,null,0,null,0,null,0,null,0,null,0,null,0,null,0,null,0,null,0,null,0,null,0,null,0,null,0,null,0,null,0,null,0,null,0,null,0,null,0,null,0,null,0,null,0,null,0]
[null,null,null,null,null,null,null,null,null,null,null,0,null,0,null,0,null,0,null,0,null,0,null,0,null,0,null,0,null,0,null,0,null,0,null,0,null,0,null,0,null,0,null,0,null,0,null,0,null,0,null,0,null,0,null,0,null,0,null,0,null,0,null,0,null,0,null,0,null,0,null,0,null,0,null,0,null,0,null,0,null,0,null,0,null,0,null,0,null,0,null,0,null,0,null,0,null,0,null,0,null,0,null,0,null,0,null,0,null,0,null,0,null,0,null,0,null,0,null,0,null,0,null,0,null,0,null,0,null,0]
[null,null,"CATEGORIAS",null,null,null,null,"QUANTIDADE"]
[]
[null,null,null,{"$f":"HLOOKUP($C119,'Dados Gerais'!$D$5:$BK$10,6)","v":{"$error":"#N/A"}},null,null,null,{"$f":"HLOOKUP($C119,'Dados Gerais'!$D$5:$BK$14,10)","v":{"$error":"#N/A"}},null,null,{"$f":"IF($C119=K$6,1,0)","v":0},null,0,null,0,null,0,null,0,null,0,null,0,null,0,null,{"$f":"IF($C119=AA$6,1,0)","v":0},null,0,null,0,null,0,null,0,null,0,null,0,null,0,null,0,null,0,null,{"$f":"IF($C119=AU$6,1,0)","v":0},null,{"$f":"IF($C119=AW$6,1,0)","v":0},null,{"$f":"IF($C119=AY$6,1,0)","v":0},null,{"$f":"IF($C119=BA$6,1,0)","v":0},null,{"$f":"IF($C119=BC$6,1,0)","v":0},null,{"$f":"IF($C119=BE$6,1,0)","v":0},null,{"$f":"IF($C119=BG$6,1,0)","v":0},null,{"$f":"IF($C119=BI$6,1,0)","v":0},null,{"$f":"IF($C119=BK$6,1,0)","v":0},null,{"$f":"IF($C119=BM$6,1,0)","v":0},null,{"$f":"IF($C119=BO$6,1,0)","v":0},null,{"$f":"IF($C119=BQ$6,1,0)","v":0},null,{"$f":"IF($C119=BS$6,1,0)","v":0},null,{"$f":"IF($C119=BU$6,1,0)","v":0},null,{"$f":"IF($C119=BW$6,1,0)","v":0},null,{"$f":"IF($C119=BY$6,1,0)","v":0},null,{"$f":"IF($C119=CA$6,1,0)","v":0},null,{"$f":"IF($C119=CC$6,1,0)","v":0},null,{"$f":"IF($C119=CE$6,1,0)","v":0},null,{"$f":"IF($C119=CG$6,1,0)","v":0},null,{"$f":"IF($C119=CI$6,1,0)","v":0},null,{"$f":"IF($C119=CK$6,1,0)","v":0},null,{"$f":"IF($C119=CM$6,1,0)","v":0},null,{"$f":"IF($C119=CO$6,1,0)","v":0},null,{"$f":"IF($C119=CQ$6,1,0)","v":0},null,{"$f":"IF($C119=CS$6,1,0)","v":0},null,{"$f":"IF($C119=CU$6,1,0)","v":0},null,{"$f":"IF($C119=CW$6,1,0)","v":0},null,{"$f":"IF($C119=CY$6,1,0)","v":0},null,{"$f":"IF($C119=DA$6,1,0)","v":0},null,{"$f":"IF($C119=DC$6,1,0)","v":0},null,{"$f":"IF($C119=DE$6,1,0)","v":0},null,{"$f":"IF($C119=DG$6,1,0)","v":0},null,{"$f":"IF($C119=DI$6,1,0)","v":0},null,{"$f":"IF($C119=DK$6,1,0)","v":0},null,{"$f":"IF($C119=DM$6,1,0)","v":0},null,{"$f":"IF($C119=DO$6,1,0)","v":0},null,{"$f":"IF($C119=DQ$6,1,0)","v":0},null,{"$f":"IF($C119=DS$6,1,0)","v":0},null,{"$f":"IF($C119=DU$6,1,0)","v":0},null,{"$f":"IF($C119=DW$6,1,0)","v":0},null,{"$f":"IF($C119=DY$6,1,0)","v":0}]
[null,null,null,{"$f":"HLOOKUP($C120,'Dados Gerais'!$D$5:$BK$10,6)","v":{"$error":"#N/A"}},null,null,null,{"$f":"HLOOKUP($C120,'Dados Gerais'!$D$5:$BK$14,10)","v":{"$error":"#N/A"}},null,null,0,null,0,null,0,null,0,null,0,null,0,null,0,null,0,null,0,null,0,null,0,null,0,null,0,null,0,null,0,null,0,null,0,null,0,null,0,null,0,null,0,null,0,null,0,null,0,null,0,null,0,null,0,null,0,null,0,null,0,null,0,null,0,null,0,null,0,null,0,null,0,null,0,null,0,null,0,null,0,null,0,null,0,null,0,null,0,null,0,null,0,null,0,null,0,null,0,null,0,null,0,null,0,null,0,null,0,null,0,null,0,null,0,null,0,null,0,null,0]
[]
[]
[null,null,"ITEM","DESCRIÇÃO","QUANT ANUAL\nPOR POSTO","Nº DE POSTOS","QUANT ANUAL\nTOTAL","VALOR"]
[null,null,null,null,null,null,null,null,null,null,null,null,null,null,null,null,null,null,null,null,null,null,null,null,null,null,null,null,null,null,null,null,null,null,null,null,null,null,null,null,null,null,null,null,null,null,null,{"$f":"IF(SUM(AU$10:AU$10)>0,$E124*$H124,0)","v":0},null,{"$f":"IF(SUM(AW$10:AW$10)>0,$E124*$H124,0)","v":0},null,{"$f":"IF(SUM(AY$10:AY$10)>0,$E124*$H124,0)","v":0},null,{"$f":"IF(SUM(BA$10:BA$10)>0,$E124*$H124,0)","v":0},null,{"$f":"IF(SUM(BC$10:BC$10)>0,$E124*$H124,0)","v":0},null,{"$f":"IF(SUM(BE$10:BE$10)>0,$E124*$H124,0)","v":0},null,{"$f":"IF(SUM(BG$10:BG$10)>0,$E124*$H124,0)","v":0},null,{"$f":"IF(SUM(BI$10:BI$10)>0,$E124*$H124,0)","v":0},null,{"$f":"IF(SUM(BK$10:BK$10)>0,$E124*$H124,0)","v":0},null,{"$f":"IF(SUM(BM$10:BM$10)>0,$E124*$H124,0)","v":0},null,{"$f":"IF(SUM(BO$10:BO$10)>0,$E124*$H124,0)","v":0},null,{"$f":"IF(SUM(BQ$10:BQ$10)>0,$E124*$H124,0)","v":0},null,{"$f":"IF(SUM(BS$10:BS$10)>0,$E124*$H124,0)","v":0},null,{"$f":"IF(SUM(BU$10:BU$10)>0,$E124*$H124,0)","v":0},null,{"$f":"IF(SUM(BW$10:BW$10)>0,$E124*$H124,0)","v":0},null,{"$f":"IF(SUM(BY$10:BY$10)>0,$E124*$H124,0)","v":0},null,{"$f":"IF(SUM(CA$10:CA$10)>0,$E124*$H124,0)","v":0},null,{"$f":"IF(SUM(CC$10:CC$10)>0,$E124*$H124,0)","v":0},null,{"$f":"IF(SUM(CE$10:CE$10)>0,$E124*$H124,0)","v":0},null,{"$f":"IF(SUM(CG$10:CG$10)>0,$E124*$H124,0)","v":0},null,{"$f":"IF(SUM(CI$10:CI$10)>0,$E124*$H124,0)","v":0},null,{"$f":"IF(SUM(CK$10:CK$10)>0,$E124*$H124,0)","v":0},null,{"$f":"IF(SUM(CM$10:CM$10)>0,$E124*$H124,0)","v":0},null,{"$f":"IF(SUM(CO$10:CO$10)>0,$E124*$H124,0)","v":0},null,{"$f":"IF(SUM(CQ$10:CQ$10)>0,$E124*$H124,0)","v":0},null,{"$f":"IF(SUM(CS$10:CS$10)>0,$E124*$H124,0)","v":0},null,{"$f":"IF(SUM(CU$10:CU$10)>0,$E124*$H124,0)","v":0},null,{"$f":"IF(SUM(CW$10:CW$10)>0,$E124*$H124,0)","v":0},null,{"$f":"IF(SUM(CY$10:CY$10)>0,$E124*$H124,0)","v":0},null,{"$f":"IF(SUM(DA$10:DA$10)>0,$E124*$H124,0)","v":0},null,{"$f":"IF(SUM(DC$10:DC$10)>0,$E124*$H124,0)","v":0},null,{"$f":"IF(SUM(DE$10:DE$10)>0,$E124*$H124,0)","v":0},null,{"$f":"IF(SUM(DG$10:DG$10)>0,$E124*$H124,0)","v":0},null,{"$f":"IF(SUM(DI$10:DI$10)>0,$E124*$H124,0)","v":0},null,{"$f":"IF(SUM(DK$10:DK$10)>0,$E124*$H124,0)","v":0},null,{"$f":"IF(SUM(DM$10:DM$10)>0,$E124*$H124,0)","v":0},null,{"$f":"IF(SUM(DO$10:DO$10)>0,$E124*$H124,0)","v":0},null,{"$f":"IF(SUM(DQ$10:DQ$10)>0,$E124*$H124,0)","v":0},null,{"$f":"IF(SUM(DS$10:DS$10)>0,$E124*$H124,0)","v":0},null,{"$f":"IF(SUM(DU$10:DU$10)>0,$E124*$H124,0)","v":0},null,{"$f":"IF(SUM(DW$10:DW$10)>0,$E124*$H124,0)","v":0},null,{"$f":"IF(SUM(DY$10:DY$10)>0,$E124*$H124,0)","v":0}]
[null,null,null,null,null,{"$f":"H119+H120","v":{"$error":"#N/A"}},{"$f":"F125*E125","v":{"$error":"#N/A"}},null,null,null,null,{"$f":"IF(SUM(K$118:K$121)>0,$E125*$H125,0)","v":0},null,{"$f":"IF(SUM(M$118:M$121)>0,$E125*$H125,0)","v":0},null,{"$f":"IF(SUM(O$118:O$121)>0,$E125*$H125,0)","v":0},null,{"$f":"IF(SUM(Q$118:Q$121)>0,$E125*$H125,0)","v":0},null,{"$f":"IF(SUM(S$118:S$121)>0,$E125*$H125,0)","v":0},null,{"$f":"IF(SUM(U$118:U$121)>0,$E125*$H125,0)","v":0},null,{"$f":"IF(SUM(W$118:W$121)>0,$E125*$H125,0)","v":0},null,{"$f":"IF(SUM(Y$118:Y$121)>0,$E125*$H125,0)","v":0},null,{"$f":"IF(SUM(AA$118:AA$121)>0,$E125*$H125,0)","v":0},null,{"$f":"IF(SUM(AC$118:AC$121)>0,$E125*$H125,0)","v":0},null,{"$f":"IF(SUM(AE$118:AE$121)>0,$E125*$H125,0)","v":0},null,{"$f":"IF(SUM(AG$118:AG$121)>0,$E125*$H125,0)","v":0},null,{"$f":"IF(SUM(AI$118:AI$121)>0,$E125*$H125,0)","v":0},null,{"$f":"IF(SUM(AK$118:AK$121)>0,$E125*$H125,0)","v":0},null,{"$f":"IF(SUM(AM$118:AM$121)>0,$E125*$H125,0)","v":0},null,{"$f":"IF(SUM(AO$118:AO$121)>0,$E125*$H125,0)","v":0},null,{"$f":"IF(SUM(AQ$118:AQ$121)>0,$E125*$H125,0)","v":0},null,{"$f":"IF(SUM(AS$118:AS$121)>0,$E125*$H125,0)","v":0},null,0,null,0,null,0,null,0,null,0,null,0,null,0,null,0,null,0,null,0,null,0,null,0,null,0,null,0,null,0,null,0,null,0,null,0,null,0,null,0,null,0,null,0,null,0,null,0,null,0,null,0,null,0,null,0,null,0,null,0,null,0,null,0,null,0,null,0,null,0,null,0,null,0,null,0,null,0,null,0,null,0,null,0]
[{"$f":"F125","v":{"$error":"#N/A"}},null,null,null,null,{"$f":"F125","v":{"$error":"#N/A"}},{"$error":"#N/A"},null,null,null,null,{"$f":"IF(SUM(K$118:K$121)>0,$E126*$H126,0)","v":0},null,0,null,0,null,0,null,0,null,0,null,0,null,0,null,0,null,0,null,0,null,0,null,0,null,0,null,0,null,0,null,0,null,0,null,0,null,0,null,0,null,0,null,0,null,0,null,0,null,0,null,0,null,0,null,0,null,0,null,0,null,0,null,0,null,0,null,0,null,0,null,0,null,0,null,0,null,0,null,0,null,0,null,0,null,0,null,0,null,0,null,0,null,0,null,0,null,0,null,0,null,0,null,0,null,0,null,0,null,0,null,0,null,0,null,0,null,0]
[null,null,null,null,null,{"$f":"F126","v":{"$error":"#N/A"}},{"$error":"#N/A"},null,null,null,null,0,null,{"$f":"IF(SUM(M$118:M$121)>0,$E127*$H127,0)","v":0},null,0,null,0,null,0,null,0,null,0,null,0,null,0,null,0,null,0,null,0,null,0,null,0,null,0,null,0,null,0,null,0,null,0,null,0,null,0,null,0,null,0,null,0,null,0,null,0,null,0,null,0,null,0,null,0,null,0,null,0,null,0,null,0,null,0,null,0,null,0,null,0,null,0,null,0,null,0,null,0,null,0,null,0,null,0,null,0,null,0,null,0,null,0,null,0,null,0,null,0,null,0,null,0,null,0,null,0,null,0,null,0,null,0,null,0]
[null,null,null,null,null,{"$error":"#N/A"},{"$error":"#N/A"},null,null,null,null,0,null,0,null,0,null,0,null,0,null,0,null,0,null,0,null,0,null,0,null,0,null,0,null,0,null,0,null,0,null,0,null,0,null,0,null,0,null,0,null,0,null,0,null,0,null,0,null,0,null,0,null,0,null,0,null,0,null,0,null,0,null,0,null,0,null,0,null,0,null,0,null,0,null,0,null,0,null,0,null,0,null,0,null,0,null,0,null,0,null,0,null,0,null,0,null,0,null,0,null,0,null,0,null,0,null,0,null,0,null,0,null,0,null,0,null,0,null,0]
[null,null,null,null,null,{"$error":"#N/A"},{"$error":"#N/A"},null,null,null,null,0,null,0,null,0,null,0,null,0,null,0,null,0,null,0,null,0,null,0,null,0,null,0,null,0,null,0,null,0,null,0,null,0,null,0,null,0,null,0,null,0,null,0,null,0,null,0,null,0,null,0,null,0,null,0,null,0,null,0,null,0,null,0,null,0,null,0,null,0,null,0,null,0,null,0,null,0,null,0,null,0,null,0,null,0,null,0,null,0,null,0,null,0,null,0,null,0,null,0,null,0,null,0,null,0,null,0,null,0,null,0,null,0,null,0,null,0,null,0]
[null,null,null,null,null,{"$error":"#N/A"},{"$error":"#N/A"},null,null,null,null,0,null,0,null,0,null,0,null,0,null,0,null,0,null,0,null,0,null,0,null,0,null,0,null,0,null,0,null,0,null,0,null,0,null,0,null,0,null,0,null,0,null,0,null,0,null,0,null,0,null,0,null,0,null,0,null,0,null,0,null,0,null,0,null,0,null,0,null,0,null,0,null,0,null,0,null,0,null,0,null,0,null,0,null,0,null,0,null,0,null,0,null,0,null,0,null,0,null,0,null,0,null,0,null,0,null,0,null,0,null,0,null,0,null,0,null,0,null,0]
[null,null,null,null,null,null,null,null,null,null,null,0,null,0,null,0,null,0,null,0,null,0,null,0,null,0,null,0,null,0,null,0,null,0,null,0,null,0,null,0,null,0,null,0,null,0,null,0,null,0,null,0,null,0,null,0,null,0,null,0,null,0,null,0,null,0,null,0,null,0,null,0,null,0,null,0,null,0,null,0,null,0,null,0,null,0,null,0,null,0,null,0,null,0,null,0,null,0,null,0,null,0,null,0,null,0,null,0,null,0,null,0,null,0,null,0,null,0,null,0,null,0,null,0,null,0,null,0,null,0]
[null,null,"CATEGORIAS",null,null,null,null,"QUANTIDADE"]
[]
[null,null,null,{"$f":"HLOOKUP($C134,'Dados Gerais'!$D$5:$BK$10,6)","v":{"$error":"#N/A"}},null,null,null,{"$f":"HLOOKUP($C134,'Dados Gerais'!$D$5:$BK$14,10)","v":{"$error":"#N/A"}},null,null,{"$f":"IF($C134=K$6,1,0)","v":0},null,0,null,0,null,0,null,0,null,0,null,0,null,0,null,{"$f":"IF($C134=AA$6,1,0)","v":0},null,0,null,0,null,0,null,0,null,0,null,0,null,0,null,0,null,0,null,{"$f":"IF($C134=AU$6,1,0)","v":0},null,{"$f":"IF($C134=AW$6,1,0)","v":0},null,{"$f":"IF($C134=AY$6,1,0)","v":0},null,{"$f":"IF($C134=BA$6,1,0)","v":0},null,{"$f":"IF($C134=BC$6,1,0)","v":0},null,{"$f":"IF($C134=BE$6,1,0)","v":0},null,{"$f":"IF($C134=BG$6,1,0)","v":0},null,{"$f":"IF($C134=BI$6,1,0)","v":0},null,{"$f":"IF($C134=BK$6,1,0)","v":0},null,{"$f":"IF($C134=BM$6,1,0)","v":0},null,{"$f":"IF($C134=BO$6,1,0)","v":0},null,{"$f":"IF($C134=BQ$6,1,0)","v":0},null,{"$f":"IF($C134=BS$6,1,0)","v":0},null,{"$f":"IF($C134=BU$6,1,0)","v":0},null,{"$f":"IF($C134=BW$6,1,0)","v":0},null,{"$f":"IF($C134=BY$6,1,0)","v":0},null,{"$f":"IF($C134=CA$6,1,0)","v":0},null,{"$f":"IF($C134=CC$6,1,0)","v":0},null,{"$f":"IF($C134=CE$6,1,0)","v":0},null,{"$f":"IF($C134=CG$6,1,0)","v":0},null,{"$f":"IF($C134=CI$6,1,0)","v":0},null,{"$f":"IF($C134=CK$6,1,0)","v":0},null,{"$f":"IF($C134=CM$6,1,0)","v":0},null,{"$f":"IF($C134=CO$6,1,0)","v":0},null,{"$f":"IF($C134=CQ$6,1,0)","v":0},null,{"$f":"IF($C134=CS$6,1,0)","v":0},null,{"$f":"IF($C134=CU$6,1,0)","v":0},null,{"$f":"IF($C134=CW$6,1,0)","v":0},null,{"$f":"IF($C134=CY$6,1,0)","v":0},null,{"$f":"IF($C134=DA$6,1,0)","v":0},null,{"$f":"IF($C134=DC$6,1,0)","v":0},null,{"$f":"IF($C134=DE$6,1,0)","v":0},null,{"$f":"IF($C134=DG$6,1,0)","v":0},null,{"$f":"IF($C134=DI$6,1,0)","v":0},null,{"$f":"IF($C134=DK$6,1,0)","v":0},null,{"$f":"IF($C134=DM$6,1,0)","v":0},null,{"$f":"IF($C134=DO$6,1,0)","v":0},null,{"$f":"IF($C134=DQ$6,1,0)","v":0},null,{"$f":"IF($C134=DS$6,1,0)","v":0},null,{"$f":"IF($C134=DU$6,1,0)","v":0},null,{"$f":"IF($C134=DW$6,1,0)","v":0},null,{"$f":"IF($C134=DY$6,1,0)","v":0}]
[null,null,null,{"$f":"HLOOKUP($C135,'Dados Gerais'!$D$5:$BK$10,6)","v":{"$error":"#N/A"}},null,null,null,{"$f":"HLOOKUP($C135,'Dados Gerais'!$D$5:$BK$14,10)","v":{"$error":"#N/A"}},null,null,0,null,0,null,0,null,0,null,0,null,0,null,0,null,0,null,0,null,0,null,0,null,0,null,0,null,0,null,0,null,0,null,0,null,0,null,0,null,0,null,0,null,0,null,0,null,0,null,0,null,0,null,0,null,0,null,0,null,0,null,0,null,0,null,0,null,0,null,0,null,0,null,0,null,0,null,0,null,0,null,0,null,0,null,0,null,0,null,0,null,0,null,0,null,0,null,0,null,0,null,0,null,0,null,0,null,0,null,0,null,0,null,0,null,0,null,0,null,0]
[]
[]
[null,null,"ITEM","DESCRIÇÃO","QUANT ANUAL\nPOR POSTO","Nº DE POSTOS","QUANT ANUAL\nTOTAL","VALOR"]
[null,null,null,null,null,null,null,null,null,null,null,null,null,null,null,null,null,null,null,null,null,null,null,null,null,null,null,null,null,null,null,null,null,null,null,null,null,null,null,null,null,null,null,null,null,null,null,{"$f":"IF(SUM(AU$10:AU$10)>0,$E139*$H139,0)","v":0},null,{"$f":"IF(SUM(AW$10:AW$10)>0,$E139*$H139,0)","v":0},null,{"$f":"IF(SUM(AY$10:AY$10)>0,$E139*$H139,0)","v":0},null,{"$f":"IF(SUM(BA$10:BA$10)>0,$E139*$H139,0)","v":0},null,{"$f":"IF(SUM(BC$10:BC$10)>0,$E139*$H139,0)","v":0},null,{"$f":"IF(SUM(BE$10:BE$10)>0,$E139*$H139,0)","v":0},null,{"$f":"IF(SUM(BG$10:BG$10)>0,$E139*$H139,0)","v":0},null,{"$f":"IF(SUM(BI$10:BI$10)>0,$E139*$H139,0)","v":0},null,{"$f":"IF(SUM(BK$10:BK$10)>0,$E139*$H139,0)","v":0},null,{"$f":"IF(SUM(BM$10:BM$10)>0,$E139*$H139,0)","v":0},null,{"$f":"IF(SUM(BO$10:BO$10)>0,$E139*$H139,0)","v":0},null,{"$f":"IF(SUM(BQ$10:BQ$10)>0,$E139*$H139,0)","v":0},null,{"$f":"IF(SUM(BS$10:BS$10)>0,$E139*$H139,0)","v":0},null,{"$f":"IF(SUM(BU$10:BU$10)>0,$E139*$H139,0)","v":0},null,{"$f":"IF(SUM(BW$10:BW$10)>0,$E139*$H139,0)","v":0},null,{"$f":"IF(SUM(BY$10:BY$10)>0,$E139*$H139,0)","v":0},null,{"$f":"IF(SUM(CA$10:CA$10)>0,$E139*$H139,0)","v":0},null,{"$f":"IF(SUM(CC$10:CC$10)>0,$E139*$H139,0)","v":0},null,{"$f":"IF(SUM(CE$10:CE$10)>0,$E139*$H139,0)","v":0},null,{"$f":"IF(SUM(CG$10:CG$10)>0,$E139*$H139,0)","v":0},null,{"$f":"IF(SUM(CI$10:CI$10)>0,$E139*$H139,0)","v":0},null,{"$f":"IF(SUM(CK$10:CK$10)>0,$E139*$H139,0)","v":0},null,{"$f":"IF(SUM(CM$10:CM$10)>0,$E139*$H139,0)","v":0},null,{"$f":"IF(SUM(CO$10:CO$10)>0,$E139*$H139,0)","v":0},null,{"$f":"IF(SUM(CQ$10:CQ$10)>0,$E139*$H139,0)","v":0},null,{"$f":"IF(SUM(CS$10:CS$10)>0,$E139*$H139,0)","v":0},null,{"$f":"IF(SUM(CU$10:CU$10)>0,$E139*$H139,0)","v":0},null,{"$f":"IF(SUM(CW$10:CW$10)>0,$E139*$H139,0)","v":0},null,{"$f":"IF(SUM(CY$10:CY$10)>0,$E139*$H139,0)","v":0},null,{"$f":"IF(SUM(DA$10:DA$10)>0,$E139*$H139,0)","v":0},null,{"$f":"IF(SUM(DC$10:DC$10)>0,$E139*$H139,0)","v":0},null,{"$f":"IF(SUM(DE$10:DE$10)>0,$E139*$H139,0)","v":0},null,{"$f":"IF(SUM(DG$10:DG$10)>0,$E139*$H139,0)","v":0},null,{"$f":"IF(SUM(DI$10:DI$10)>0,$E139*$H139,0)","v":0},null,{"$f":"IF(SUM(DK$10:DK$10)>0,$E139*$H139,0)","v":0},null,{"$f":"IF(SUM(DM$10:DM$10)>0,$E139*$H139,0)","v":0},null,{"$f":"IF(SUM(DO$10:DO$10)>0,$E139*$H139,0)","v":0},null,{"$f":"IF(SUM(DQ$10:DQ$10)>0,$E139*$H139,0)","v":0},null,{"$f":"IF(SUM(DS$10:DS$10)>0,$E139*$H139,0)","v":0},null,{"$f":"IF(SUM(DU$10:DU$10)>0,$E139*$H139,0)","v":0},null,{"$f":"IF(SUM(DW$10:DW$10)>0,$E139*$H139,0)","v":0},null,{"$f":"IF(SUM(DY$10:DY$10)>0,$E139*$H139,0)","v":0}]
[null,null,null,null,null,{"$f":"H134+H135","v":{"$error":"#N/A"}},{"$f":"F140*E140","v":{"$error":"#N/A"}},null,null,null,null,{"$f":"IF(SUM(K$133:K$136)>0,$E140*$H140,0)","v":0},null,{"$f":"IF(SUM(M$133:M$136)>0,$E140*$H140,0)","v":0},null,{"$f":"IF(SUM(O$133:O$136)>0,$E140*$H140,0)","v":0},null,{"$f":"IF(SUM(Q$133:Q$136)>0,$E140*$H140,0)","v":0},null,{"$f":"IF(SUM(S$133:S$136)>0,$E140*$H140,0)","v":0},null,{"$f":"IF(SUM(U$133:U$136)>0,$E140*$H140,0)","v":0},null,{"$f":"IF(SUM(W$133:W$136)>0,$E140*$H140,0)","v":0},null,{"$f":"IF(SUM(Y$133:Y$136)>0,$E140*$H140,0)","v":0},null,{"$f":"IF(SUM(AA$133:AA$136)>0,$E140*$H140,0)","v":0},null,{"$f":"IF(SUM(AC$133:AC$136)>0,$E140*$H140,0)","v":0},null,{"$f":"IF(SUM(AE$133:AE$136)>0,$E140*$H140,0)","v":0},null,{"$f":"IF(SUM(AG$133:AG$136)>0,$E140*$H140,0)","v":0},null,{"$f":"IF(SUM(AI$133:AI$136)>0,$E140*$H140,0)","v":0},null,{"$f":"IF(SUM(AK$133:AK$136)>0,$E140*$H140,0)","v":0},null,{"$f":"IF(SUM(AM$133:AM$136)>0,$E140*$H140,0)","v":0},null,{"$f":"IF(SUM(AO$133:AO$136)>0,$E140*$H140,0)","v":0},null,{"$f":"IF(SUM(AQ$133:AQ$136)>0,$E140*$H140,0)","v":0},null,{"$f":"IF(SUM(AS$133:AS$136)>0,$E140*$H140,0)","v":0},null,0,null,0,null,0,null,0,null,0,null,0,null,0,null,0,null,0,null,0,null,0,null,0,null,0,null,0,null,0,null,0,null,0,null,0,null,0,null,0,null,0,null,0,null,0,null,0,null,0,null,0,null,0,null,0,null,0,null,0,null,0,null,0,null,0,null,0,null,0,null,0,null,0,null,0,null,0,null,0,null,0,null,0]
[null,null,null,null,null,{"$f":"F140","v":{"$error":"#N/A"}},{"$error":"#N/A"},null,null,null,null,{"$f":"IF(SUM(K$133:K$136)>0,$E141*$H141,0)","v":0},null,0,null,0,null,0,null,0,null,0,null,0,null,0,null,0,null,0,null,0,null,0,null,0,null,0,null,0,null,0,null,0,null,0,null,0,null,0,null,0,null,0,null,0,null,0,null,0,null,0,null,0,null,0,null,0,null,0,null,0,null,0,null,0,null,0,null,0,null,0,null,0,null,0,null,0,null,0,null,0,null,0,null,0,null,0,null,0,null,0,null,0,null,0,null,0,null,0,null,0,null,0,null,0,null,0,null,0,null,0,null,0,null,0,null,0,null,0]
[null,null,null,null,null,{"$f":"F141","v":{"$error":"#N/A"}},{"$error":"#N/A"},null,null,null,null,0,null,{"$f":"IF(SUM(M$133:M$136)>0,$E142*$H142,0)","v":0},null,0,null,0,null,0,null,0,null,0,null,0,null,0,null,0,null,0,null,0,null,0,null,0,null,0,null,0,null,0,null,0,null,0,null,0,null,0,null,0,null,0,null,0,null,0,null,0,null,0,null,0,null,0,null,0,null,0,null,0,null,0,null,0,null,0,null,0,null,0,null,0,null,0,null,0,null,0,null,0,null,0,null,0,null,0,null,0,null,0,null,0,null,0,null,0,null,0,null,0,null,0,null,0,null,0,null,0,null,0,null,0,null,0,null,0]
[null,null,null,null,null,{"$error":"#N/A"},{"$error":"#N/A"},null,null,null,null,0,null,0,null,0,null,0,null,0,null,0,null,0,null,0,null,0,null,0,null,0,null,0,null,0,null,0,null,0,null,0,null,0,null,0,null,0,null,0,null,0,null,0,null,0,null,0,null,0,null,0,null,0,null,0,null,0,null,0,null,0,null,0,null,0,null,0,null,0,null,0,null,0,null,0,null,0,null,0,null,0,null,0,null,0,null,0,null,0,null,0,null,0,null,0,null,0,null,0,null,0,null,0,null,0,null,0,null,0,null,0,null,0,null,0,null,0,null,0]
[null,null,null,null,null,{"$error":"#N/A"},{"$error":"#N/A"},null,null,null,null,0,null,0,null,0,null,0,null,0,null,0,null,0,null,0,null,0,null,0,null,0,null,0,null,0,null,0,null,0,null,0,null,0,null,0,null,0,null,0,null,0,null,0,null,0,null,0,null,0,null,0,null,0,null,0,null,0,null,0,null,0,null,0,null,0,null,0,null,0,null,0,null,0,null,0,null,0,null,0,null,0,null,0,null,0,null,0,null,0,null,0,null,0,null,0,null,0,null,0,null,0,null,0,null,0,null,0,null,0,null,0,null,0,null,0,null,0,null,0]
[null,null,null,null,null,{"$error":"#N/A"},{"$error":"#N/A"},null,null,null,null,0,null,0,null,0,null,0,null,0,null,0,null,0,null,0,null,0,null,0,null,0,null,0,null,0,null,0,null,0,null,0,null,0,null,0,null,0,null,0,null,0,null,0,null,0,null,0,null,0,null,0,null,0,null,0,null,0,null,0,null,0,null,0,null,0,null,0,null,0,null,0,null,0,null,0,null,0,null,0,null,0,null,0,null,0,null,0,null,0,null,0,null,0,null,0,null,0,null,0,null,0,null,0,null,0,null,0,null,0,null,0,null,0,null,0,null,0,null,0]
[null,null,null,null,null,null,null,null,null,null,null,0,null,0,null,0,null,0,null,0,null,0,null,0,null,0,null,0,null,0,null,0,null,0,null,0,null,0,null,0,null,0,null,0,null,0,null,0,null,0,null,0,null,0,null,0,null,0,null,0,null,0,null,0,null,0,null,0,null,0,null,0,null,0,null,0,null,0,null,0,null,0,null,0,null,0,null,0,null,0,null,0,null,0,null,0,null,0,null,0,null,0,null,0,null,0,null,0,null,0,null,0,null,0,null,0,null,0,null,0,null,0,null,0,null,0,null,0,null,0]
[null,null,"CATEGORIAS",null,null,null,null,"QUANTIDADE"]
[]
[null,null,null,{"$f":"HLOOKUP($C149,'Dados Gerais'!$D$5:$BK$10,6)","v":{"$error":"#N/A"}},null,null,null,{"$f":"HLOOKUP($C149,'Dados Gerais'!$D$5:$BK$14,10)","v":{"$error":"#N/A"}},null,null,{"$f":"IF($C149=K$6,1,0)","v":0},null,0,null,0,null,0,null,0,null,0,null,0,null,0,null,{"$f":"IF($C149=AA$6,1,0)","v":0},null,0,null,0,null,0,null,0,null,0,null,0,null,0,null,0,null,0,null,{"$f":"IF($C149=AU$6,1,0)","v":0},null,{"$f":"IF($C149=AW$6,1,0)","v":0},null,{"$f":"IF($C149=AY$6,1,0)","v":0},null,{"$f":"IF($C149=BA$6,1,0)","v":0},null,{"$f":"IF($C149=BC$6,1,0)","v":0},null,{"$f":"IF($C149=BE$6,1,0)","v":0},null,{"$f":"IF($C149=BG$6,1,0)","v":0},null,{"$f":"IF($C149=BI$6,1,0)","v":0},null,{"$f":"IF($C149=BK$6,1,0)","v":0},null,{"$f":"IF($C149=BM$6,1,0)","v":0},null,{"$f":"IF($C149=BO$6,1,0)","v":0},null,{"$f":"IF($C149=BQ$6,1,0)","v":0},null,{"$f":"IF($C149=BS$6,1,0)","v":0},null,{"$f":"IF($C149=BU$6,1,0)","v":0},null,{"$f":"IF($C149=BW$6,1,0)","v":0},null,{"$f":"IF($C149=BY$6,1,0)","v":0},null,{"$f":"IF($C149=CA$6,1,0)","v":0},null,{"$f":"IF($C149=CC$6,1,0)","v":0},null,{"$f":"IF($C149=CE$6,1,0)","v":0},null,{"$f":"IF($C149=CG$6,1,0)","v":0},null,{"$f":"IF($C149=CI$6,1,0)","v":0},null,{"$f":"IF($C149=CK$6,1,0)","v":0},null,{"$f":"IF($C149=CM$6,1,0)","v":0},null,{"$f":"IF($C149=CO$6,1,0)","v":0},null,{"$f":"IF($C149=CQ$6,1,0)","v":0},null,{"$f":"IF($C149=CS$6,1,0)","v":0},null,{"$f":"IF($C149=CU$6,1,0)","v":0},null,{"$f":"IF($C149=CW$6,1,0)","v":0},null,{"$f":"IF($C149=CY$6,1,0)","v":0},null,{"$f":"IF($C149=DA$6,1,0)","v":0},null,{"$f":"IF($C149=DC$6,1,0)","v":0},null,{"$f":"IF($C149=DE$6,1,0)","v":0},null,{"$f":"IF($C149=DG$6,1,0)","v":0},null,{"$f":"IF($C149=DI$6,1,0)","v":0},null,{"$f":"IF($C149=DK$6,1,0)","v":0},null,{"$f":"IF($C149=DM$6,1,0)","v":0},null,{"$f":"IF($C149=DO$6,1,0)","v":0},null,{"$f":"IF($C149=DQ$6,1,0)","v":0},null,{"$f":"IF($C149=DS$6,1,0)","v":0},null,{"$f":"IF($C149=DU$6,1,0)","v":0},null,{"$f":"IF($C149=DW$6,1,0)","v":0},null,{"$f":"IF($C149=DY$6,1,0)","v":0}]
[null,null,null,{"$f":"HLOOKUP($C150,'Dados Gerais'!$D$5:$BK$10,6)","v":{"$error":"#N/A"}},null,null,null,{"$f":"HLOOKUP($C150,'Dados Gerais'!$D$5:$BK$14,10)","v":{"$error":"#N/A"}},null,null,0,null,0,null,0,null,0,null,0,null,0,null,0,null,0,null,0,null,0,null,0,null,0,null,0,null,0,null,0,null,0,null,0,null,0,null,0,null,0,null,0,null,0,null,0,null,0,null,0,null,0,null,0,null,0,null,0,null,0,null,0,null,0,null,0,null,0,null,0,null,0,null,0,null,0,null,0,null,0,null,0,null,0,null,0,null,0,null,0,null,0,null,0,null,0,null,0,null,0,null,0,null,0,null,0,null,0,null,0,null,0,null,0,null,0,null,0,null,0]
[]
[]
[null,null,"ITEM","DESCRIÇÃO","QUANT ANUAL\nPOR POSTO","Nº DE POSTOS","QUANT ANUAL\nTOTAL","VALOR"]
[null,null,null,null,null,null,null,null,null,null,null,null,null,null,null,null,null,null,null,null,null,null,null,null,null,null,null,null,null,null,null,null,null,null,null,null,null,null,null,null,null,null,null,null,null,null,null,{"$f":"IF(SUM(AU$10:AU$10)>0,$E154*$H154,0)","v":0},null,{"$f":"IF(SUM(AW$10:AW$10)>0,$E154*$H154,0)","v":0},null,{"$f":"IF(SUM(AY$10:AY$10)>0,$E154*$H154,0)","v":0},null,{"$f":"IF(SUM(BA$10:BA$10)>0,$E154*$H154,0)","v":0},null,{"$f":"IF(SUM(BC$10:BC$10)>0,$E154*$H154,0)","v":0},null,{"$f":"IF(SUM(BE$10:BE$10)>0,$E154*$H154,0)","v":0},null,{"$f":"IF(SUM(BG$10:BG$10)>0,$E154*$H154,0)","v":0},null,{"$f":"IF(SUM(BI$10:BI$10)>0,$E154*$H154,0)","v":0},null,{"$f":"IF(SUM(BK$10:BK$10)>0,$E154*$H154,0)","v":0},null,{"$f":"IF(SUM(BM$10:BM$10)>0,$E154*$H154,0)","v":0},null,{"$f":"IF(SUM(BO$10:BO$10)>0,$E154*$H154,0)","v":0},null,{"$f":"IF(SUM(BQ$10:BQ$10)>0,$E154*$H154,0)","v":0},null,{"$f":"IF(SUM(BS$10:BS$10)>0,$E154*$H154,0)","v":0},null,{"$f":"IF(SUM(BU$10:BU$10)>0,$E154*$H154,0)","v":0},null,{"$f":"IF(SUM(BW$10:BW$10)>0,$E154*$H154,0)","v":0},null,{"$f":"IF(SUM(BY$10:BY$10)>0,$E154*$H154,0)","v":0},null,{"$f":"IF(SUM(CA$10:CA$10)>0,$E154*$H154,0)","v":0},null,{"$f":"IF(SUM(CC$10:CC$10)>0,$E154*$H154,0)","v":0},null,{"$f":"IF(SUM(CE$10:CE$10)>0,$E154*$H154,0)","v":0},null,{"$f":"IF(SUM(CG$10:CG$10)>0,$E154*$H154,0)","v":0},null,{"$f":"IF(SUM(CI$10:CI$10)>0,$E154*$H154,0)","v":0},null,{"$f":"IF(SUM(CK$10:CK$10)>0,$E154*$H154,0)","v":0},null,{"$f":"IF(SUM(CM$10:CM$10)>0,$E154*$H154,0)","v":0},null,{"$f":"IF(SUM(CO$10:CO$10)>0,$E154*$H154,0)","v":0},null,{"$f":"IF(SUM(CQ$10:CQ$10)>0,$E154*$H154,0)","v":0},null,{"$f":"IF(SUM(CS$10:CS$10)>0,$E154*$H154,0)","v":0},null,{"$f":"IF(SUM(CU$10:CU$10)>0,$E154*$H154,0)","v":0},null,{"$f":"IF(SUM(CW$10:CW$10)>0,$E154*$H154,0)","v":0},null,{"$f":"IF(SUM(CY$10:CY$10)>0,$E154*$H154,0)","v":0},null,{"$f":"IF(SUM(DA$10:DA$10)>0,$E154*$H154,0)","v":0},null,{"$f":"IF(SUM(DC$10:DC$10)>0,$E154*$H154,0)","v":0},null,{"$f":"IF(SUM(DE$10:DE$10)>0,$E154*$H154,0)","v":0},null,{"$f":"IF(SUM(DG$10:DG$10)>0,$E154*$H154,0)","v":0},null,{"$f":"IF(SUM(DI$10:DI$10)>0,$E154*$H154,0)","v":0},null,{"$f":"IF(SUM(DK$10:DK$10)>0,$E154*$H154,0)","v":0},null,{"$f":"IF(SUM(DM$10:DM$10)>0,$E154*$H154,0)","v":0},null,{"$f":"IF(SUM(DO$10:DO$10)>0,$E154*$H154,0)","v":0},null,{"$f":"IF(SUM(DQ$10:DQ$10)>0,$E154*$H154,0)","v":0},null,{"$f":"IF(SUM(DS$10:DS$10)>0,$E154*$H154,0)","v":0},null,{"$f":"IF(SUM(DU$10:DU$10)>0,$E154*$H154,0)","v":0},null,{"$f":"IF(SUM(DW$10:DW$10)>0,$E154*$H154,0)","v":0},null,{"$f":"IF(SUM(DY$10:DY$10)>0,$E154*$H154,0)","v":0}]
[null,null,null,null,null,{"$f":"H149+H150","v":{"$error":"#N/A"}},{"$f":"F155*E155","v":{"$error":"#N/A"}},null,null,null,null,{"$f":"IF(SUM(K$148:K$151)>0,$E155*$H155,0)","v":0},null,{"$f":"IF(SUM(M$148:M$151)>0,$E155*$H155,0)","v":0},null,{"$f":"IF(SUM(O$148:O$151)>0,$E155*$H155,0)","v":0},null,{"$f":"IF(SUM(Q$148:Q$151)>0,$E155*$H155,0)","v":0},null,{"$f":"IF(SUM(S$148:S$151)>0,$E155*$H155,0)","v":0},null,{"$f":"IF(SUM(U$148:U$151)>0,$E155*$H155,0)","v":0},null,{"$f":"IF(SUM(W$148:W$151)>0,$E155*$H155,0)","v":0},null,{"$f":"IF(SUM(Y$148:Y$151)>0,$E155*$H155,0)","v":0},null,{"$f":"IF(SUM(AA$148:AA$151)>0,$E155*$H155,0)","v":0},null,{"$f":"IF(SUM(AC$148:AC$151)>0,$E155*$H155,0)","v":0},null,{"$f":"IF(SUM(AE$148:AE$151)>0,$E155*$H155,0)","v":0},null,{"$f":"IF(SUM(AG$148:AG$151)>0,$E155*$H155,0)","v":0},null,{"$f":"IF(SUM(AI$148:AI$151)>0,$E155*$H155,0)","v":0},null,{"$f":"IF(SUM(AK$148:AK$151)>0,$E155*$H155,0)","v":0},null,{"$f":"IF(SUM(AM$148:AM$151)>0,$E155*$H155,0)","v":0},null,{"$f":"IF(SUM(AO$148:AO$151)>0,$E155*$H155,0)","v":0},null,{"$f":"IF(SUM(AQ$148:AQ$151)>0,$E155*$H155,0)","v":0},null,{"$f":"IF(SUM(AS$148:AS$151)>0,$E155*$H155,0)","v":0},null,0,null,0,null,0,null,0,null,0,null,0,null,0,null,0,null,0,null,0,null,0,null,0,null,0,null,0,null,0,null,0,null,0,null,0,null,0,null,0,null,0,null,0,null,0,null,0,null,0,null,0,null,0,null,0,null,0,null,0,null,0,null,0,null,0,null,0,null,0,null,0,null,0,null,0,null,0,null,0,null,0,null,0]
[null,null,null,null,null,{"$f":"F155","v":{"$error":"#N/A"}},{"$error":"#N/A"},null,null,null,null,{"$f":"IF(SUM(K$148:K$151)>0,$E156*$H156,0)","v":0},null,0,null,0,null,0,null,0,null,0,null,0,null,0,null,0,null,0,null,0,null,0,null,0,null,0,null,0,null,0,null,0,null,0,null,0,null,0,null,0,null,0,null,0,null,0,null,0,null,0,null,0,null,0,null,0,null,0,null,0,null,0,null,0,null,0,null,0,null,0,null,0,null,0,null,0,null,0,null,0,null,0,null,0,null,0,null,0,null,0,null,0,null,0,null,0,null,0,null,0,null,0,null,0,null,0,null,0,null,0,null,0,null,0,null,0,null,0]
[null,null,null,null,null,{"$f":"F156","v":{"$error":"#N/A"}},{"$error":"#N/A"},null,null,null,null,0,null,{"$f":"IF(SUM(M$148:M$151)>0,$E157*$H157,0)","v":0},null,0,null,0,null,0,null,0,null,0,null,0,null,0,null,0,null,0,null,0,null,0,null,0,null,0,null,0,null,0,null,0,null,0,null,0,null,0,null,0,null,0,null,0,null,0,null,0,null,0,null,0,null,0,null,0,null,0,null,0,null,0,null,0,null,0,null,0,null,0,null,0,null,0,null,0,null,0,null,0,null,0,null,0,null,0,null,0,null,0,null,0,null,0,null,0,null,0,null,0,null,0,null,0,null,0,null,0,null,0,null,0,null,0,null,0]
[null,null,null,null,null,{"$error":"#N/A"},{"$error":"#N/A"},null,null,null,null,0,null,0,null,0,null,0,null,0,null,0,null,0,null,0,null,0,null,0,null,0,null,0,null,0,null,0,null,0,null,0,null,0,null,0,null,0,null,0,null,0,null,0,null,0,null,0,null,0,null,0,null,0,null,0,null,0,null,0,null,0,null,0,null,0,null,0,null,0,null,0,null,0,null,0,null,0,null,0,null,0,null,0,null,0,null,0,null,0,null,0,null,0,null,0,null,0,null,0,null,0,null,0,null,0,null,0,null,0,null,0,null,0,null,0,null,0,null,0]
[null,null,null,null,null,{"$error":"#N/A"},{"$error":"#N/A"},null,null,null,null,0,null,0,null,0,null,0,null,0,null,0,null,0,null,0,null,0,null,0,null,0,null,0,null,0,null,0,null,0,null,0,null,0,null,0,null,0,null,0,null,0,null,0,null,0,null,0,null,0,null,0,null,0,null,0,null,0,null,0,null,0,null,0,null,0,null,0,null,0,null,0,null,0,null,0,null,0,null,0,null,0,null,0,null,0,null,0,null,0,null,0,null,0,null,0,null,0,null,0,null,0,null,0,null,0,null,0,null,0,null,0,null,0,null,0,null,0,null,0]
[null,null,null,null,null,{"$error":"#N/A"},{"$error":"#N/A"},null,null,null,null,0,null,0,null,0,null,0,null,0,null,0,null,0,null,0,null,0,null,0,null,0,null,0,null,0,null,0,null,0,null,0,null,0,null,0,null,0,null,0,null,0,null,0,null,0,null,0,null,0,null,0,null,0,null,0,null,0,null,0,null,0,null,0,null,0,null,0,null,0,null,0,null,0,null,0,null,0,null,0,null,0,null,0,null,0,null,0,null,0,null,0,null,0,null,0,null,0,null,0,null,0,null,0,null,0,null,0,null,0,null,0,null,0,null,0,null,0,null,0]
[null,null,null,null,null,null,null,null,null,null,null,0,null,0,null,0,null,0,null,0,null,0,null,0,null,0,null,0,null,0,null,0,null,0,null,0,null,0,null,0,null,0,null,0,null,0,null,0,null,0,null,0,null,0,null,0,null,0,null,0,null,0,null,0,null,0,null,0,null,0,null,0,null,0,null,0,null,0,null,0,null,0,null,0,null,0,null,0,null,0,null,0,null,0,null,0,null,0,null,0,null,0,null,0,null,0,null,0,null,0,null,0,null,0,null,0,null,0,null,0,null,0,null,0,null,0,null,0,null,0]
[null,null,"CATEGORIAS",null,null,null,null,"QUANTIDADE"]
[]
[null,null,null,{"$f":"HLOOKUP($C164,'Dados Gerais'!$D$5:$BK$10,6)","v":{"$error":"#N/A"}},null,null,null,{"$f":"HLOOKUP($C164,'Dados Gerais'!$D$5:$BK$14,10)","v":{"$error":"#N/A"}},null,null,{"$f":"IF($C164=K$6,1,0)","v":0},null,0,null,0,null,0,null,0,null,0,null,0,null,0,null,0,null,0,null,0,null,0,null,0,null,0,null,0,null,0,null,0,null,0,null,{"$f":"IF($C164=AU$6,1,0)","v":0},null,{"$f":"IF($C164=AW$6,1,0)","v":0},null,{"$f":"IF($C164=AY$6,1,0)","v":0},null,{"$f":"IF($C164=BA$6,1,0)","v":0},null,{"$f":"IF($C164=BC$6,1,0)","v":0},null,{"$f":"IF($C164=BE$6,1,0)","v":0},null,{"$f":"IF($C164=BG$6,1,0)","v":0},null,{"$f":"IF($C164=BI$6,1,0)","v":0},null,{"$f":"IF($C164=BK$6,1,0)","v":0},null,{"$f":"IF($C164=BM$6,1,0)","v":0},null,{"$f":"IF($C164=BO$6,1,0)","v":0},null,{"$f":"IF($C164=BQ$6,1,0)","v":0},null,{"$f":"IF($C164=BS$6,1,0)","v":0},null,{"$f":"IF($C164=BU$6,1,0)","v":0},null,{"$f":"IF($C164=BW$6,1,0)","v":0},null,{"$f":"IF($C164=BY$6,1,0)","v":0},null,{"$f":"IF($C164=CA$6,1,0)","v":0},null,{"$f":"IF($C164=CC$6,1,0)","v":0},null,{"$f":"IF($C164=CE$6,1,0)","v":0},null,{"$f":"IF($C164=CG$6,1,0)","v":0},null,{"$f":"IF($C164=CI$6,1,0)","v":0},null,{"$f":"IF($C164=CK$6,1,0)","v":0},null,{"$f":"IF($C164=CM$6,1,0)","v":0},null,{"$f":"IF($C164=CO$6,1,0)","v":0},null,{"$f":"IF($C164=CQ$6,1,0)","v":0},null,{"$f":"IF($C164=CS$6,1,0)","v":0},null,{"$f":"IF($C164=CU$6,1,0)","v":0},null,{"$f":"IF($C164=CW$6,1,0)","v":0},null,{"$f":"IF($C164=CY$6,1,0)","v":0},null,{"$f":"IF($C164=DA$6,1,0)","v":0},null,{"$f":"IF($C164=DC$6,1,0)","v":0},null,{"$f":"IF($C164=DE$6,1,0)","v":0},null,{"$f":"IF($C164=DG$6,1,0)","v":0},null,{"$f":"IF($C164=DI$6,1,0)","v":0},null,{"$f":"IF($C164=DK$6,1,0)","v":0},null,{"$f":"IF($C164=DM$6,1,0)","v":0},null,{"$f":"IF($C164=DO$6,1,0)","v":0},null,{"$f":"IF($C164=DQ$6,1,0)","v":0},null,{"$f":"IF($C164=DS$6,1,0)","v":0},null,{"$f":"IF($C164=DU$6,1,0)","v":0},null,{"$f":"IF($C164=DW$6,1,0)","v":0},null,{"$f":"IF($C164=DY$6,1,0)","v":0}]
[]
[]
[null,null,"ITEM","DESCRIÇÃO","QUANT ANUAL\nPOR POSTO","Nº DE POSTOS","QUANT ANUAL\nTOTAL","VALOR"]
[null,null,null,null,null,null,null,null,null,null,null,null,null,null,null,null,null,null,null,null,null,null,null,null,null,null,null,null,null,null,null,null,null,null,null,null,null,null,null,null,null,null,null,null,null,null,null,{"$f":"IF(SUM(AU$10:AU$10)>0,$E168*$H168,0)","v":0},null,{"$f":"IF(SUM(AW$10:AW$10)>0,$E168*$H168,0)","v":0},null,{"$f":"IF(SUM(AY$10:AY$10)>0,$E168*$H168,0)","v":0},null,{"$f":"IF(SUM(BA$10:BA$10)>0,$E168*$H168,0)","v":0},null,{"$f":"IF(SUM(BC$10:BC$10)>0,$E168*$H168,0)","v":0},null,{"$f":"IF(SUM(BE$10:BE$10)>0,$E168*$H168,0)","v":0},null,{"$f":"IF(SUM(BG$10:BG$10)>0,$E168*$H168,0)","v":0},null,{"$f":"IF(SUM(BI$10:BI$10)>0,$E168*$H168,0)","v":0},null,{"$f":"IF(SUM(BK$10:BK$10)>0,$E168*$H168,0)","v":0},null,{"$f":"IF(SUM(BM$10:BM$10)>0,$E168*$H168,0)","v":0},null,{"$f":"IF(SUM(BO$10:BO$10)>0,$E168*$H168,0)","v":0},null,{"$f":"IF(SUM(BQ$10:BQ$10)>0,$E168*$H168,0)","v":0},null,{"$f":"IF(SUM(BS$10:BS$10)>0,$E168*$H168,0)","v":0},null,{"$f":"IF(SUM(BU$10:BU$10)>0,$E168*$H168,0)","v":0},null,{"$f":"IF(SUM(BW$10:BW$10)>0,$E168*$H168,0)","v":0},null,{"$f":"IF(SUM(BY$10:BY$10)>0,$E168*$H168,0)","v":0},null,{"$f":"IF(SUM(CA$10:CA$10)>0,$E168*$H168,0)","v":0},null,{"$f":"IF(SUM(CC$10:CC$10)>0,$E168*$H168,0)","v":0},null,{"$f":"IF(SUM(CE$10:CE$10)>0,$E168*$H168,0)","v":0},null,{"$f":"IF(SUM(CG$10:CG$10)>0,$E168*$H168,0)","v":0},null,{"$f":"IF(SUM(CI$10:CI$10)>0,$E168*$H168,0)","v":0},null,{"$f":"IF(SUM(CK$10:CK$10)>0,$E168*$H168,0)","v":0},null,{"$f":"IF(SUM(CM$10:CM$10)>0,$E168*$H168,0)","v":0},null,{"$f":"IF(SUM(CO$10:CO$10)>0,$E168*$H168,0)","v":0},null,{"$f":"IF(SUM(CQ$10:CQ$10)>0,$E168*$H168,0)","v":0},null,{"$f":"IF(SUM(CS$10:CS$10)>0,$E168*$H168,0)","v":0},null,{"$f":"IF(SUM(CU$10:CU$10)>0,$E168*$H168,0)","v":0},null,{"$f":"IF(SUM(CW$10:CW$10)>0,$E168*$H168,0)","v":0},null,{"$f":"IF(SUM(CY$10:CY$10)>0,$E168*$H168,0)","v":0},null,{"$f":"IF(SUM(DA$10:DA$10)>0,$E168*$H168,0)","v":0},null,{"$f":"IF(SUM(DC$10:DC$10)>0,$E168*$H168,0)","v":0},null,{"$f":"IF(SUM(DE$10:DE$10)>0,$E168*$H168,0)","v":0},null,{"$f":"IF(SUM(DG$10:DG$10)>0,$E168*$H168,0)","v":0},null,{"$f":"IF(SUM(DI$10:DI$10)>0,$E168*$H168,0)","v":0},null,{"$f":"IF(SUM(DK$10:DK$10)>0,$E168*$H168,0)","v":0},null,{"$f":"IF(SUM(DM$10:DM$10)>0,$E168*$H168,0)","v":0},null,{"$f":"IF(SUM(DO$10:DO$10)>0,$E168*$H168,0)","v":0},null,{"$f":"IF(SUM(DQ$10:DQ$10)>0,$E168*$H168,0)","v":0},null,{"$f":"IF(SUM(DS$10:DS$10)>0,$E168*$H168,0)","v":0},null,{"$f":"IF(SUM(DU$10:DU$10)>0,$E168*$H168,0)","v":0},null,{"$f":"IF(SUM(DW$10:DW$10)>0,$E168*$H168,0)","v":0},null,{"$f":"IF(SUM(DY$10:DY$10)>0,$E168*$H168,0)","v":0}]
[null,null,null,null,null,{"$f":"H164","v":{"$error":"#N/A"}},{"$f":"F169*E169","v":{"$error":"#N/A"}},null,null,null,null,{"$f":"IF(SUM(K$163:K$165)>0,$E169*$H169,0)","v":0},null,{"$f":"IF(SUM(M$163:M$165)>0,$E169*$H169,0)","v":0},null,{"$f":"IF(SUM(O$163:O$165)>0,$E169*$H169,0)","v":0},null,{"$f":"IF(SUM(Q$163:Q$165)>0,$E169*$H169,0)","v":0},null,{"$f":"IF(SUM(S$163:S$165)>0,$E169*$H169,0)","v":0},null,{"$f":"IF(SUM(U$163:U$165)>0,$E169*$H169,0)","v":0},null,{"$f":"IF(SUM(W$163:W$165)>0,$E169*$H169,0)","v":0},null,{"$f":"IF(SUM(Y$163:Y$165)>0,$E169*$H169,0)","v":0},null,{"$f":"IF(SUM(AA$163:AA$165)>0,$E169*$H169,0)","v":0},null,{"$f":"IF(SUM(AC$163:AC$165)>0,$E169*$H169,0)","v":0},null,{"$f":"IF(SUM(AE$163:AE$165)>0,$E169*$H169,0)","v":0},null,{"$f":"IF(SUM(AG$163:AG$165)>0,$E169*$H169,0)","v":0},null,{"$f":"IF(SUM(AI$163:AI$165)>0,$E169*$H169,0)","v":0},null,{"$f":"IF(SUM(AK$163:AK$165)>0,$E169*$H169,0)","v":0},null,{"$f":"IF(SUM(AM$163:AM$165)>0,$E169*$H169,0)","v":0},null,{"$f":"IF(SUM(AO$163:AO$165)>0,$E169*$H169,0)","v":0},null,{"$f":"IF(SUM(AQ$163:AQ$165)>0,$E169*$H169,0)","v":0},null,{"$f":"IF(SUM(AS$163:AS$165)>0,$E169*$H169,0)","v":0},null,{"$f":"IF(SUM(AU$10:AU$10)>0,$E169*$H169,0)","v":0},null,{"$f":"IF(SUM(AW$10:AW$10)>0,$E169*$H169,0)","v":0},null,{"$f":"IF(SUM(AY$10:AY$10)>0,$E169*$H169,0)","v":0},null,{"$f":"IF(SUM(BA$10:BA$10)>0,$E169*$H169,0)","v":0},null,{"$f":"IF(SUM(BC$10:BC$10)>0,$E169*$H169,0)","v":0},null,{"$f":"IF(SUM(BE$10:BE$10)>0,$E169*$H169,0)","v":0},null,{"$f":"IF(SUM(BG$10:BG$10)>0,$E169*$H169,0)","v":0},null,{"$f":"IF(SUM(BI$10:BI$10)>0,$E169*$H169,0)","v":0},null,{"$f":"IF(SUM(BK$10:BK$10)>0,$E169*$H169,0)","v":0},null,{"$f":"IF(SUM(BM$10:BM$10)>0,$E169*$H169,0)","v":0},null,{"$f":"IF(SUM(BO$10:BO$10)>0,$E169*$H169,0)","v":0},null,{"$f":"IF(SUM(BQ$10:BQ$10)>0,$E169*$H169,0)","v":0},null,{"$f":"IF(SUM(BS$10:BS$10)>0,$E169*$H169,0)","v":0},null,{"$f":"IF(SUM(BU$10:BU$10)>0,$E169*$H169,0)","v":0},null,{"$f":"IF(SUM(BW$10:BW$10)>0,$E169*$H169,0)","v":0},null,{"$f":"IF(SUM(BY$10:BY$10)>0,$E169*$H169,0)","v":0},null,{"$f":"IF(SUM(CA$10:CA$10)>0,$E169*$H169,0)","v":0},null,{"$f":"IF(SUM(CC$10:CC$10)>0,$E169*$H169,0)","v":0},null,{"$f":"IF(SUM(CE$10:CE$10)>0,$E169*$H169,0)","v":0},null,{"$f":"IF(SUM(CG$10:CG$10)>0,$E169*$H169,0)","v":0},null,{"$f":"IF(SUM(CI$10:CI$10)>0,$E169*$H169,0)","v":0},null,{"$f":"IF(SUM(CK$10:CK$10)>0,$E169*$H169,0)","v":0},null,{"$f":"IF(SUM(CM$10:CM$10)>0,$E169*$H169,0)","v":0},null,{"$f":"IF(SUM(CO$10:CO$10)>0,$E169*$H169,0)","v":0},null,{"$f":"IF(SUM(CQ$10:CQ$10)>0,$E169*$H169,0)","v":0},null,{"$f":"IF(SUM(CS$10:CS$10)>0,$E169*$H169,0)","v":0},null,{"$f":"IF(SUM(CU$10:CU$10)>0,$E169*$H169,0)","v":0},null,{"$f":"IF(SUM(CW$10:CW$10)>0,$E169*$H169,0)","v":0},null,{"$f":"IF(SUM(CY$10:CY$10)>0,$E169*$H169,0)","v":0},null,{"$f":"IF(SUM(DA$10:DA$10)>0,$E169*$H169,0)","v":0},null,{"$f":"IF(SUM(DC$10:DC$10)>0,$E169*$H169,0)","v":0},null,{"$f":"IF(SUM(DE$10:DE$10)>0,$E169*$H169,0)","v":0},null,{"$f":"IF(SUM(DG$10:DG$10)>0,$E169*$H169,0)","v":0},null,{"$f":"IF(SUM(DI$10:DI$10)>0,$E169*$H169,0)","v":0},null,{"$f":"IF(SUM(DK$10:DK$10)>0,$E169*$H169,0)","v":0},null,{"$f":"IF(SUM(DM$10:DM$10)>0,$E169*$H169,0)","v":0},null,{"$f":"IF(SUM(DO$10:DO$10)>0,$E169*$H169,0)","v":0},null,{"$f":"IF(SUM(DQ$10:DQ$10)>0,$E169*$H169,0)","v":0},null,{"$f":"IF(SUM(DS$10:DS$10)>0,$E169*$H169,0)","v":0},null,{"$f":"IF(SUM(DU$10:DU$10)>0,$E169*$H169,0)","v":0},null,{"$f":"IF(SUM(DW$10:DW$10)>0,$E169*$H169,0)","v":0},null,{"$f":"IF(SUM(DY$10:DY$10)>0,$E169*$H169,0)","v":0}]
[null,null,null,null,null,{"$f":"F169","v":{"$error":"#N/A"}},{"$error":"#N/A"},null,null,null,null,{"$f":"IF(SUM(K$163:K$165)>0,$E170*$H170,0)","v":0},null,{"$f":"IF(SUM(M$163:M$165)>0,$E170*$H170,0)","v":0},null,{"$f":"IF(SUM(O$163:O$165)>0,$E170*$H170,0)","v":0},null,{"$f":"IF(SUM(Q$163:Q$165)>0,$E170*$H170,0)","v":0},null,{"$f":"IF(SUM(S$163:S$165)>0,$E170*$H170,0)","v":0},null,{"$f":"IF(SUM(U$163:U$165)>0,$E170*$H170,0)","v":0},null,{"$f":"IF(SUM(W$163:W$165)>0,$E170*$H170,0)","v":0},null,{"$f":"IF(SUM(Y$163:Y$165)>0,$E170*$H170,0)","v":0},null,{"$f":"IF(SUM(AA$163:AA$165)>0,$E170*$H170,0)","v":0},null,{"$f":"IF(SUM(AC$163:AC$165)>0,$E170*$H170,0)","v":0},null,{"$f":"IF(SUM(AE$163:AE$165)>0,$E170*$H170,0)","v":0},null,{"$f":"IF(SUM(AG$163:AG$165)>0,$E170*$H170,0)","v":0},null,{"$f":"IF(SUM(AI$163:AI$165)>0,$E170*$H170,0)","v":0},null,{"$f":"IF(SUM(AK$163:AK$165)>0,$E170*$H170,0)","v":0},null,{"$f":"IF(SUM(AM$163:AM$165)>0,$E170*$H170,0)","v":0},null,{"$f":"IF(SUM(AO$163:AO$165)>0,$E170*$H170,0)","v":0},null,{"$f":"IF(SUM(AQ$163:AQ$165)>0,$E170*$H170,0)","v":0},null,0,null,{"$f":"IF(SUM(AU$10:AU$10)>0,$E170*$H170,0)","v":0},null,{"$f":"IF(SUM(AW$10:AW$10)>0,$E170*$H170,0)","v":0},null,{"$f":"IF(SUM(AY$10:AY$10)>0,$E170*$H170,0)","v":0},null,{"$f":"IF(SUM(BA$10:BA$10)>0,$E170*$H170,0)","v":0},null,{"$f":"IF(SUM(BC$10:BC$10)>0,$E170*$H170,0)","v":0},null,{"$f":"IF(SUM(BE$10:BE$10)>0,$E170*$H170,0)","v":0},null,{"$f":"IF(SUM(BG$10:BG$10)>0,$E170*$H170,0)","v":0},null,{"$f":"IF(SUM(BI$10:BI$10)>0,$E170*$H170,0)","v":0},null,{"$f":"IF(SUM(BK$10:BK$10)>0,$E170*$H170,0)","v":0},null,{"$f":"IF(SUM(BM$10:BM$10)>0,$E170*$H170,0)","v":0},null,{"$f":"IF(SUM(BO$10:BO$10)>0,$E170*$H170,0)","v":0},null,{"$f":"IF(SUM(BQ$10:BQ$10)>0,$E170*$H170,0)","v":0},null,{"$f":"IF(SUM(BS$10:BS$10)>0,$E170*$H170,0)","v":0},null,{"$f":"IF(SUM(BU$10:BU$10)>0,$E170*$H170,0)","v":0},null,{"$f":"IF(SUM(BW$10:BW$10)>0,$E170*$H170,0)","v":0},null,{"$f":"IF(SUM(BY$10:BY$10)>0,$E170*$H170,0)","v":0},null,{"$f":"IF(SUM(CA$10:CA$10)>0,$E170*$H170,0)","v":0},null,{"$f":"IF(SUM(CC$10:CC$10)>0,$E170*$H170,0)","v":0},null,{"$f":"IF(SUM(CE$10:CE$10)>0,$E170*$H170,0)","v":0},null,{"$f":"IF(SUM(CG$10:CG$10)>0,$E170*$H170,0)","v":0},null,{"$f":"IF(SUM(CI$10:CI$10)>0,$E170*$H170,0)","v":0},null,{"$f":"IF(SUM(CK$10:CK$10)>0,$E170*$H170,0)","v":0},null,{"$f":"IF(SUM(CM$10:CM$10)>0,$E170*$H170,0)","v":0},null,{"$f":"IF(SUM(CO$10:CO$10)>0,$E170*$H170,0)","v":0},null,{"$f":"IF(SUM(CQ$10:CQ$10)>0,$E170*$H170,0)","v":0},null,{"$f":"IF(SUM(CS$10:CS$10)>0,$E170*$H170,0)","v":0},null,{"$f":"IF(SUM(CU$10:CU$10)>0,$E170*$H170,0)","v":0},null,{"$f":"IF(SUM(CW$10:CW$10)>0,$E170*$H170,0)","v":0},null,{"$f":"IF(SUM(CY$10:CY$10)>0,$E170*$H170,0)","v":0},null,{"$f":"IF(SUM(DA$10:DA$10)>0,$E170*$H170,0)","v":0},null,{"$f":"IF(SUM(DC$10:DC$10)>0,$E170*$H170,0)","v":0},null,{"$f":"IF(SUM(DE$10:DE$10)>0,$E170*$H170,0)","v":0},null,{"$f":"IF(SUM(DG$10:DG$10)>0,$E170*$H170,0)","v":0},null,{"$f":"IF(SUM(DI$10:DI$10)>0,$E170*$H170,0)","v":0},null,{"$f":"IF(SUM(DK$10:DK$10)>0,$E170*$H170,0)","v":0},null,{"$f":"IF(SUM(DM$10:DM$10)>0,$E170*$H170,0)","v":0},null,{"$f":"IF(SUM(DO$10:DO$10)>0,$E170*$H170,0)","v":0},null,{"$f":"IF(SUM(DQ$10:DQ$10)>0,$E170*$H170,0)","v":0},null,{"$f":"IF(SUM(DS$10:DS$10)>0,$E170*$H170,0)","v":0},null,{"$f":"IF(SUM(DU$10:DU$10)>0,$E170*$H170,0)","v":0},null,{"$f":"IF(SUM(DW$10:DW$10)>0,$E170*$H170,0)","v":0},null,{"$f":"IF(SUM(DY$10:DY$10)>0,$E170*$H170,0)","v":0}]
[null,null,null,null,null,null,null,null,null,null,null,{"$f":"IF(SUM(K$12:K$14)>0,$E171*$H171,0)","v":0},null,{"$f":"IF(SUM(M$12:M$14)>0,$E171*$H171,0)","v":0},null,{"$f":"IF(SUM(O$12:O$14)>0,$E171*$H171,0)","v":0},null,{"$f":"IF(SUM(Q$12:Q$14)>0,$E171*$H171,0)","v":0},null,{"$f":"IF(SUM(S$12:S$14)>0,$E171*$H171,0)","v":0},null,{"$f":"IF(SUM(U$12:U$14)>0,$E171*$H171,0)","v":0},null,{"$f":"IF(SUM(W$12:W$14)>0,$E171*$H171,0)","v":0},null,{"$f":"IF(SUM(Y$12:Y$14)>0,$E171*$H171,0)","v":0},null,{"$f":"IF(SUM(AA$12:AA$14)>0,$E171*$H171,0)","v":0},null,{"$f":"IF(SUM(AC$12:AC$14)>0,$E171*$H171,0)","v":0},null,{"$f":"IF(SUM(AE$12:AE$14)>0,$E171*$H171,0)","v":0},null,{"$f":"IF(SUM(AG$12:AG$14)>0,$E171*$H171,0)","v":0},null,{"$f":"IF(SUM(AI$12:AI$14)>0,$E171*$H171,0)","v":0},null,{"$f":"IF(SUM(AK$12:AK$14)>0,$E171*$H171,0)","v":0},null,{"$f":"IF(SUM(AM$12:AM$14)>0,$E171*$H171,0)","v":0},null,{"$f":"IF(SUM(AO$12:AO$14)>0,$E171*$H171,0)","v":0},null,{"$f":"IF(SUM(AQ$12:AQ$14)>0,$E171*$H171,0)","v":0},null,{"$f":"IF(SUM(AS$12:AS$14)>0,$E171*$H171,0)","v":0},null,{"$f":"IF(SUM(AU$10:AU$10)>0,$E171*$H171,0)","v":0},null,{"$f":"IF(SUM(AW$10:AW$10)>0,$E171*$H171,0)","v":0},null,{"$f":"IF(SUM(AY$10:AY$10)>0,$E171*$H171,0)","v":0},null,{"$f":"IF(SUM(BA$10:BA$10)>0,$E171*$H171,0)","v":0},null,{"$f":"IF(SUM(BC$10:BC$10)>0,$E171*$H171,0)","v":0},null,{"$f":"IF(SUM(BE$10:BE$10)>0,$E171*$H171,0)","v":0},null,{"$f":"IF(SUM(BG$10:BG$10)>0,$E171*$H171,0)","v":0},null,{"$f":"IF(SUM(BI$10:BI$10)>0,$E171*$H171,0)","v":0},null,{"$f":"IF(SUM(BK$10:BK$10)>0,$E171*$H171,0)","v":0},null,{"$f":"IF(SUM(BM$10:BM$10)>0,$E171*$H171,0)","v":0},null,{"$f":"IF(SUM(BO$10:BO$10)>0,$E171*$H171,0)","v":0},null,{"$f":"IF(SUM(BQ$10:BQ$10)>0,$E171*$H171,0)","v":0},null,{"$f":"IF(SUM(BS$10:BS$10)>0,$E171*$H171,0)","v":0},null,{"$f":"IF(SUM(BU$10:BU$10)>0,$E171*$H171,0)","v":0},null,{"$f":"IF(SUM(BW$10:BW$10)>0,$E171*$H171,0)","v":0},null,{"$f":"IF(SUM(BY$10:BY$10)>0,$E171*$H171,0)","v":0},null,{"$f":"IF(SUM(CA$10:CA$10)>0,$E171*$H171,0)","v":0},null,{"$f":"IF(SUM(CC$10:CC$10)>0,$E171*$H171,0)","v":0},null,{"$f":"IF(SUM(CE$10:CE$10)>0,$E171*$H171,0)","v":0},null,{"$f":"IF(SUM(CG$10:CG$10)>0,$E171*$H171,0)","v":0},null,{"$f":"IF(SUM(CI$10:CI$10)>0,$E171*$H171,0)","v":0},null,{"$f":"IF(SUM(CK$10:CK$10)>0,$E171*$H171,0)","v":0},null,{"$f":"IF(SUM(CM$10:CM$10)>0,$E171*$H171,0)","v":0},null,{"$f":"IF(SUM(CO$10:CO$10)>0,$E171*$H171,0)","v":0},null,{"$f":"IF(SUM(CQ$10:CQ$10)>0,$E171*$H171,0)","v":0},null,{"$f":"IF(SUM(CS$10:CS$10)>0,$E171*$H171,0)","v":0},null,{"$f":"IF(SUM(CU$10:CU$10)>0,$E171*$H171,0)","v":0},null,{"$f":"IF(SUM(CW$10:CW$10)>0,$E171*$H171,0)","v":0},null,{"$f":"IF(SUM(CY$10:CY$10)>0,$E171*$H171,0)","v":0},null,{"$f":"IF(SUM(DA$10:DA$10)>0,$E171*$H171,0)","v":0},null,{"$f":"IF(SUM(DC$10:DC$10)>0,$E171*$H171,0)","v":0},null,{"$f":"IF(SUM(DE$10:DE$10)>0,$E171*$H171,0)","v":0},null,{"$f":"IF(SUM(DG$10:DG$10)>0,$E171*$H171,0)","v":0},null,{"$f":"IF(SUM(DI$10:DI$10)>0,$E171*$H171,0)","v":0},null,{"$f":"IF(SUM(DK$10:DK$10)>0,$E171*$H171,0)","v":0},null,{"$f":"IF(SUM(DM$10:DM$10)>0,$E171*$H171,0)","v":0},null,{"$f":"IF(SUM(DO$10:DO$10)>0,$E171*$H171,0)","v":0},null,{"$f":"IF(SUM(DQ$10:DQ$10)>0,$E171*$H171,0)","v":0},null,{"$f":"IF(SUM(DS$10:DS$10)>0,$E171*$H171,0)","v":0},null,{"$f":"IF(SUM(DU$10:DU$10)>0,$E171*$H171,0)","v":0},null,{"$f":"IF(SUM(DW$10:DW$10)>0,$E171*$H171,0)","v":0},null,{"$f":"IF(SUM(DY$10:DY$10)>0,$E171*$H171,0)","v":0}]
[]
[null,null,null,null,null,null,null,null,null,null,{"$f":"SUMPRODUCT(#REF!,#REF!)","v":{"$error":"#REF!"}}]
[null,null,null,null,null,null,null,null,null,null,{"$f":"K173*(#REF!+#REF!)","v":{"$error":"#REF!"}}]
[null,null,null,null,null,null,null,null,null,null,{"$f":"K174/12","v":{"$error":"#REF!"}}]
[null,null,null,null,null,null,null,null,null,null,{"$f":"K175/91","v":{"$error":"#REF!"}}]

{"sheet":"EPI","index":20,"n_rows":40,"n_cols":128,"rows_kept":40,"cut":false,"hidden":false,"merged":[[1,1,1,3],[2,1,2,5]]}
[]
[]
[null,"EQUIPAMENTOS DE PROTEÇÃO INDIVIDUAL - AQUISIÇÃO",null,null,null,null,null,null,1,null,{"$f":"I3+1","v":2},null,{"$f":"K3+1","v":3},null,{"$f":"M3+1","v":4},null,{"$f":"O3+1","v":5},null,{"$f":"Q3+1","v":6},null,{"$f":"S3+1","v":7},null,{"$f":"U3+1","v":8},null,{"$f":"W3+1","v":9},null,{"$f":"Y3+1","v":10},null,{"$f":"AA3+1","v":11},null,{"$f":"AC3+1","v":12},null,{"$f":"AE3+1","v":13},null,{"$f":"AG3+1","v":14},null,{"$f":"AI3+1","v":15},null,{"$f":"AK3+1","v":16},null,{"$f":"AM3+1","v":17},null,{"$f":"AO3+1","v":18},null,{"$f":"AQ3+1","v":19},null,{"$f":"AS3+1","v":20},null,{"$f":"AU3+1","v":21},null,{"$f":"AW3+1","v":22},null,{"$f":"AY3+1","v":23},null,{"$f":"BA3+1","v":24},null,{"$f":"BC3+1","v":25},null,{"$f":"BE3+1","v":26},null,{"$f":"BG3+1","v":27},null,{"$f":"BI3+1","v":28},null,{"$f":"BK3+1","v":29},null,{"$f":"BM3+1","v":30},null,{"$f":"BO3+1","v":31},null,{"$f":"BQ3+1","v":32},null,{"$f":"BS3+1","v":33},null,{"$f":"BU3+1","v":34},null,{"$f":"BW3+1","v":35},null,{"$f":"BY3+1","v":36},null,{"$f":"CA3+1","v":37},null,{"$f":"CC3+1","v":38},null,{"$f":"CE3+1","v":39},null,{"$f":"CG3+1","v":40},null,{"$f":"CI3+1","v":41},null,{"$f":"CK3+1","v":42},null,{"$f":"CM3+1","v":43},null,{"$f":"CO3+1","v":44},null,{"$f":"CQ3+1","v":45},null,{"$f":"CS3+1","v":46},null,{"$f":"CU3+1","v":47},null,{"$f":"CW3+1","v":48},null,{"$f":"CY3+1","v":49},null,{"$f":"DA3+1","v":50},null,{"$f":"DC3+1","v":51},null,{"$f":"DE3+1","v":52},null,{"$f":"DG3+1","v":53},null,{"$f":"DI3+1","v":54},null,{"$f":"DK3+1","v":55},null,{"$f":"DM3+1","v":56},null,{"$f":"DO3+1","v":57},null,{"$f":"DQ3+1","v":58},null,{"$f":"DS3+1","v":59},null,{"$f":"DU3+1","v":60}]
[]
[null,null,null,null,null,null,null,null,{"$f":"ROUND(SUM(J4:J37),2)","v":0},null,{"$f":"ROUND(SUM(L4:L74),2)","v":0},null,{"$f":"ROUND(SUM(N4:N74),2)","v":0},null,{"$f":"ROUND(SUM(P4:P74),2)","v":0},null,{"$f":"ROUND(SUM(R4:R74),2)","v":0},null,{"$f":"ROUND(SUM(T4:T74),2)","v":0},null,{"$f":"ROUND(SUM(V4:V74),2)","v":5705.42},null,{"$f":"ROUND(SUM(X4:X74),2)","v":4006.64},null,{"$f":"ROUND(SUM(Z4:Z74),2)","v":0},null,{"$f":"ROUND(SUM(AB4:AB74),2)","v":0},null,{"$f":"ROUND(SUM(AD4:AD74),2)","v":0},null,{"$f":"ROUND(SUM(AF4:AF74),2)","v":0},null,{"$f":"ROUND(SUM(AH4:AH74),2)","v":0},null,{"$f":"ROUND(SUM(AJ4:AJ74),2)","v":0},null,{"$f":"ROUND(SUM(AL4:AL74),2)","v":0},null,{"$f":"ROUND(SUM(AN4:AN74),2)","v":0},null,{"$f":"ROUND(SUM(AP4:AP74),2)","v":0},null,{"$f":"ROUND(SUM(AR4:AR74),2)","v":0},null,{"$f":"ROUND(SUM(AT4:AT74),2)","v":0},null,{"$f":"ROUND(SUM(AV4:AV74),2)","v":0},null,{"$f":"ROUND(SUM(AX4:AX74),2)","v":0},null,{"$f":"ROUND(SUM(AZ4:AZ74),2)","v":0},null,{"$f":"ROUND(SUM(BB4:BB74),2)","v":0},null,{"$f":"ROUND(SUM(BD4:BD74),2)","v":0},null,{"$f":"ROUND(SUM(BF4:BF74),2)","v":0},null,{"$f":"ROUND(SUM(BH4:BH74),2)","v":0},null,{"$f":"ROUND(SUM(BJ4:BJ74),2)","v":0},null,{"$f":"ROUND(SUM(BL4:BL74),2)","v":0},null,{"$f":"ROUND(SUM(BN4:BN74),2)","v":0},null,{"$f":"ROUND(SUM(BP4:BP74),2)","v":0},null,{"$f":"ROUND(SUM(BR4:BR74),2)","v":0},null,{"$f":"ROUND(SUM(BT4:BT74),2)","v":0},null,{"$f":"ROUND(SUM(BV4:BV74),2)","v":0},null,{"$f":"ROUND(SUM(BX4:BX74),2)","v":0},null,{"$f":"ROUND(SUM(BZ4:BZ74),2)","v":0},null,{"$f":"ROUND(SUM(CB4:CB74),2)","v":0},null,{"$f":"ROUND(SUM(CD4:CD74),2)","v":0},null,{"$f":"ROUND(SUM(CF4:CF74),2)","v":0},null,{"$f":"ROUND(SUM(CH4:CH74),2)","v":0},null,{"$f":"ROUND(SUM(CJ4:CJ74),2)","v":0},null,{"$f":"ROUND(SUM(CL4:CL74),2)","v":0},null,{"$f":"ROUND(SUM(CN4:CN74),2)","v":0},null,{"$f":"ROUND(SUM(CP4:CP74),2)","v":0},null,{"$f":"ROUND(SUM(CR4:CR74),2)","v":0},null,{"$f":"ROUND(SUM(CT4:CT74),2)","v":0},null,{"$f":"ROUND(SUM(CV4:CV74),2)","v":0},null,{"$f":"ROUND(SUM(CX4:CX74),2)","v":0},null,{"$f":"ROUND(SUM(CZ4:CZ74),2)","v":0},null,{"$f":"ROUND(SUM(DB4:DB74),2)","v":0},null,{"$f":"ROUND(SUM(DD4:DD74),2)","v":0},null,{"$f":"ROUND(SUM(DF4:DF74),2)","v":0},null,{"$f":"ROUND(SUM(DH4:DH74),2)","v":0},null,{"$f":"ROUND(SUM(DJ4:DJ74),2)","v":0},null,{"$f":"ROUND(SUM(DL4:DL74),2)","v":0},null,{"$f":"ROUND(SUM(DN4:DN74),2)","v":0},null,{"$f":"ROUND(SUM(DP4:DP74),2)","v":0},null,{"$f":"ROUND(SUM(DR4:DR74),2)","v":0},null,{"$f":"ROUND(SUM(DT4:DT74),2)","v":0},null,{"$f":"ROUND(SUM(DV4:DV74),2)","v":0},null,{"$f":"ROUND(SUM(DX4:DX74),2)","v":0}]
[null,null,"CATEGORIAS",null,null,"QUANTIDADE"]
[null,null,null,null,null,null,null,null,{"$f":"IF($C7=I$3,1,0)","v":0},null,{"$f":"IF($C7=K$3,1,0)","v":0},null,{"$f":"IF($C7=M$3,1,0)","v":0},null,{"$f":"IF($C7=O$3,1,0)","v":0},null,{"$f":"IF($C7=Q$3,1,0)","v":0},null,{"$f":"IF($C7=S$3,1,0)","v":0},null,{"$f":"IF($C7=U$3,1,0)","v":0},null,{"$f":"IF($C7=W$3,1,0)","v":0},null,{"$f":"IF($C7=Y$3,1,0)","v":0},null,{"$f":"IF($C7=AA$3,1,0)","v":0},null,{"$f":"IF($C7=AC$3,1,0)","v":0},null,{"$f":"IF($C7=AE$3,1,0)","v":0},null,{"$f":"IF($C7=AG$3,1,0)","v":0},null,{"$f":"IF($C7=AI$3,1,0)","v":0},null,{"$f":"IF($C7=AK$3,1,0)","v":0},null,{"$f":"IF($C7=AM$3,1,0)","v":0},null,{"$f":"IF($C7=AO$3,1,0)","v":0},null,{"$f":"IF($C7=AQ$3,1,0)","v":0},null,{"$f":"IF($C7=AS$3,1,0)","v":0}]
[null,null,7,{"$f":"HLOOKUP($C8,'Dados Gerais'!$D$5:$BK$10,6)","v":"TÉCNICO INSTALADOR DE CABEAMENTO"},null,{"$f":"HLOOKUP($C8,'Dados Gerais'!$D$5:$BK$14,10)","v":7},null,null,{"$f":"IF($C8=I$3,1,0)","v":0},null,0,null,0,null,0,null,0,null,0,null,1,null,0,null,0,null,0,null,0,null,{"$f":"IF($C8=AE$3,1,0)","v":0},null,0,null,0,null,0,null,0,null,0,null,0,null,0,null,{"$f":"IF($C8=AU$3,1,0)","v":0},null,{"$f":"IF($C8=AW$3,1,0)","v":0},null,{"$f":"IF($C8=AY$3,1,0)","v":0},null,{"$f":"IF($C8=BA$3,1,0)","v":0},null,{"$f":"IF($C8=BC$3,1,0)","v":0},null,{"$f":"IF($C8=BE$3,1,0)","v":0},null,{"$f":"IF($C8=BG$3,1,0)","v":0},null,{"$f":"IF($C8=BI$3,1,0)","v":0},null,{"$f":"IF($C8=BK$3,1,0)","v":0},null,{"$f":"IF($C8=BM$3,1,0)","v":0},null,{"$f":"IF($C8=BO$3,1,0)","v":0},null,{"$f":"IF($C8=BQ$3,1,0)","v":0},null,{"$f":"IF($C8=BS$3,1,0)","v":0},null,{"$f":"IF($C8=BU$3,1,0)","v":0},null,{"$f":"IF($C8=BW$3,1,0)","v":0},null,{"$f":"IF($C8=BY$3,1,0)","v":0},null,{"$f":"IF($C8=CA$3,1,0)","v":0},null,{"$f":"IF($C8=CC$3,1,0)","v":0},null,{"$f":"IF($C8=CE$3,1,0)","v":0},null,{"$f":"IF($C8=CG$3,1,0)","v":0},null,{"$f":"IF($C8=CI$3,1,0)","v":0},null,{"$f":"IF($C8=CK$3,1,0)","v":0},null,{"$f":"IF($C8=CM$3,1,0)","v":0},null,{"$f":"IF($C8=CO$3,1,0)","v":0},null,{"$f":"IF($C8=CQ$3,1,0)","v":0},null,{"$f":"IF($C8=CS$3,1,0)","v":0},null,{"$f":"IF($C8=CU$3,1,0)","v":0},null,{"$f":"IF($C8=CW$3,1,0)","v":0},null,{"$f":"IF($C8=CY$3,1,0)","v":0},null,{"$f":"IF($C8=DA$3,1,0)","v":0},null,{"$f":"IF($C8=DC$3,1,0)","v":0},null,{"$f":"IF($C8=DE$3,1,0)","v":0},null,{"$f":"IF($C8=DG$3,1,0)","v":0},null,{"$f":"IF($C8=DI$3,1,0)","v":0},null,{"$f":"IF($C8=DK$3,1,0)","v":0},null,{"$f":"IF($C8=DM$3,1,0)","v":0},null,{"$f":"IF($C8=DO$3,1,0)","v":0},null,{"$f":"IF($C8=DQ$3,1,0)","v":0},null,{"$f":"IF($C8=DS$3,1,0)","v":0},null,{"$f":"IF($C8=DU$3,1,0)","v":0},null,{"$f":"IF($C8=DW$3,1,0)","v":0}]
[null,null,null,null,null,null,null,null,{"$f":"IF($C9=I$3,1,0)","v":0},null,0,null,0,null,0,null,0,null,0,null,0,null,0,null,0,null,0,null,0,null,{"$f":"IF($C9=AE$3,1,0)","v":0},null,0,null,0,null,0,null,0,null,0,null,0,null,0]
[]
[null,null,"ITEM","DESCRIÇÃO","QUANT ANUAL POR POSTO","VALOR"]
[]
[null,null,1,"Luva de malha tricotada em fios de algodão com acabamento em overloque e palmas pigmentadas em PVC. Ref. LEDAN",28,4.07,null,null,null,{"$f":"IF(SUM(I$7:I$9)>0,$E13*$F13,0)","v":0},null,{"$f":"IF(SUM(K$7:K$9)>0,$E13*$F13,0)","v":0},null,{"$f":"IF(SUM(M$7:M$9)>0,$E13*$F13,0)","v":0},null,{"$f":"IF(SUM(O$7:O$9)>0,$E13*$F13,0)","v":0},null,{"$f":"IF(SUM(Q$7:Q$9)>0,$E13*$F13,0)","v":0},null,{"$f":"IF(SUM(S$7:S$9)>0,$E13*$F13,0)","v":0},null,{"$f":"IF(SUM(U$7:U$9)>0,$E13*$F13,0)","v":113.96000000000001},null,{"$f":"IF(SUM(W$7:W$9)>0,$E13*$F13,0)","v":0},null,{"$f":"IF(SUM(Y$7:Y$9)>0,$E13*$F13,0)","v":0},null,{"$f":"IF(SUM(AA$7:AA$9)>0,$E13*$F13,0)","v":0},null,{"$f":"IF(SUM(AC$7:AC$9)>0,$E13*$F13,0)","v":0},null,{"$f":"IF(SUM(AE$7:AE$9)>0,$E13*$F13,0)","v":0},null,{"$f":"IF(SUM(AG$7:AG$9)>0,$E13*$F13,0)","v":0},null,{"$f":"IF(SUM(AI$7:AI$9)>0,$E13*$F13,0)","v":0},null,{"$f":"IF(SUM(AK$7:AK$9)>0,$E13*$F13,0)","v":0},null,{"$f":"IF(SUM(AM$7:AM$9)>0,$E13*$F13,0)","v":0},null,{"$f":"IF(SUM(AO$7:AO$9)>0,$E13*$F13,0)","v":0},null,{"$f":"IF(SUM(AQ$7:AQ$9)>0,$E13*$F13,0)","v":0},null,{"$f":"IF(SUM(AS$7:AS$9)>0,$E13*$F13,0)","v":0},null,{"$f":"IF(SUM(AU$7:AU$9)>0,$E13*$F13,0)","v":0},null,{"$f":"IF(SUM(AW$7:AW$9)>0,$E13*$F13,0)","v":0},null,{"$f":"IF(SUM(AY$7:AY$9)>0,$E13*$F13,0)","v":0},null,{"$f":"IF(SUM(BA$7:BA$9)>0,$E13*$F13,0)","v":0},null,{"$f":"IF(SUM(BC$7:BC$9)>0,$E13*$F13,0)","v":0},null,{"$f":"IF(SUM(BE$7:BE$9)>0,$E13*$F13,0)","v":0},null,{"$f":"IF(SUM(BG$7:BG$9)>0,$E13*$F13,0)","v":0},null,{"$f":"IF(SUM(BI$7:BI$9)>0,$E13*$F13,0)","v":0},null,{"$f":"IF(SUM(BK$7:BK$9)>0,$E13*$F13,0)","v":0},null,{"$f":"IF(SUM(BM$7:BM$9)>0,$E13*$F13,0)","v":0},null,{"$f":"IF(SUM(BO$7:BO$9)>0,$E13*$F13,0)","v":0},null,{"$f":"IF(SUM(BQ$7:BQ$9)>0,$E13*$F13,0)","v":0},null,{"$f":"IF(SUM(BS$7:BS$9)>0,$E13*$F13,0)","v":0},null,{"$f":"IF(SUM(BU$7:BU$9)>0,$E13*$F13,0)","v":0},null,{"$f":"IF(SUM(BW$7:BW$9)>0,$E13*$F13,0)","v":0},null,{"$f":"IF(SUM(BY$7:BY$9)>0,$E13*$F13,0)","v":0},null,{"$f":"IF(SUM(CA$7:CA$9)>0,$E13*$F13,0)","v":0},null,{"$f":"IF(SUM(CC$7:CC$9)>0,$E13*$F13,0)","v":0},null,{"$f":"IF(SUM(CE$7:CE$9)>0,$E13*$F13,0)","v":0},null,{"$f":"IF(SUM(CG$7:CG$9)>0,$E13*$F13,0)","v":0},null,{"$f":"IF(SUM(CI$7:CI$9)>0,$E13*$F13,0)","v":0},null,{"$f":"IF(SUM(CK$7:CK$9)>0,$E13*$F13,0)","v":0},null,{"$f":"IF(SUM(CM$7:CM$9)>0,$E13*$F13,0)","v":0},null,{"$f":"IF(SUM(CO$7:CO$9)>0,$E13*$F13,0)","v":0},null,{"$f":"IF(SUM(CQ$7:CQ$9)>0,$E13*$F13,0)","v":0},null,{"$f":"IF(SUM(CS$7:CS$9)>0,$E13*$F13,0)","v":0},null,{"$f":"IF(SUM(CU$7:CU$9)>0,$E13*$F13,0)","v":0},null,{"$f":"IF(SUM(CW$7:CW$9)>0,$E13*$F13,0)","v":0},null,{"$f":"IF(SUM(CY$7:CY$9)>0,$E13*$F13,0)","v":0},null,{"$f":"IF(SUM(DA$7:DA$9)>0,$E13*$F13,0)","v":0},null,{"$f":"IF(SUM(DC$7:DC$9)>0,$E13*$F13,0)","v":0},null,{"$f":"IF(SUM(DE$7:DE$9)>0,$E13*$F13,0)","v":0},null,{"$f":"IF(SUM(DG$7:DG$9)>0,$E13*$F13,0)","v":0},null,{"$f":"IF(SUM(DI$7:DI$9)>0,$E13*$F13,0)","v":0},null,{"$f":"IF(SUM(DK$7:DK$9)>0,$E13*$F13,0)","v":0},null,{"$f":"IF(SUM(DM$7:DM$9)>0,$E13*$F13,0)","v":0},null,{"$f":"IF(SUM(DO$7:DO$9)>0,$E13*$F13,0)","v":0},null,{"$f":"IF(SUM(DQ$7:DQ$9)>0,$E13*$F13,0)","v":0},null,{"$f":"IF(SUM(DS$7:DS$9)>0,$E13*$F13,0)","v":0},null,{"$f":"IF(SUM(DU$7:DU$9)>0,$E13*$F13,0)","v":0},null,{"$f":"IF(SUM(DW$7:DW$9)>0,$E13*$F13,0)","v":0}]
[null,null,2,"Luva de segurança confeccionada em vaqueta na palma e face palmar dos dedos, dorso e face dorsal dos dedos em raspa, reforço interno em vaqueta na palma, com cano longo em raspa (20 cm)",28,25.98,null,null,null,0,null,0,null,0,null,0,null,0,null,0,null,727.44,null,0,null,0,null,0,null,0,null,0,null,0,null,0,null,0,null,0,null,0,null,0,null,0,null,0,null,0,null,0,null,0,null,0,null,0,null,0,null,0,null,0,null,0,null,0,null,0,null,0,null,0,null,0,null,0,null,0,null,0,null,0,null,0,null,0,null,0,null,0,null,0,null,0,null,0,null,0,null,0,null,0,null,0,null,0,null,0,null,0,null,0,null,0,null,0,null,0,null,0,null,0,null,0,null,0]
[null,null,3,"Luvas em poliuretano, cor preta, acabamento liso, com forro em poliamida, sem costura, punho tricotado c/ elástico. Tamanhos P, M e G",42,4.71,null,null,null,0,null,0,null,0,null,0,null,0,null,0,null,197.82,null,0,null,0,null,0,null,0,null,0,null,0,null,0,null,0,null,0,null,0,null,0,null,0,null,0,null,0,null,0,null,0,null,0,null,0,null,0,null,0,null,0,null,0,null,0,null,0,null,0,null,0,null,0,null,0,null,0,null,0,null,0,null,0,null,0,null,0,null,0,null,0,null,0,null,0,null,0,null,0,null,0,null,0,null,0,null,0,null,0,null,0,null,0,null,0,null,0,null,0,null,0,null,0,null,0]
[null,null,4,"Óculos de segurança constituídos de armação e visor confeccionados em uma única peça de policarbonato INCOLOR, anti-risco, apoio nasal de plástico maleável. Hastes emborrachadas. Ref.: 3M Virtua V4",21,31.45,null,null,null,0,null,0,null,0,null,0,null,0,null,0,null,660.44999999999993,null,0,null,0,null,0,null,0,null,0,null,0,null,0,null,0,null,0,null,0,null,0,null,0,null,0,null,0,null,0,null,0,null,0,null,0,null,0,null,0,null,0,null,0,null,0,null,0,null,0,null,0,null,0,null,0,null,0,null,0,null,0,null,0,null,0,null,0,null,0,null,0,null,0,null,0,null,0,null,0,null,0,null,0,null,0,null,0,null,0,null,0,null,0,null,0,null,0,null,0,null,0,null,0,null,0]
[null,null,5,"Óculos de proteção com armação em silicone e lente em policarbonato (sobrepor) marca Protech ou similar",7,21.87,null,null,null,0,null,{"$f":"IF(SUM(K$7:K$9)>0,$E17*$F17,0)","v":0},null,{"$f":"IF(SUM(M$7:M$9)>0,$E17*$F17,0)","v":0},null,{"$f":"IF(SUM(O$7:O$9)>0,$E17*$F17,0)","v":0},null,{"$f":"IF(SUM(Q$7:Q$9)>0,$E17*$F17,0)","v":0},null,{"$f":"IF(SUM(S$7:S$9)>0,$E17*$F17,0)","v":0},null,{"$f":"IF(SUM(U$7:U$9)>0,$E17*$F17,0)","v":153.09},null,{"$f":"IF(SUM(W$7:W$9)>0,$E17*$F17,0)","v":0},null,{"$f":"IF(SUM(Y$7:Y$9)>0,$E17*$F17,0)","v":0},null,{"$f":"IF(SUM(AA$7:AA$9)>0,$E17*$F17,0)","v":0},null,{"$f":"IF(SUM(AC$7:AC$9)>0,$E17*$F17,0)","v":0},null,{"$f":"IF(SUM(AE$7:AE$9)>0,$E17*$F17,0)","v":0},null,{"$f":"IF(SUM(AG$7:AG$9)>0,$E17*$F17,0)","v":0},null,{"$f":"IF(SUM(AI$7:AI$9)>0,$E17*$F17,0)","v":0},null,{"$f":"IF(SUM(AK$7:AK$9)>0,$E17*$F17,0)","v":0},null,{"$f":"IF(SUM(AM$7:AM$9)>0,$E17*$F17,0)","v":0},null,{"$f":"IF(SUM(AO$7:AO$9)>0,$E17*$F17,0)","v":0},null,{"$f":"IF(SUM(AQ$7:AQ$9)>0,$E17*$F17,0)","v":0},null,{"$f":"IF(SUM(AS$7:AS$9)>0,$E17*$F17,0)","v":0},null,0,null,0,null,0,null,0,null,0,null,0,null,0,null,0,null,0,null,0,null,0,null,0,null,0,null,0,null,0,null,0,null,0,null,0,null,0,null,0,null,0,null,0,null,0,null,0,null,0,null,0,null,0,null,0,null,0,null,0,null,0,null,0,null,0,null,0,null,0,null,0,null,0,null,0,null,0,null,0,null,0]
[null,null,6,"Respirador purificador de ar tipo, peça semifacial filtrante para partículas (PFF2), com formato dobrável, solda ultrassônica em todo o seu perímetro. Fita elástica branca fixada nas laterais externas do respirador, perfazendo uma alça na para fixação na parte superior da cabeça e a outra na parte inferior, para fixação na altura da nuca do\nusuário. A parte superior externa da peça possui tira de material metálico moldável, utilizada para ajuste no septo nasal. Na face lateral do respirador existe um dispositivo de material plástico, dotado internamente de uma válvula de exalação. DEVERÁ APRESENTAR O SELO DE APROVAÇÃO DO INMETRO. Ref. 3M\nObs: Enquanto durar a pandemia da Covid 19 as máscaras deverão ser fornecidas sem a válvula de exalação",{"$f":"24*7","v":168},3.71,null,null,null,0,null,0,null,0,null,0,null,0,null,0,null,623.28,null,0,null,0,null,0,null,0,null,0,null,0,null,0,null,0,null,0,null,0,null,0,null,0,null,0,null,0,null,0,null,0,null,0,null,0,null,0,null,0,null,0,null,0,null,0,null,0,null,0,null,0,null,0,null,0,null,0,null,0,null,0,null,0,null,0,null,0,null,0,null,0,null,0,null,0,null,0,null,0,null,0,null,0,null,0,null,0,null,0,null,0,null,0,null,0,null,0,null,0,null,0,null,0,null,0]
[null,null,7,"Capacete de segurança em polietileno de alta densidade, na cor CINZA sem aba, suspensão em tecido, com Faixa anti-suor, regulagem de tamanho com ajuste simples, proteção contra choques elétricos, com jugular ajustável.Ref: MSA",7,58.91,null,null,null,0,null,0,null,0,null,0,null,0,null,0,null,412.37,null,0,null,0,null,0,null,0,null,0,null,0,null,0,null,0,null,0,null,0,null,0,null,0,null,0,null,0,null,0,null,0,null,0,null,0,null,0,null,0,null,0,null,0,null,0,null,0,null,0,null,0,null,0,null,0,null,0,null,0,null,0,null,0,null,0,null,0,null,0,null,0,null,0,null,0,null,0,null,0,null,0,null,0,null,0,null,0,null,0,null,0,null,0,null,0,null,0,null,0,null,0,null,0,null,0]
[null,null,8,"Protetor auricular tipo plug em silicone, lavável com proteção mínima de 15 dB (A) de atenuação pelo método NRRsf. Ref.: 3M",{"$f":"8*7","v":56},3.53,null,null,null,0,null,{"$f":"IF(SUM(K$7:K$9)>0,$E20*$F20,0)","v":0},null,{"$f":"IF(SUM(M$7:M$9)>0,$E20*$F20,0)","v":0},null,{"$f":"IF(SUM(O$7:O$9)>0,$E20*$F20,0)","v":0},null,{"$f":"IF(SUM(Q$7:Q$9)>0,$E20*$F20,0)","v":0},null,{"$f":"IF(SUM(S$7:S$9)>0,$E20*$F20,0)","v":0},null,{"$f":"IF(SUM(U$7:U$9)>0,$E20*$F20,0)","v":197.67999999999998},null,{"$f":"IF(SUM(W$7:W$9)>0,$E20*$F20,0)","v":0},null,{"$f":"IF(SUM(Y$7:Y$9)>0,$E20*$F20,0)","v":0},null,{"$f":"IF(SUM(AA$7:AA$9)>0,$E20*$F20,0)","v":0},null,{"$f":"IF(SUM(AC$7:AC$9)>0,$E20*$F20,0)","v":0},null,{"$f":"IF(SUM(AE$7:AE$9)>0,$E20*$F20,0)","v":0},null,{"$f":"IF(SUM(AG$7:AG$9)>0,$E20*$F20,0)","v":0},null,{"$f":"IF(SUM(AI$7:AI$9)>0,$E20*$F20,0)","v":0},null,{"$f":"IF(SUM(AK$7:AK$9)>0,$E20*$F20,0)","v":0},null,{"$f":"IF(SUM(AM$7:AM$9)>0,$E20*$F20,0)","v":0},null,{"$f":"IF(SUM(AO$7:AO$9)>0,$E20*$F20,0)","v":0},null,{"$f":"IF(SUM(AQ$7:AQ$9)>0,$E20*$F20,0)","v":0},null,{"$f":"IF(SUM(AS$7:AS$9)>0,$E20*$F20,0)","v":0},null,0,null,0,null,0,null,0,null,0,null,0,null,0,null,0,null,0,null,0,null,0,null,0,null,0,null,0,null,0,null,0,null,0,null,0,null,0,null,0,null,0,null,0,null,0,null,0,null,0,null,0,null,0,null,0,null,0,null,0,null,0,null,0,null,0,null,0,null,0,null,0,null,0,null,0,null,0,null,0,null,0]
[null,null,9,"Botina de segurança, fechamento em elástico, sem componentes metálicos, confeccionada em couro\ncurtido ao cromo, na cor preta, elásticos laterais, BIQUEIRA EM COMPOSITE ou POLIPROPILENO,\nsolado de poliuretano bidensidade injetado diretamente ao cabedal, solado com perfil antiderrapante e sistemas de absorção de impacto. Deverá possuir proteção contra risco de choques elétricos. Com selo conforto. Em conformidade com as Normas de segurança da ABNT NBR ISO 20344 e 20347.",21,124.73,null,null,null,0,null,{"$f":"IF(SUM(K$7:K$9)>0,$E21*$F21,0)","v":0},null,{"$f":"IF(SUM(M$7:M$9)>0,$E21*$F21,0)","v":0},null,{"$f":"IF(SUM(O$7:O$9)>0,$E21*$F21,0)","v":0},null,{"$f":"IF(SUM(Q$7:Q$9)>0,$E21*$F21,0)","v":0},null,{"$f":"IF(SUM(S$7:S$9)>0,$E21*$F21,0)","v":0},null,{"$f":"IF(SUM(U$7:U$9)>0,$E21*$F21,0)","v":2619.33},null,{"$f":"IF(SUM(W$7:W$9)>0,$E21*$F21,0)","v":0},null,{"$f":"IF(SUM(Y$7:Y$9)>0,$E21*$F21,0)","v":0},null,{"$f":"IF(SUM(AA$7:AA$9)>0,$E21*$F21,0)","v":0},null,{"$f":"IF(SUM(AC$7:AC$9)>0,$E21*$F21,0)","v":0},null,{"$f":"IF(SUM(AE$7:AE$9)>0,$E21*$F21,0)","v":0},null,{"$f":"IF(SUM(AG$7:AG$9)>0,$E21*$F21,0)","v":0},null,{"$f":"IF(SUM(AI$7:AI$9)>0,$E21*$F21,0)","v":0},null,{"$f":"IF(SUM(AK$7:AK$9)>0,$E21*$F21,0)","v":0},null,{"$f":"IF(SUM(AM$7:AM$9)>0,$E21*$F21,0)","v":0},null,{"$f":"IF(SUM(AO$7:AO$9)>0,$E21*$F21,0)","v":0},null,{"$f":"IF(SUM(AQ$7:AQ$9)>0,$E21*$F21,0)","v":0},null,0,null,0,null,0,null,0,null,0,null,0,null,0,null,0,null,0,null,0,null,0,null,0,null,0,null,0,null,0,null,0,null,0,null,0,null,0,null,0,null,0,null,0,null,0,null,0,null,0,null,0,null,0,null,0,null,0,null,0,null,0,null,0,null,0,null,0,null,0,null,0,null,0,null,0,null,0,null,0,null,0,null,0]
[]
[null,null,"CATEGORIAS",null,null,"QUANTIDADE"]
[null,null,null,null,null,null,null,null,{"$f":"IF($C24=I$3,1,0)","v":0},null,{"$f":"IF($C24=K$3,1,0)","v":0},null,{"$f":"IF($C24=M$3,1,0)","v":0},null,{"$f":"IF($C24=O$3,1,0)","v":0},null,{"$f":"IF($C24=Q$3,1,0)","v":0},null,{"$f":"IF($C24=S$3,1,0)","v":0},null,{"$f":"IF($C24=U$3,1,0)","v":0},null,{"$f":"IF($C24=W$3,1,0)","v":0},null,{"$f":"IF($C24=Y$3,1,0)","v":0},null,{"$f":"IF($C24=AA$3,1,0)","v":0},null,{"$f":"IF($C24=AC$3,1,0)","v":0},null,{"$f":"IF($C24=AE$3,1,0)","v":0},null,{"$f":"IF($C24=AG$3,1,0)","v":0},null,{"$f":"IF($C24=AI$3,1,0)","v":0},null,{"$f":"IF($C24=AK$3,1,0)","v":0},null,{"$f":"IF($C24=AM$3,1,0)","v":0},null,{"$f":"IF($C24=AO$3,1,0)","v":0},null,{"$f":"IF($C24=AQ$3,1,0)","v":0},null,{"$f":"IF($C24=AS$3,1,0)","v":0}]
[null,null,8,{"$f":"HLOOKUP($C25,'Dados Gerais'!$D$5:$BK$10,6)","v":"TÉCNICO DE MANUTENÇÃO DE INFRAESTRUTURA DE REDE"},null,{"$f":"HLOOKUP($C25,'Dados Gerais'!$D$5:$BK$14,10)","v":8},null,null,{"$f":"IF($C25=I$3,1,0)","v":0},{"$f":"IF($C25=J$3,1,0)","v":0},0,0,0,0,0,0,0,0,0,0,0,0,1,0,0,0,0,0,0,0,{"$f":"IF($C25=AE$3,1,0)","v":0},0,0,0,0,0,0,0,0,0,0,0,0,0,0,0,{"$f":"IF($C25=AU$3,1,0)","v":0},0,{"$f":"IF($C25=AW$3,1,0)","v":0},0,{"$f":"IF($C25=AY$3,1,0)","v":0},0,{"$f":"IF($C25=BA$3,1,0)","v":0},0,{"$f":"IF($C25=BC$3,1,0)","v":0},0,{"$f":"IF($C25=BE$3,1,0)","v":0},0,{"$f":"IF($C25=BG$3,1,0)","v":0},0,{"$f":"IF($C25=BI$3,1,0)","v":0},0,{"$f":"IF($C25=BK$3,1,0)","v":0},0,{"$f":"IF($C25=BM$3,1,0)","v":0},0,{"$f":"IF($C25=BO$3,1,0)","v":0},0,{"$f":"IF($C25=BQ$3,1,0)","v":0},0,{"$f":"IF($C25=BS$3,1,0)","v":0},0,{"$f":"IF($C25=BU$3,1,0)","v":0},0,{"$f":"IF($C25=BW$3,1,0)","v":0},0,{"$f":"IF($C25=BY$3,1,0)","v":0},0,{"$f":"IF($C25=CA$3,1,0)","v":0},0,{"$f":"IF($C25=CC$3,1,0)","v":0},0,{"$f":"IF($C25=CE$3,1,0)","v":0},0,{"$f":"IF($C25=CG$3,1,0)","v":0},0,{"$f":"IF($C25=CI$3,1,0)","v":0},0,{"$f":"IF($C25=CK$3,1,0)","v":0},0,{"$f":"IF($C25=CM$3,1,0)","v":0},0,{"$f":"IF($C25=CO$3,1,0)","v":0},0,{"$f":"IF($C25=CQ$3,1,0)","v":0},0,{"$f":"IF($C25=CS$3,1,0)","v":0},0,{"$f":"IF($C25=CU$3,1,0)","v":0},0,{"$f":"IF($C25=CW$3,1,0)","v":0},0,{"$f":"IF($C25=CY$3,1,0)","v":0},0,{"$f":"IF($C25=DA$3,1,0)","v":0},0,{"$f":"IF($C25=DC$3,1,0)","v":0},0,{"$f":"IF($C25=DE$3,1,0)","v":0},0,{"$f":"IF($C25=DG$3,1,0)","v":0},0,{"$f":"IF($C25=DI$3,1,0)","v":0},0,{"$f":"IF($C25=DK$3,1,0)","v":0},0,{"$f":"IF($C25=DM$3,1,0)","v":0},0,{"$f":"IF($C25=DO$3,1,0)","v":0},0,{"$f":"IF($C25=DQ$3,1,0)","v":0},0,{"$f":"IF($C25=DS$3,1,0)","v":0},0,{"$f":"IF($C25=DU$3,1,0)","v":0},0,{"$f":"IF($C25=DW$3,1,0)","v":0},0]
[null,null,null,null,null,null,null,null,{"$f":"IF($C26=I$3,1,0)","v":0},null,0,null,0,null,0,null,0,null,0,null,0,null,0,null,0,null,0,null,0,null,{"$f":"IF($C26=AE$3,1,0)","v":0},null,0,null,0,null,0,null,0,null,0,null,0,null,0]
[]
[null,null,"ITEM","DESCRIÇÃO","QUANT ANUAL POR POSTO","VALOR"]
[]
[null,null,1,"Luva de malha tricotada em fios de algodão com acabamento em overloque e palmas pigmentadas em PVC. Ref. LEDAN",8,{"$f":"F13","v":4.07},null,null,null,{"$f":"IF(SUM(I$24:I$26)>0,$E30*$F30,0)","v":0},null,{"$f":"IF(SUM(K$24:K$26)>0,$E30*$F30,0)","v":0},null,{"$f":"IF(SUM(M$24:M$26)>0,$E30*$F30,0)","v":0},null,{"$f":"IF(SUM(O$24:O$26)>0,$E30*$F30,0)","v":0},null,{"$f":"IF(SUM(Q$24:Q$26)>0,$E30*$F30,0)","v":0},null,{"$f":"IF(SUM(S$24:S$26)>0,$E30*$F30,0)","v":0},null,{"$f":"IF(SUM(U$24:U$26)>0,$E30*$F30,0)","v":0},null,{"$f":"IF(SUM(W$24:W$26)>0,$E30*$F30,0)","v":32.56},null,{"$f":"IF(SUM(Y$24:Y$26)>0,$E30*$F30,0)","v":0},null,{"$f":"IF(SUM(AA$24:AA$26)>0,$E30*$F30,0)","v":0},null,{"$f":"IF(SUM(AC$24:AC$26)>0,$E30*$F30,0)","v":0},null,{"$f":"IF(SUM(AE$24:AE$26)>0,$E30*$F30,0)","v":0},null,{"$f":"IF(SUM(AG$24:AG$26)>0,$E30*$F30,0)","v":0},null,{"$f":"IF(SUM(AI$24:AI$26)>0,$E30*$F30,0)","v":0},null,{"$f":"IF(SUM(AK$24:AK$26)>0,$E30*$F30,0)","v":0},null,{"$f":"IF(SUM(AM$24:AM$26)>0,$E30*$F30,0)","v":0},null,{"$f":"IF(SUM(AO$24:AO$26)>0,$E30*$F30,0)","v":0},null,{"$f":"IF(SUM(AQ$24:AQ$26)>0,$E30*$F30,0)","v":0},null,{"$f":"IF(SUM(AS$24:AS$26)>0,$E30*$F30,0)","v":0},null,{"$f":"IF(SUM(AU$24:AU$26)>0,$E30*$F30,0)","v":0},null,{"$f":"IF(SUM(AW$24:AW$26)>0,$E30*$F30,0)","v":0},null,{"$f":"IF(SUM(AY$24:AY$26)>0,$E30*$F30,0)","v":0},null,{"$f":"IF(SUM(BA$24:BA$26)>0,$E30*$F30,0)","v":0},null,{"$f":"IF(SUM(BC$24:BC$26)>0,$E30*$F30,0)","v":0},null,{"$f":"IF(SUM(BE$24:BE$26)>0,$E30*$F30,0)","v":0},null,{"$f":"IF(SUM(BG$24:BG$26)>0,$E30*$F30,0)","v":0},null,{"$f":"IF(SUM(BI$24:BI$26)>0,$E30*$F30,0)","v":0},null,{"$f":"IF(SUM(BK$24:BK$26)>0,$E30*$F30,0)","v":0},null,{"$f":"IF(SUM(BM$24:BM$26)>0,$E30*$F30,0)","v":0},null,{"$f":"IF(SUM(BO$24:BO$26)>0,$E30*$F30,0)","v":0},null,{"$f":"IF(SUM(BQ$24:BQ$26)>0,$E30*$F30,0)","v":0},null,{"$f":"IF(SUM(BS$24:BS$26)>0,$E30*$F30,0)","v":0},null,{"$f":"IF(SUM(BU$24:BU$26)>0,$E30*$F30,0)","v":0},null,{"$f":"IF(SUM(BW$24:BW$26)>0,$E30*$F30,0)","v":0},null,{"$f":"IF(SUM(BY$24:BY$26)>0,$E30*$F30,0)","v":0},null,{"$f":"IF(SUM(CA$24:CA$26)>0,$E30*$F30,0)","v":0},null,{"$f":"IF(SUM(CC$24:CC$26)>0,$E30*$F30,0)","v":0},null,{"$f":"IF(SUM(CE$24:CE$26)>0,$E30*$F30,0)","v":0},null,{"$f":"IF(SUM(CG$24:CG$26)>0,$E30*$F30,0)","v":0},null,{"$f":"IF(SUM(CI$24:CI$26)>0,$E30*$F30,0)","v":0},null,{"$f":"IF(SUM(CK$24:CK$26)>0,$E30*$F30,0)","v":0},null,{"$f":"IF(SUM(CM$24:CM$26)>0,$E30*$F30,0)","v":0},null,{"$f":"IF(SUM(CO$24:CO$26)>0,$E30*$F30,0)","v":0},null,{"$f":"IF(SUM(CQ$24:CQ$26)>0,$E30*$F30,0)","v":0},null,{"$f":"IF(SUM(CS$24:CS$26)>0,$E30*$F30,0)","v":0},null,{"$f":"IF(SUM(CU$24:CU$26)>0,$E30*$F30,0)","v":0},null,{"$f":"IF(SUM(CW$24:CW$26)>0,$E30*$F30,0)","v":0},null,{"$f":"IF(SUM(CY$24:CY$26)>0,$E30*$F30,0)","v":0},null,{"$f":"IF(SUM(DA$24:DA$26)>0,$E30*$F30,0)","v":0},null,{"$f":"IF(SUM(DC$24:DC$26)>0,$E30*$F30,0)","v":0},null,{"$f":"IF(SUM(DE$24:DE$26)>0,$E30*$F30,0)","v":0},null,{"$f":"IF(SUM(DG$24:DG$26)>0,$E30*$F30,0)","v":0},null,{"$f":"IF(SUM(DI$24:DI$26)>0,$E30*$F30,0)","v":0},null,{"$f":"IF(SUM(DK$24:DK$26)>0,$E30*$F30,0)","v":0},null,{"$f":"IF(SUM(DM$24:DM$26)>0,$E30*$F30,0)","v":0},null,{"$f":"IF(SUM(DO$24:DO$26)>0,$E30*$F30,0)","v":0},null,{"$f":"IF(SUM(DQ$24:DQ$26)>0,$E30*$F30,0)","v":0},null,{"$f":"IF(SUM(DS$24:DS$26)>0,$E30*$F30,0)","v":0},null,{"$f":"IF(SUM(DU$24:DU$26)>0,$E30*$F30,0)","v":0},null,{"$f":"IF(SUM(DW$24:DW$26)>0,$E30*$F30,0)","v":0}]
[null,null,2,"Luva de segurança confeccionada em vaqueta na palma e face palmar dos dedos, dorso e face dorsal dos dedos em raspa, reforço interno em vaqueta na palma, com cano longo em raspa (20 cm)",8,{"$f":"F14","v":25.98},null,null,null,0,null,0,null,0,null,0,null,0,null,0,null,0,null,207.84,null,0,null,0,null,0,null,0,null,{"$f":"IF(SUM(AG$24:AG$26)>0,$E31*$F31,0)","v":0},null,{"$f":"IF(SUM(AI$24:AI$26)>0,$E31*$F31,0)","v":0},null,{"$f":"IF(SUM(AK$24:AK$26)>0,$E31*$F31,0)","v":0},null,{"$f":"IF(SUM(AM$24:AM$26)>0,$E31*$F31,0)","v":0},null,{"$f":"IF(SUM(AO$24:AO$26)>0,$E31*$F31,0)","v":0},null,{"$f":"IF(SUM(AQ$24:AQ$26)>0,$E31*$F31,0)","v":0},null,{"$f":"IF(SUM(AS$24:AS$26)>0,$E31*$F31,0)","v":0},null,0,null,0,null,0,null,0,null,0,null,0,null,0,null,0,null,0,null,0,null,0,null,0,null,0,null,0,null,0,null,0,null,0,null,0,null,0,null,0,null,0,null,0,null,0,null,0,null,0,null,0,null,0,null,0,null,0,null,0,null,0,null,0,null,0,null,0,null,0,null,0,null,0,null,0,null,0,null,0,null,0]
[null,null,3,"Luvas em poliuretano, cor preta, acabamento liso, com forro em poliamida, sem costura, punho tricotado c/ elástico. Tamanhos P, M e G",16,{"$f":"F15","v":4.71},null,null,null,0,null,0,null,0,null,0,null,0,null,0,null,0,null,75.36,null,0,null,0,null,0,null,0,null,{"$f":"IF(SUM(AG$24:AG$26)>0,$E32*$F32,0)","v":0},null,{"$f":"IF(SUM(AI$24:AI$26)>0,$E32*$F32,0)","v":0},null,{"$f":"IF(SUM(AK$24:AK$26)>0,$E32*$F32,0)","v":0},null,{"$f":"IF(SUM(AM$24:AM$26)>0,$E32*$F32,0)","v":0},null,{"$f":"IF(SUM(AO$24:AO$26)>0,$E32*$F32,0)","v":0},null,{"$f":"IF(SUM(AQ$24:AQ$26)>0,$E32*$F32,0)","v":0},null,{"$f":"IF(SUM(AS$24:AS$26)>0,$E32*$F32,0)","v":0},null,0,null,0,null,0,null,0,null,0,null,0,null,0,null,0,null,0,null,0,null,0,null,0,null,0,null,0,null,0,null,0,null,0,null,0,null,0,null,0,null,0,null,0,null,0,null,0,null,0,null,0,null,0,null,0,null,0,null,0,null,0,null,0,null,0,null,0,null,0,null,0,null,0,null,0,null,0,null,0,null,0]
[null,null,4,"Óculos de segurança constituídos de armação e visor confeccionados em uma única peça de policarbonato INCOLOR, anti-risco, apoio nasal de plástico maleável. Hastes emborrachadas. Ref.: 3M Virtua V4",24,{"$f":"F16","v":31.45},null,null,null,0,null,0,null,0,null,0,null,0,null,0,null,0,null,754.8,null,0,null,0,null,0,null,0,null,{"$f":"IF(SUM(AG$24:AG$26)>0,$E33*$F33,0)","v":0},null,{"$f":"IF(SUM(AI$24:AI$26)>0,$E33*$F33,0)","v":0},null,{"$f":"IF(SUM(AK$24:AK$26)>0,$E33*$F33,0)","v":0},null,{"$f":"IF(SUM(AM$24:AM$26)>0,$E33*$F33,0)","v":0},null,{"$f":"IF(SUM(AO$24:AO$26)>0,$E33*$F33,0)","v":0},null,{"$f":"IF(SUM(AQ$24:AQ$26)>0,$E33*$F33,0)","v":0},null,{"$f":"IF(SUM(AS$24:AS$26)>0,$E33*$F33,0)","v":0},null,0,null,0,null,0,null,0,null,0,null,0,null,0,null,0,null,0,null,0,null,0,null,0,null,0,null,0,null,0,null,0,null,0,null,0,null,0,null,0,null,0,null,0,null,0,null,0,null,0,null,0,null,0,null,0,null,0,null,0,null,0,null,0,null,0,null,0,null,0,null,0,null,0,null,0,null,0,null,0,null,0]
[null,null,5,"Respirador purificador de ar tipo, peça semifacial filtrante para partículas (PFF2), com formato dobrável, solda ultrassônica em todo o seu perímetro. Fita elástica branca fixada nas laterais externas do respirador, perfazendo uma alça na para fixação na parte superior da cabeça e a outra na parte inferior, para fixação na altura da nuca do\nusuário. A parte superior externa da peça possui tira de material metálico moldável, utilizada para ajuste no septo nasal. Na face lateral do respirador existe um dispositivo de material plástico, dotado internamente de uma válvula de exalação. DEVERÁ APRESENTAR O SELO DE APROVAÇÃO DO INMETRO. Ref. 3M\nObs: Enquanto durar a pandemia da Covid 19 as máscaras deverão ser fornecidas sem a válvula de exalação",{"$f":"12*8","v":96},{"$f":"F18","v":3.71},null,null,null,0,null,0,null,0,null,0,null,0,null,0,null,0,null,356.15999999999997,null,0,null,0,null,0,null,0,null,{"$f":"IF(SUM(AG$24:AG$26)>0,$E34*$F34,0)","v":0},null,{"$f":"IF(SUM(AI$24:AI$26)>0,$E34*$F34,0)","v":0},null,{"$f":"IF(SUM(AK$24:AK$26)>0,$E34*$F34,0)","v":0},null,{"$f":"IF(SUM(AM$24:AM$26)>0,$E34*$F34,0)","v":0},null,{"$f":"IF(SUM(AO$24:AO$26)>0,$E34*$F34,0)","v":0},null,{"$f":"IF(SUM(AQ$24:AQ$26)>0,$E34*$F34,0)","v":0},null,{"$f":"IF(SUM(AS$24:AS$26)>0,$E34*$F34,0)","v":0},null,0,null,0,null,0,null,0,null,0,null,0,null,0,null,0,null,0,null,0,null,0,null,0,null,0,null,0,null,0,null,0,null,0,null,0,null,0,null,0,null,0,null,0,null,0,null,0,null,0,null,0,null,0,null,0,null,0,null,0,null,0,null,0,null,0,null,0,null,0,null,0,null,0,null,0,null,0,null,0,null,0]
[null,null,6,"Capacete de segurança em polietileno de alta densidade, na cor CINZA sem aba, suspensão em tecido, com Faixa anti-suor, regulagem de tamanho com ajuste simples, proteção contra choques elétricos, com jugular ajustável.Ref: MSA",8,{"$f":"F19","v":58.91},null,null,null,0,null,0,null,0,null,0,null,0,null,0,null,0,null,471.28,null,0,null,0,null,0,null,0,null,{"$f":"IF(SUM(AG$24:AG$26)>0,$E35*$F35,0)","v":0},null,{"$f":"IF(SUM(AI$24:AI$26)>0,$E35*$F35,0)","v":0},null,{"$f":"IF(SUM(AK$24:AK$26)>0,$E35*$F35,0)","v":0},null,{"$f":"IF(SUM(AM$24:AM$26)>0,$E35*$F35,0)","v":0},null,{"$f":"IF(SUM(AO$24:AO$26)>0,$E35*$F35,0)","v":0},null,{"$f":"IF(SUM(AQ$24:AQ$26)>0,$E35*$F35,0)","v":0},null,{"$f":"IF(SUM(AS$24:AS$26)>0,$E35*$F35,0)","v":0},null,0,null,0,null,0,null,0,null,0,null,0,null,0,null,0,null,0,null,0,null,0,null,0,null,0,null,0,null,0,null,0,null,0,null,0,null,0,null,0,null,0,null,0,null,0,null,0,null,0,null,0,null,0,null,0,null,0,null,0,null,0,null,0,null,0,null,0,null,0,null,0,null,0,null,0,null,0,null,0,null,0]
[null,null,7,"Protetor auricular tipo plug em silicone, lavável com proteção mínima de 15 dB (A) de atenuação pelo método NRRsf. Ref.: 3M",32,{"$f":"F20","v":3.53},null,null,null,0,null,0,null,0,null,0,null,0,null,0,null,0,null,112.96,null,0,null,0,null,0,null,0,null,{"$f":"IF(SUM(AG$24:AG$26)>0,$E36*$F36,0)","v":0},null,{"$f":"IF(SUM(AI$24:AI$26)>0,$E36*$F36,0)","v":0},null,{"$f":"IF(SUM(AK$24:AK$26)>0,$E36*$F36,0)","v":0},null,{"$f":"IF(SUM(AM$24:AM$26)>0,$E36*$F36,0)","v":0},null,{"$f":"IF(SUM(AO$24:AO$26)>0,$E36*$F36,0)","v":0},null,{"$f":"IF(SUM(AQ$24:AQ$26)>0,$E36*$F36,0)","v":0},null,{"$f":"IF(SUM(AS$24:AS$26)>0,$E36*$F36,0)","v":0},null,0,null,0,null,0,null,0,null,0,null,0,null,0,null,0,null,0,null,0,null,0,null,0,null,0,null,0,null,0,null,0,null,0,null,0,null,0,null,0,null,0,null,0,null,0,null,0,null,0,null,0,null,0,null,0,null,0,null,0,null,0,null,0,null,0,null,0,null,0,null,0,null,0,null,0,null,0,null,0,null,0]
[null,null,8,"Botina de segurança, fechamento em elástico, sem componentes metálicos, confeccionada em couro\ncurtido ao cromo, na cor preta, elásticos laterais, BIQUEIRA EM COMPOSITE ou POLIPROPILENO,\nsolado de poliuretano bidensidade injetado diretamente ao cabedal, solado com perfil antiderrapante e sistemas de absorção de impacto. Deverá possuir proteção contra risco de choques elétricos. Com selo conforto. Em conformidade com as Normas de segurança da ABNT NBR ISO 20344 e 20347.",16,{"$f":"F21","v":124.73},null,null,null,0,null,0,null,0,null,0,null,0,null,0,null,0,null,1995.68,null,0,null,0,null,0,null,0,null,{"$f":"IF(SUM(AG$24:AG$26)>0,$E37*$F37,0)","v":0},null,{"$f":"IF(SUM(AI$24:AI$26)>0,$E37*$F37,0)","v":0},null,{"$f":"IF(SUM(AK$24:AK$26)>0,$E37*$F37,0)","v":0},null,{"$f":"IF(SUM(AM$24:AM$26)>0,$E37*$F37,0)","v":0},null,{"$f":"IF(SUM(AO$24:AO$26)>0,$E37*$F37,0)","v":0},null,{"$f":"IF(SUM(AQ$24:AQ$26)>0,$E37*$F37,0)","v":0},null,{"$f":"IF(SUM(AS$24:AS$26)>0,$E37*$F37,0)","v":0},null,0,null,0,null,0,null,0,null,0,null,0,null,0,null,0,null,0,null,0,null,0,null,0,null,0,null,0,null,0,null,0,null,0,null,0,null,0,null,0,null,0,null,0,null,0,null,0,null,0,null,0,null,0,null,0,null,0,null,0,null,0,null,0,null,0,null,0,null,0,null,0,null,0,null,0,null,0,null,0,null,0]
[null,null,null,null,null,null,null,null,{"$f":"SUMPRODUCT(#REF!,#REF!)*(#REF!+#REF!)","v":{"$error":"#REF!"}},"anual",null,"anual",null,"anual",null,"anual",null,"anual",null,"anual",null,"anual",null,"anual",null,"anual",null,"anual",null,"anual",null,"anual",null,"anual",null,"anual",null,"anual",null,"anual",null,"anual",null,"anual",null,"anual",null,"anual",null,"anual",null,"anual",null,"anual",null,"anual",null,"anual",null,"anual",null,"anual",null,"anual",null,"anual",null,"anual",null,"anual",null,"anual",null,"anual",null,"anual",null,"anual",null,"anual",null,"anual",null,"anual",null,"anual",null,"anual",null,"anual",null,"anual",null,"anual",null,"anual",null,"anual",null,"anual",null,"anual",null,"anual",null,"anual",null,"anual",null,"anual",null,"anual",null,"anual",null,"anual",null,"anual",null,"anual",null,"anual",null,"anual",null,"anual",null,"anual"]
[null,null,null,null,null,null,null,null,{"$f":"I38/12","v":{"$error":"#REF!"}},"mensal",null,"mensal",null,"mensal",null,"mensal",null,"mensal",null,"mensal",null,"mensal",null,"mensal",null,"mensal",null,"mensal",null,"mensal",null,"mensal",null,"mensal",null,"mensal",null,"mensal",null,"mensal",null,"mensal",null,"mensal",null,"mensal",null,"mensal",null,"mensal",null,"mensal",null,"mensal",null,"mensal",null,"mensal",null,"mensal",null,"mensal",null,"mensal",null,"mensal",null,"mensal",null,"mensal",null,"mensal",null,"mensal",null,"mensal",null,"mensal",null,"mensal",null,"mensal",null,"mensal",null,"mensal",null,"mensal",null,"mensal",null,"mensal",null,"mensal",null,"mensal",null,"mensal",null,"mensal",null,"mensal",null,"mensal",null,"mensal",null,"mensal",null,"mensal",null,"mensal",null,"mensal",null,"mensal",null,"mensal",null,"mensal",null,"mensal",null,"mensal",null,"mensal",null,"mensal"]
[null,null,null,null,null,null,null,null,{"$f":"I39/11","v":{"$error":"#REF!"}},"por posto",null,"por posto",null,"por posto",null,"por posto",null,"por posto",null,"por posto",null,"por posto",null,"por posto",null,"por posto",null,"por posto",null,"por posto",null,"por posto",null,"por posto",null,"por posto",null,"por posto",null,"por posto",null,"por posto",null,"por posto",null,"por posto",null,"por posto",null,"por posto",null,"por posto",null,"por posto",null,"por posto",null,"por posto",null,"por posto",null,"por posto",null,"por posto",null,"por posto",null,"por posto",null,"por posto",null,"por posto",null,"por posto",null,"por posto",null,"por posto",null,"por posto",null,"por posto",null,"por posto",null,"por posto",null,"por posto",null,"por posto",null,"por posto",null,"por posto",null,"por posto",null,"por posto",null,"por posto",null,"por posto",null,"por posto",null,"por posto",null,"por posto",null,"por posto",null,"por posto",null,"por posto",null,"por posto",null,"por posto",null,"por posto",null,"por posto",null,"por posto",null,"por posto",null,"por posto"]

{"sheet":"Equip Rel","index":21,"n_rows":80,"n_cols":136,"rows_kept":80,"cut":false,"hidden":true,"merged":[[9,1,9,3],[10,1,10,14]]}
[null,null,"CÂMARA DOS DEPUTADOS"]
[null,null,"DEPARTAMENTO TÉCNICO"]
[null,null,"Coordenação de Planejamento e Gestão"]
[]
[null,null,"Data:",{"$f":"'Dados Gerais'!#REF!","v":{"$error":"#REF!"}}]
[null,null,"Processo:",{"$f":"'Dados Gerais'!#REF!","v":{"$error":"#REF!"}}]
[null,null,"Objeto:",{"$f":"'Dados Gerais'!#REF!","v":{"$error":"#REF!"}}]
[]
[]
[]
[null,"EQUIPAMENTOS RELACIONADOS AO POSTO - PAGAMENTO DA DEPRECIAÇÃO / MANUTENÇÃO",null,null,null,null,null,null,null,null,null,null,null,null,null,null,1,null,{"$f":"Q11+1","v":2},null,{"$f":"S11+1","v":3},null,{"$f":"U11+1","v":4},null,{"$f":"W11+1","v":5},null,{"$f":"Y11+1","v":6},null,{"$f":"AA11+1","v":7},null,{"$f":"AC11+1","v":8},null,{"$f":"AE11+1","v":9},null,{"$f":"AG11+1","v":10},null,{"$f":"AI11+1","v":11},null,{"$f":"AK11+1","v":12},null,{"$f":"AM11+1","v":13},null,{"$f":"AO11+1","v":14},null,{"$f":"AQ11+1","v":15},null,{"$f":"AS11+1","v":16},null,{"$f":"AU11+1","v":17},null,{"$f":"AW11+1","v":18},null,{"$f":"AY11+1","v":19},null,{"$f":"BA11+1","v":20},null,{"$f":"BC11+1","v":21},null,{"$f":"BE11+1","v":22},null,{"$f":"BG11+1","v":23},null,{"$f":"BI11+1","v":24},null,{"$f":"BK11+1","v":25},null,{"$f":"BM11+1","v":26},null,{"$f":"BO11+1","v":27},null,{"$f":"BQ11+1","v":28},null,{"$f":"BS11+1","v":29},null,{"$f":"BU11+1","v":30},null,{"$f":"BW11+1","v":31},null,{"$f":"BY11+1","v":32},null,{"$f":"CA11+1","v":33},null,{"$f":"CC11+1","v":34},null,{"$f":"CE11+1","v":35},null,{"$f":"CG11+1","v":36},null,{"$f":"CI11+1","v":37},null,{"$f":"CK11+1","v":38},null,{"$f":"CM11+1","v":39},null,{"$f":"CO11+1","v":40},null,{"$f":"CQ11+1","v":41},null,{"$f":"CS11+1","v":42},null,{"$f":"CU11+1","v":43},null,{"$f":"CW11+1","v":44},null,{"$f":"CY11+1","v":45},null,{"$f":"DA11+1","v":46},null,{"$f":"DC11+1","v":47},null,{"$f":"DE11+1","v":48},null,{"$f":"DG11+1","v":49},null,{"$f":"DI11+1","v":50},null,{"$f":"DK11+1","v":51},null,{"$f":"DM11+1","v":52},null,{"$f":"DO11+1","v":53},null,{"$f":"DQ11+1","v":54},null,{"$f":"DS11+1","v":55},null,{"$f":"DU11+1","v":56},null,{"$f":"DW11+1","v":57},null,{"$f":"DY11+1","v":58},null,{"$f":"EA11+1","v":59},null,{"$f":"EC11+1","v":60}]
[]
[null,null,null,null,null,null,null,null,null,null,null,null,null,null,null,null,{"$f":"SUM(R12:R61)","v":0},null,{"$f":"SUM(T12:T61)","v":0},null,{"$f":"SUM(V12:V61)","v":0},null,{"$f":"SUM(X12:X61)","v":0},null,{"$f":"SUM(Z12:Z61)","v":0},null,{"$f":"SUM(AB12:AB61)","v":0},null,{"$f":"SUM(AD12:AD61)","v":0},null,{"$f":"SUM(AF12:AF61)","v":0},null,{"$f":"SUM(AH12:AH61)","v":0},null,{"$f":"SUM(AJ12:AJ61)","v":0},null,{"$f":"SUM(AL12:AL61)","v":0},null,{"$f":"SUM(AN12:AN61)","v":0},null,{"$f":"SUM(AP12:AP61)","v":0},null,{"$f":"SUM(AR12:AR61)","v":0},null,{"$f":"SUM(AT12:AT61)","v":0},null,{"$f":"SUM(AV12:AV61)","v":0},null,{"$f":"SUM(AX12:AX61)","v":0},null,{"$f":"SUM(AZ12:AZ61)","v":0},null,{"$f":"SUM(BB12:BB61)","v":0},null,{"$f":"SUM(BD12:BD61)","v":0},null,{"$f":"SUM(BF12:BF61)","v":0},null,{"$f":"SUM(BH12:BH61)","v":0},null,{"$f":"SUM(BJ12:BJ61)","v":0},null,{"$f":"SUM(BL12:BL61)","v":0},null,{"$f":"SUM(BN12:BN61)","v":0},null,{"$f":"SUM(BP12:BP61)","v":0},null,{"$f":"SUM(BR12:BR61)","v":0},null,{"$f":"SUM(BT12:BT61)","v":0},null,{"$f":"SUM(BV12:BV61)","v":0},null,{"$f":"SUM(BX12:BX61)","v":0},null,{"$f":"SUM(BZ12:BZ61)","v":0},null,{"$f":"SUM(CB12:CB61)","v":0},null,{"$f":"SUM(CD12:CD61)","v":0},null,{"$f":"SUM(CF12:CF61)","v":0},null,{"$f":"SUM(CH12:CH61)","v":0},null,{"$f":"SUM(CJ12:CJ61)","v":0},null,{"$f":"SUM(CL12:CL61)","v":0},null,{"$f":"SUM(CN12:CN61)","v":0},null,{"$f":"SUM(CP12:CP61)","v":0},null,{"$f":"SUM(CR12:CR61)","v":0},null,{"$f":"SUM(CT12:CT61)","v":0},null,{"$f":"SUM(CV12:CV61)","v":0},null,{"$f":"SUM(CX12:CX61)","v":0},null,{"$f":"SUM(CZ12:CZ61)","v":0},null,{"$f":"SUM(DB12:DB61)","v":0},null,{"$f":"SUM(DD12:DD61)","v":0},null,{"$f":"SUM(DF12:DF61)","v":0},null,{"$f":"SUM(DH12:DH61)","v":0},null,{"$f":"SUM(DJ12:DJ61)","v":0},null,{"$f":"SUM(DL12:DL61)","v":0},null,{"$f":"SUM(DN12:DN61)","v":0},null,{"$f":"SUM(DP12:DP61)","v":0},null,{"$f":"SUM(DR12:DR61)","v":0},null,{"$f":"SUM(DT12:DT61)","v":0},null,{"$f":"SUM(DV12:DV61)","v":0},null,{"$f":"SUM(DX12:DX61)","v":0},null,{"$f":"SUM(DZ12:DZ61)","v":0},null,{"$f":"SUM(EB12:EB61)","v":0},null,{"$f":"SUM(ED12:ED61)","v":0},null,{"$f":"SUM(EF12:EF61)","v":0}]
[null,null,"CATEGORIAS",null,"QUANTIDADE"]
[null,null,null,null,null,null,null,null,null,null,null,null,null,null,null,null,{"$f":"IF($C15=Q$11,1,0)","v":0},null,{"$f":"IF($C15=S$11,1,0)","v":0},null,{"$f":"IF($C15=U$11,1,0)","v":0},null,{"$f":"IF($C15=W$11,1,0)","v":0},null,{"$f":"IF($C15=Y$11,1,0)","v":0},null,{"$f":"IF($C15=AA$11,1,0)","v":0},null,{"$f":"IF($C15=AC$11,1,0)","v":0},null,{"$f":"IF($C15=AE$11,1,0)","v":0},null,{"$f":"IF($C15=AG$11,1,0)","v":0},null,{"$f":"IF($C15=AI$11,1,0)","v":0},null,{"$f":"IF($C15=AK$11,1,0)","v":0},null,{"$f":"IF($C15=AM$11,1,0)","v":0},null,{"$f":"IF($C15=AO$11,1,0)","v":0},null,{"$f":"IF($C15=AQ$11,1,0)","v":0},null,{"$f":"IF($C15=AS$11,1,0)","v":0},null,{"$f":"IF($C15=AU$11,1,0)","v":0},null,{"$f":"IF($C15=AW$11,1,0)","v":0},null,{"$f":"IF($C15=AY$11,1,0)","v":0},null,{"$f":"IF($C15=BA$11,1,0)","v":0},null,{"$f":"IF($C15=BC$11,1,0)","v":0},null,{"$f":"IF($C15=BE$11,1,0)","v":0},null,{"$f":"IF($C15=BG$11,1,0)","v":0},null,{"$f":"IF($C15=BI$11,1,0)","v":0},null,{"$f":"IF($C15=BK$11,1,0)","v":0},null,{"$f":"IF($C15=BM$11,1,0)","v":0},null,{"$f":"IF($C15=BO$11,1,0)","v":0},null,{"$f":"IF($C15=BQ$11,1,0)","v":0},null,{"$f":"IF($C15=BS$11,1,0)","v":0},null,{"$f":"IF($C15=BU$11,1,0)","v":0},null,{"$f":"IF($C15=BW$11,1,0)","v":0},null,{"$f":"IF($C15=BY$11,1,0)","v":0},null,{"$f":"IF($C15=CA$11,1,0)","v":0},null,{"$f":"IF($C15=CC$11,1,0)","v":0},null,{"$f":"IF($C15=CE$11,1,0)","v":0},null,{"$f":"IF($C15=CG$11,1,0)","v":0},null,{"$f":"IF($C15=CI$11,1,0)","v":0},null,{"$f":"IF($C15=CK$11,1,0)","v":0},null,{"$f":"IF($C15=CM$11,1,0)","v":0},null,{"$f":"IF($C15=CO$11,1,0)","v":0},null,{"$f":"IF($C15=CQ$11,1,0)","v":0},null,{"$f":"IF($C15=CS$11,1,0)","v":0},null,{"$f":"IF($C15=CU$11,1,0)","v":0},null,{"$f":"IF($C15=CW$11,1,0)","v":0},null,{"$f":"IF($C15=CY$11,1,0)","v":0},null,{"$f":"IF($C15=DA$11,1,0)","v":0},null,{"$f":"IF($C15=DC$11,1,0)","v":0},null,{"$f":"IF($C15=DE$11,1,0)","v":0},null,{"$f":"IF($C15=DG$11,1,0)","v":0},null,{"$f":"IF($C15=DI$11,1,0)","v":0},null,{"$f":"IF($C15=DK$11,1,0)","v":0},null,{"$f":"IF($C15=DM$11,1,0)","v":0},null,{"$f":"IF($C15=DO$11,1,0)","v":0},null,{"$f":"IF($C15=DQ$11,1,0)","v":0},null,{"$f":"IF($C15=DS$11,1,0)","v":0},null,{"$f":"IF($C15=DU$11,1,0)","v":0},null,{"$f":"IF($C15=DW$11,1,0)","v":0},null,{"$f":"IF($C15=DY$11,1,0)","v":0},null,{"$f":"IF($C15=EA$11,1,0)","v":0},null,{"$f":"IF($C15=EC$11,1,0)","v":0},null,{"$f":"IF($C15=EE$11,1,0)","v":0}]
[null,null,null,{"$f":"HLOOKUP($C16,'Dados Gerais'!$D$5:$BK$10,6)","v":{"$error":"#N/A"}},{"$f":"HLOOKUP($C16,'Dados Gerais'!$D$5:$BK$14,10)","v":{"$error":"#N/A"}},null,null,null,null,null,null,null,null,null,null,null,{"$f":"IF($C16=Q$11,1,0)","v":0},null,{"$f":"IF($C16=S$11,1,0)","v":0},null,{"$f":"IF($C16=U$11,1,0)","v":0},null,{"$f":"IF($C16=W$11,1,0)","v":0},null,{"$f":"IF($C16=Y$11,1,0)","v":0},null,{"$f":"IF($C16=AA$11,1,0)","v":0},null,{"$f":"IF($C16=AC$11,1,0)","v":0},null,{"$f":"IF($C16=AE$11,1,0)","v":0},null,{"$f":"IF($C16=AG$11,1,0)","v":0},null,{"$f":"IF($C16=AI$11,1,0)","v":0},null,{"$f":"IF($C16=AK$11,1,0)","v":0},null,{"$f":"IF($C16=AM$11,1,0)","v":0},null,{"$f":"IF($C16=AO$11,1,0)","v":0},null,{"$f":"IF($C16=AQ$11,1,0)","v":0},null,{"$f":"IF($C16=AS$11,1,0)","v":0},null,{"$f":"IF($C16=AU$11,1,0)","v":0},null,{"$f":"IF($C16=AW$11,1,0)","v":0},null,{"$f":"IF($C16=AY$11,1,0)","v":0},null,{"$f":"IF($C16=BA$11,1,0)","v":0},null,{"$f":"IF($C16=BC$11,1,0)","v":0},null,{"$f":"IF($C16=BE$11,1,0)","v":0},null,{"$f":"IF($C16=BG$11,1,0)","v":0},null,{"$f":"IF($C16=BI$11,1,0)","v":0},null,{"$f":"IF($C16=BK$11,1,0)","v":0},null,{"$f":"IF($C16=BM$11,1,0)","v":0},null,{"$f":"IF($C16=BO$11,1,0)","v":0},null,{"$f":"IF($C16=BQ$11,1,0)","v":0},null,{"$f":"IF($C16=BS$11,1,0)","v":0},null,{"$f":"IF($C16=BU$11,1,0)","v":0},null,{"$f":"IF($C16=BW$11,1,0)","v":0},null,{"$f":"IF($C16=BY$11,1,0)","v":0},null,{"$f":"IF($C16=CA$11,1,0)","v":0},null,{"$f":"IF($C16=CC$11,1,0)","v":0},null,{"$f":"IF($C16=CE$11,1,0)","v":0},null,{"$f":"IF($C16=CG$11,1,0)","v":0},null,{"$f":"IF($C16=CI$11,1,0)","v":0},null,{"$f":"IF($C16=CK$11,1,0)","v":0},null,{"$f":"IF($C16=CM$11,1,0)","v":0},null,{"$f":"IF($C16=CO$11,1,0)","v":0},null,{"$f":"IF($C16=CQ$11,1,0)","v":0},null,{"$f":"IF($C16=CS$11,1,0)","v":0},null,{"$f":"IF($C16=CU$11,1,0)","v":0},null,{"$f":"IF($C16=CW$11,1,0)","v":0},null,{"$f":"IF($C16=CY$11,1,0)","v":0},null,{"$f":"IF($C16=DA$11,1,0)","v":0},null,{"$f":"IF($C16=DC$11,1,0)","v":0},null,{"$f":"IF($C16=DE$11,1,0)","v":0},null,{"$f":"IF($C16=DG$11,1,0)","v":0},null,{"$f":"IF($C16=DI$11,1,0)","v":0},null,{"$f":"IF($C16=DK$11,1,0)","v":0},null,{"$f":"IF($C16=DM$11,1,0)","v":0},null,{"$f":"IF($C16=DO$11,1,0)","v":0},null,{"$f":"IF($C16=DQ$11,1,0)","v":0},null,{"$f":"IF($C16=DS$11,1,0)","v":0},null,{"$f":"IF($C16=DU$11,1,0)","v":0},null,{"$f":"IF($C16=DW$11,1,0)","v":0},null,{"$f":"IF($C16=DY$11,1,0)","v":0},null,{"$f":"IF($C16=EA$11,1,0)","v":0},null,{"$f":"IF($C16=EC$11,1,0)","v":0},null,{"$f":"IF($C16=EE$11,1,0)","v":0}]
[null,null,null,null,null,null,null,null,null,null,null,null,null,null,null,null,{"$f":"IF($C17=Q$11,1,0)","v":0},null,{"$f":"IF($C17=S$11,1,0)","v":0},null,{"$f":"IF($C17=U$11,1,0)","v":0},null,{"$f":"IF($C17=W$11,1,0)","v":0},null,{"$f":"IF($C17=Y$11,1,0)","v":0},null,{"$f":"IF($C17=AA$11,1,0)","v":0},null,{"$f":"IF($C17=AC$11,1,0)","v":0},null,{"$f":"IF($C17=AE$11,1,0)","v":0},null,{"$f":"IF($C17=AG$11,1,0)","v":0},null,{"$f":"IF($C17=AI$11,1,0)","v":0},null,{"$f":"IF($C17=AK$11,1,0)","v":0},null,{"$f":"IF($C17=AM$11,1,0)","v":0},null,{"$f":"IF($C17=AO$11,1,0)","v":0},null,{"$f":"IF($C17=AQ$11,1,0)","v":0},null,{"$f":"IF($C17=AS$11,1,0)","v":0},null,{"$f":"IF($C17=AU$11,1,0)","v":0},null,{"$f":"IF($C17=AW$11,1,0)","v":0},null,{"$f":"IF($C17=AY$11,1,0)","v":0},null,{"$f":"IF($C17=BA$11,1,0)","v":0},null,{"$f":"IF($C17=BC$11,1,0)","v":0},null,{"$f":"IF($C17=BE$11,1,0)","v":0},null,{"$f":"IF($C17=BG$11,1,0)","v":0},null,{"$f":"IF($C17=BI$11,1,0)","v":0},null,{"$f":"IF($C17=BK$11,1,0)","v":0},null,{"$f":"IF($C17=BM$11,1,0)","v":0},null,{"$f":"IF($C17=BO$11,1,0)","v":0},null,{"$f":"IF($C17=BQ$11,1,0)","v":0},null,{"$f":"IF($C17=BS$11,1,0)","v":0},null,{"$f":"IF($C17=BU$11,1,0)","v":0},null,{"$f":"IF($C17=BW$11,1,0)","v":0},null,{"$f":"IF($C17=BY$11,1,0)","v":0},null,{"$f":"IF($C17=CA$11,1,0)","v":0},null,{"$f":"IF($C17=CC$11,1,0)","v":0},null,{"$f":"IF($C17=CE$11,1,0)","v":0},null,{"$f":"IF($C17=CG$11,1,0)","v":0},null,{"$f":"IF($C17=CI$11,1,0)","v":0},null,{"$f":"IF($C17=CK$11,1,0)","v":0},null,{"$f":"IF($C17=CM$11,1,0)","v":0},null,{"$f":"IF($C17=CO$11,1,0)","v":0},null,{"$f":"IF($C17=CQ$11,1,0)","v":0},null,{"$f":"IF($C17=CS$11,1,0)","v":0},null,{"$f":"IF($C17=CU$11,1,0)","v":0},null,{"$f":"IF($C17=CW$11,1,0)","v":0},null,{"$f":"IF($C17=CY$11,1,0)","v":0},null,{"$f":"IF($C17=DA$11,1,0)","v":0},null,{"$f":"IF($C17=DC$11,1,0)","v":0},null,{"$f":"IF($C17=DE$11,1,0)","v":0},null,{"$f":"IF($C17=DG$11,1,0)","v":0},null,{"$f":"IF($C17=DI$11,1,0)","v":0},null,{"$f":"IF($C17=DK$11,1,0)","v":0},null,{"$f":"IF($C17=DM$11,1,0)","v":0},null,{"$f":"IF($C17=DO$11,1,0)","v":0},null,{"$f":"IF($C17=DQ$11,1,0)","v":0},null,{"$f":"IF($C17=DS$11,1,0)","v":0},null,{"$f":"IF($C17=DU$11,1,0)","v":0},null,{"$f":"IF($C17=DW$11,1,0)","v":0},null,{"$f":"IF($C17=DY$11,1,0)","v":0},null,{"$f":"IF($C17=EA$11,1,0)","v":0},null,{"$f":"IF($C17=EC$11,1,0)","v":0},null,{"$f":"IF($C17=EE$11,1,0)","v":0}]
[]
[null,null,"PAGAMENTO DA DEPRECIAÇÃO"]
[null,null,"ITEM","DESCRIÇÃO","QUANT ANUAL","CONTA SIAFI","VALOR DE AQ.","% RESIDUAL","VIDA ÚTIL","DEP. MENSAL","CUSTO TOTAL","BDI (%)","PREÇO TOTAL","FONTE","REFERÊNCIA"]
[]
[null,null,null,null,null,null,null,null,null,{"$f":"G22*(1-H22)/(I22*12)","v":{"$error":"#DIV/0!"}},{"$f":"J22*E22","v":{"$error":"#DIV/0!"}},{"$f":"BDI!E26","v":0.25509999999999999},{"$f":"ROUND(K22*(1+L22),2)","v":{"$error":"#DIV/0!"}},"COTAÇÃO"]
[]
[]
[null,null,"PAGAMENTO DA MANUTENÇÃO"]
[null,null,"ITEM","DESCRIÇÃO",null,null,null,"K (calculado)","MENSAL DEPR.","% MAN X DEP","MENSAL MAN.","BDI (%)","PREÇO TOTAL"]
[]
[null,null,null,null,null,null,null,{"$f":"H35","v":0.23950080000000007},{"$f":"M22","v":{"$error":"#DIV/0!"}},{"$f":"H28","v":0.23950080000000007},{"$f":"I28*H28","v":{"$error":"#DIV/0!"}},{"$f":"L22","v":0.25509999999999999},{"$f":"ROUND(K28*(1+L28),2)","v":{"$error":"#DIV/0!"}}]
[]
[null,null,null,null,"K1","K2","K3","K4"]
[null,null,null,null,1,1,0.8,0.8]
[null,null,null,null,"K5","K6","K7","K8"]
[null,null,null,null,1,0.6,0.5,1.1000000000000001]
[null,null,null,null,"K9","K10","K11","RESULTADO"]
[null,null,null,"* a descrição de cada coeficiente segue abaixo",0.9,0.9,1.4,{"$f":"E31*F31*G31*H31*E33*F33*G33*H33*E35*F35*G35","v":0.23950080000000007}]
[]
[]
[null,null,"MATERIAL DE CONSUMO ASSOCIADO"]
[null,null,"ITEM","DESCRIÇÃO",null,null,null,"QUANTID/ANO","UNIDADE","VALOR DE AQ.","MENSAL MAT","BDI (%)","PREÇO TOTAL"]
[]
[null,null,null,null,null,null,null,null,null,null,{"$f":"J41*H41/12","v":0},{"$f":"L28","v":0.25509999999999999},{"$f":"ROUND(K41*(1+L41),2)","v":0}]
[]
[]
[null,null,"MATERIAL DE CONSUMO ASSOCIADO"]
[null,null,"ITEM","DESCRIÇÃO",null,null,null,null,null,null,null,null,"PREÇO TOTAL"]
[]
[null,null,1,"Componente DEPRECIAÇÃO - POR POSTO",null,null,null,null,null,null,null,null,{"$f":"M22","v":{"$error":"#DIV/0!"}}]
[null,null,2,"Componente MANUTENÇÃO - POR POSTO",null,null,null,null,null,null,null,null,{"$f":"M28","v":{"$error":"#DIV/0!"}}]
[null,null,3,"Componente MATERIAL DE CONSUMO ASSOCIADO - POR POSTO",null,null,null,null,null,null,null,null,{"$f":"M41","v":0}]
[]
[null,null,null,null,null,null,null,null,null,null,null,"SOMATÓRIO TOTAL MENSAL - POR POSTO",{"$f":"SUM(M46:M50)","v":{"$error":"#DIV/0!"}},null,null,null,null,{"$f":"IF(SUM(Q$15:Q$17)>0,$M51,0)","v":0},null,{"$f":"IF(SUM(S$15:S$17)>0,$M51,0)","v":0},null,{"$f":"IF(SUM(U$15:U$17)>0,$M51,0)","v":0},null,{"$f":"IF(SUM(W$15:W$17)>0,$M51,0)","v":0},null,{"$f":"IF(SUM(Y$15:Y$17)>0,$M51,0)","v":0},null,{"$f":"IF(SUM(AA$15:AA$17)>0,$M51,0)","v":0},null,{"$f":"IF(SUM(AC$15:AC$17)>0,$M51,0)","v":0},null,{"$f":"IF(SUM(AE$15:AE$17)>0,$M51,0)","v":0},null,{"$f":"IF(SUM(AG$15:AG$17)>0,$M51,0)","v":0},null,{"$f":"IF(SUM(AI$15:AI$17)>0,$M51,0)","v":0},null,{"$f":"IF(SUM(AK$15:AK$17)>0,$M51,0)","v":0},null,{"$f":"IF(SUM(AM$15:AM$17)>0,$M51,0)","v":0},null,{"$f":"IF(SUM(AO$15:AO$17)>0,$M51,0)","v":0},null,{"$f":"IF(SUM(AQ$15:AQ$17)>0,$M51,0)","v":0},null,{"$f":"IF(SUM(AS$15:AS$17)>0,$M51,0)","v":0},null,{"$f":"IF(SUM(AU$15:AU$17)>0,$M51,0)","v":0},null,{"$f":"IF(SUM(AW$15:AW$17)>0,$M51,0)","v":0},null,{"$f":"IF(SUM(AY$15:AY$17)>0,$M51,0)","v":0},null,{"$f":"IF(SUM(BA$15:BA$17)>0,$M51,0)","v":0},null,{"$f":"IF(SUM(BC$15:BC$17)>0,$M51,0)","v":0},null,{"$f":"IF(SUM(BE$15:BE$17)>0,$M51,0)","v":0},null,{"$f":"IF(SUM(BG$15:BG$17)>0,$M51,0)","v":0},null,{"$f":"IF(SUM(BI$15:BI$17)>0,$M51,0)","v":0},null,{"$f":"IF(SUM(BK$15:BK$17)>0,$M51,0)","v":0},null,{"$f":"IF(SUM(BM$15:BM$17)>0,$M51,0)","v":0},null,{"$f":"IF(SUM(BO$15:BO$17)>0,$M51,0)","v":0},null,{"$f":"IF(SUM(BQ$15:BQ$17)>0,$M51,0)","v":0},null,{"$f":"IF(SUM(BS$15:BS$17)>0,$M51,0)","v":0},null,{"$f":"IF(SUM(BU$15:BU$17)>0,$M51,0)","v":0},null,{"$f":"IF(SUM(BW$15:BW$17)>0,$M51,0)","v":0},null,{"$f":"IF(SUM(BY$15:BY$17)>0,$M51,0)","v":0},null,{"$f":"IF(SUM(CA$15:CA$17)>0,$M51,0)","v":0},null,{"$f":"IF(SUM(CC$15:CC$17)>0,$M51,0)","v":0},null,{"$f":"IF(SUM(CE$15:CE$17)>0,$M51,0)","v":0},null,{"$f":"IF(SUM(CG$15:CG$17)>0,$M51,0)","v":0},null,{"$f":"IF(SUM(CI$15:CI$17)>0,$M51,0)","v":0},null,{"$f":"IF(SUM(CK$15:CK$17)>0,$M51,0)","v":0},null,{"$f":"IF(SUM(CM$15:CM$17)>0,$M51,0)","v":0},null,{"$f":"IF(SUM(CO$15:CO$17)>0,$M51,0)","v":0},null,{"$f":"IF(SUM(CQ$15:CQ$17)>0,$M51,0)","v":0},null,{"$f":"IF(SUM(CS$15:CS$17)>0,$M51,0)","v":0},null,{"$f":"IF(SUM(CU$15:CU$17)>0,$M51,0)","v":0},null,{"$f":"IF(SUM(CW$15:CW$17)>0,$M51,0)","v":0},null,{"$f":"IF(SUM(CY$15:CY$17)>0,$M51,0)","v":0},null,{"$f":"IF(SUM(DA$15:DA$17)>0,$M51,0)","v":0},null,{"$f":"IF(SUM(DC$15:DC$17)>0,$M51,0)","v":0},null,{"$f":"IF(SUM(DE$15:DE$17)>0,$M51,0)","v":0},null,{"$f":"IF(SUM(DG$15:DG$17)>0,$M51,0)","v":0},null,{"$f":"IF(SUM(DI$15:DI$17)>0,$M51,0)","v":0},null,{"$f":"IF(SUM(DK$15:DK$17)>0,$M51,0)","v":0},null,{"$f":"IF(SUM(DM$15:DM$17)>0,$M51,0)","v":0},null,{"$f":"IF(SUM(DO$15:DO$17)>0,$M51,0)","v":0},null,{"$f":"IF(SUM(DQ$15:DQ$17)>0,$M51,0)","v":0},null,{"$f":"IF(SUM(DS$15:DS$17)>0,$M51,0)","v":0},null,{"$f":"IF(SUM(DU$15:DU$17)>0,$M51,0)","v":0},null,{"$f":"IF(SUM(DW$15:DW$17)>0,$M51,0)","v":0},null,{"$f":"IF(SUM(DY$15:DY$17)>0,$M51,0)","v":0},null,{"$f":"IF(SUM(EA$15:EA$17)>0,$M51,0)","v":0},null,{"$f":"IF(SUM(EC$15:EC$17)>0,$M51,0)","v":0},null,{"$f":"IF(SUM(EE$15:EE$17)>0,$M51,0)","v":0}]
[null,null,null,null,null,null,null,null,null,null,null,"SOMATÓRIO TOTAL ANUAL - POR POSTO",{"$f":"M51*12","v":{"$error":"#DIV/0!"}}]
[]
[]
[null,null,"MATERIAL DE CONSUMO ASSOCIADO"]
[null,null,"MEMÓRIA DE CÁLCULO DO COEFICIENTE DE CORRELAÇÃO MANUTENÇÃO X DEPRECIAÇÃO (K)"]
[]
[null,null,"JUSTIFICATIVAS",null,"TIPO","K1",null,"Condições de Trab","K4",null,"Tempo Vida (anos)","K6",null,"Temperatura","K8"]
[null,null,null,null,"Guindaste",0.5,null,"Em espera",0.4,null,1,0.6,null,"Muito quente (> 40º C)",1.3]
[null,null,"K1","Arbitrado 1","Caminhão-comum",0.8,null,"Leves",0.8,null,2,0.7,null,"Quente (30º a 40º C)",1.1000000000000001]
[null,null,"K2","Considerado o operador médio","Fora-de-estrada",1,null,"Médias",1,null,3,0.8,null,"Médio (10º a 30º C)",1]
[null,null,"K3","Consideradas ferramentas de primeira qualidade","Carregadeira",1,null,"Pesadas",1.4,null,4,0.9,null,"Frio (< 10º C)",1.2]
[null,null,"K4","Consições leves","Escavadeira",1.4,null,"Severas",2,null,5,1]
[null,null,"K5","Considerando manutenção normal","Motoescrêiper",1.1000000000000001,null,null,null,null,6,1,null,"Ritmo de Trabalho","K9"]
[null,null,"K6","Equipamentos novos","Trator de esteira",1.2,null,"Manutenção","K5",null,7,1,null,"Folgado",0.9]
[null,null,"K7","220h por mês, 252 dias por ano",null,null,null,"Excelente",0.6,null,8,1.2,null,"Médio ",1]
[null,null,"K8","Clima quente, acima de 30º C","Qualid do Operador","K2",null,"Boa",0.8,null,9,1.3,null,"Com pressa",1.5]
[null,null,"K9","Ritmo de trabalho usualmente folgado","Excelente",0.8,null,"Média",1,null,10,1.4]
[null,null,"K10","Considerado o operador médio","Boa",0.9,null,"Ruim ",1.5,null,11,2,null,"Conh do Serviço","K10"]
[null,null,"K11","Foi considerada a opção de aluguel a terceiros, ainda que a simulação seja dos custos do contratado, contudo a execução dos serviços é em local de terceiros","Média",1,null,"Inexistente",3,null,15,2,null,"Grande ",0.8]
[null,null,null,null,"Ruim",1.2,null,null,null,null,null,null,null,"Médio     ",0.9]
[null,null,null,null,"Péssima",2,null,"Horas de Uso ","K7",6000,1,null,null,"Pouco ",1]
[null,null,null,null,null,null,null,1000,0.5,8000,1.3]
[null,null,null,null,"Qualidade do Equip","K3",null,2000,0.5,10000,1.6,null,null,"Tipo do Serviço","K11"]
[null,null,null,null,"De primeira",0.8,null,3000,0.6,12000,1.9,null,null,"Mina ou Pedreira",0.8]
[null,null,null,null,"Média",1,null,4000,0.7,15000,2.2999999999999998,null,null,"Construção Geral",1]
[null,null,null,null,"Ruim",1.5,null,5000,0.9,20000,3,null,null,"Aluguel a Terceiros",1.4]
[]
[null,null,null,null,"Fonte: "]
[null,null,null,null,"MATTOS, Aldo Dórea. Como preparar orçamentos de obras. São Paulo: Pini, 2006. 281 p., il"]

{"sheet":"Mat Cons","index":22,"n_rows":28,"n_cols":128,"rows_kept":28,"cut":false,"hidden":true,"merged":[[9,1,9,3],[10,1,10,5]]}
[null,null,"CÂMARA DOS DEPUTADOS"]
[null,null,"DEPARTAMENTO TÉCNICO"]
[null,null,"Coordenação de Planejamento e Gestão"]
[]
[null,null,"Data:",{"$f":"'Dados Gerais'!#REF!","v":{"$error":"#REF!"}}]
[null,null,"Processo:",{"$f":"'Dados Gerais'!#REF!","v":{"$error":"#REF!"}}]
[null,null,"Objeto:",{"$f":"'Dados Gerais'!#REF!","v":{"$error":"#REF!"}}]
[]
[]
[]
[null,"MATERIAIS DE CONSUMO RELACIONADOS AO POSTO - AQUISIÇÃO",null,null,null,null,null,null,1,null,{"$f":"I11+1","v":2},null,{"$f":"K11+1","v":3},null,{"$f":"M11+1","v":4},null,{"$f":"O11+1","v":5},null,{"$f":"Q11+1","v":6},null,{"$f":"S11+1","v":7},null,{"$f":"U11+1","v":8},null,{"$f":"W11+1","v":9},null,{"$f":"Y11+1","v":10},null,{"$f":"AA11+1","v":11},null,{"$f":"AC11+1","v":12},null,{"$f":"AE11+1","v":13},null,{"$f":"AG11+1","v":14},null,{"$f":"AI11+1","v":15},null,{"$f":"AK11+1","v":16},null,{"$f":"AM11+1","v":17},null,{"$f":"AO11+1","v":18},null,{"$f":"AQ11+1","v":19},null,{"$f":"AS11+1","v":20},null,{"$f":"AU11+1","v":21},null,{"$f":"AW11+1","v":22},null,{"$f":"AY11+1","v":23},null,{"$f":"BA11+1","v":24},null,{"$f":"BC11+1","v":25},null,{"$f":"BE11+1","v":26},null,{"$f":"BG11+1","v":27},null,{"$f":"BI11+1","v":28},null,{"$f":"BK11+1","v":29},null,{"$f":"BM11+1","v":30},null,{"$f":"BO11+1","v":31},null,{"$f":"BQ11+1","v":32},null,{"$f":"BS11+1","v":33},null,{"$f":"BU11+1","v":34},null,{"$f":"BW11+1","v":35},null,{"$f":"BY11+1","v":36},null,{"$f":"CA11+1","v":37},null,{"$f":"CC11+1","v":38},null,{"$f":"CE11+1","v":39},null,{"$f":"CG11+1","v":40},null,{"$f":"CI11+1","v":41},null,{"$f":"CK11+1","v":42},null,{"$f":"CM11+1","v":43},null,{"$f":"CO11+1","v":44},null,{"$f":"CQ11+1","v":45},null,{"$f":"CS11+1","v":46},null,{"$f":"CU11+1","v":47},null,{"$f":"CW11+1","v":48},null,{"$f":"CY11+1","v":49},null,{"$f":"DA11+1","v":50},null,{"$f":"DC11+1","v":51},null,{"$f":"DE11+1","v":52},null,{"$f":"DG11+1","v":53},null,{"$f":"DI11+1","v":54},null,{"$f":"DK11+1","v":55},null,{"$f":"DM11+1","v":56},null,{"$f":"DO11+1","v":57},null,{"$f":"DQ11+1","v":58},null,{"$f":"DS11+1","v":59},null,{"$f":"DU11+1","v":60}]
[]
[null,null,null,null,null,null,null,null,{"$f":"ROUND(SUM(J12:J65),2)","v":0},null,{"$f":"ROUND(SUM(L12:L65),2)","v":0},null,{"$f":"ROUND(SUM(N12:N65),2)","v":0},null,{"$f":"ROUND(SUM(P12:P65),2)","v":0},null,{"$f":"ROUND(SUM(R12:R65),2)","v":0},null,{"$f":"ROUND(SUM(T12:T65),2)","v":0},null,{"$f":"ROUND(SUM(V12:V65),2)","v":0},null,{"$f":"ROUND(SUM(X12:X65),2)","v":0},null,{"$f":"ROUND(SUM(Z12:Z65),2)","v":0},null,{"$f":"ROUND(SUM(AB12:AB65),2)","v":0},null,{"$f":"ROUND(SUM(AD12:AD65),2)","v":0},null,{"$f":"ROUND(SUM(AF12:AF65),2)","v":0},null,{"$f":"ROUND(SUM(AH12:AH65),2)","v":0},null,{"$f":"ROUND(SUM(AJ12:AJ65),2)","v":0},null,{"$f":"ROUND(SUM(AL12:AL65),2)","v":0},null,{"$f":"ROUND(SUM(AN12:AN65),2)","v":0},null,{"$f":"ROUND(SUM(AP12:AP65),2)","v":0},null,{"$f":"ROUND(SUM(AR12:AR65),2)","v":0},null,{"$f":"ROUND(SUM(AT12:AT65),2)","v":0},null,{"$f":"ROUND(SUM(AV12:AV65),2)","v":0},null,{"$f":"ROUND(SUM(AX12:AX65),2)","v":0},null,{"$f":"ROUND(SUM(AZ12:AZ65),2)","v":0},null,{"$f":"ROUND(SUM(BB12:BB65),2)","v":0},null,{"$f":"ROUND(SUM(BD12:BD65),2)","v":0},null,{"$f":"ROUND(SUM(BF12:BF65),2)","v":0},null,{"$f":"ROUND(SUM(BH12:BH65),2)","v":0},null,{"$f":"ROUND(SUM(BJ12:BJ65),2)","v":0},null,{"$f":"ROUND(SUM(BL12:BL65),2)","v":0},null,{"$f":"ROUND(SUM(BN12:BN65),2)","v":0},null,{"$f":"ROUND(SUM(BP12:BP65),2)","v":0},null,{"$f":"ROUND(SUM(BR12:BR65),2)","v":0},null,{"$f":"ROUND(SUM(BT12:BT65),2)","v":0},null,{"$f":"ROUND(SUM(BV12:BV65),2)","v":0},null,{"$f":"ROUND(SUM(BX12:BX65),2)","v":0},null,{"$f":"ROUND(SUM(BZ12:BZ65),2)","v":0},null,{"$f":"ROUND(SUM(CB12:CB65),2)","v":0},null,{"$f":"ROUND(SUM(CD12:CD65),2)","v":0},null,{"$f":"ROUND(SUM(CF12:CF65),2)","v":0},null,{"$f":"ROUND(SUM(CH12:CH65),2)","v":0},null,{"$f":"ROUND(SUM(CJ12:CJ65),2)","v":0},null,{"$f":"ROUND(SUM(CL12:CL65),2)","v":0},null,{"$f":"ROUND(SUM(CN12:CN65),2)","v":0},null,{"$f":"ROUND(SUM(CP12:CP65),2)","v":0},null,{"$f":"ROUND(SUM(CR12:CR65),2)","v":0},null,{"$f":"ROUND(SUM(CT12:CT65),2)","v":0},null,{"$f":"ROUND(SUM(CV12:CV65),2)","v":0},null,{"$f":"ROUND(SUM(CX12:CX65),2)","v":0},null,{"$f":"ROUND(SUM(CZ12:CZ65),2)","v":0},null,{"$f":"ROUND(SUM(DB12:DB65),2)","v":0},null,{"$f":"ROUND(SUM(DD12:DD65),2)","v":0},null,{"$f":"ROUND(SUM(DF12:DF65),2)","v":0},null,{"$f":"ROUND(SUM(DH12:DH65),2)","v":0},null,{"$f":"ROUND(SUM(DJ12:DJ65),2)","v":0},null,{"$f":"ROUND(SUM(DL12:DL65),2)","v":0},null,{"$f":"ROUND(SUM(DN12:DN65),2)","v":0},null,{"$f":"ROUND(SUM(DP12:DP65),2)","v":0},null,{"$f":"ROUND(SUM(DR12:DR65),2)","v":0},null,{"$f":"ROUND(SUM(DT12:DT65),2)","v":0},null,{"$f":"ROUND(SUM(DV12:DV65),2)","v":0},null,{"$f":"ROUND(SUM(DX12:DX65),2)","v":0}]
[null,null,"CATEGORIAS",null,null,"QUANTIDADE"]
[null,null,null,null,null,null,null,null,{"$f":"IF($C15=I$11,1,0)","v":0}]
[null,null,null,null,null,null,null,null,0,null,{"$f":"IF($C16=K$11,1,0)","v":0},null,{"$f":"IF($C16=M$11,1,0)","v":0},null,{"$f":"IF($C16=O$11,1,0)","v":0},null,{"$f":"IF($C16=Q$11,1,0)","v":0},null,{"$f":"IF($C16=S$11,1,0)","v":0},null,{"$f":"IF($C16=U$11,1,0)","v":0},null,{"$f":"IF($C16=W$11,1,0)","v":0},null,{"$f":"IF($C16=Y$11,1,0)","v":0},null,{"$f":"IF($C16=AA$11,1,0)","v":0},null,{"$f":"IF($C16=AC$11,1,0)","v":0},null,{"$f":"IF($C16=AE$11,1,0)","v":0},null,{"$f":"IF($C16=AG$11,1,0)","v":0},null,{"$f":"IF($C16=AI$11,1,0)","v":0},null,{"$f":"IF($C16=AK$11,1,0)","v":0},null,{"$f":"IF($C16=AM$11,1,0)","v":0},null,{"$f":"IF($C16=AO$11,1,0)","v":0},null,{"$f":"IF($C16=AQ$11,1,0)","v":0},null,{"$f":"IF($C16=AS$11,1,0)","v":0},null,{"$f":"IF($C16=AU$11,1,0)","v":0},null,{"$f":"IF($C16=AW$11,1,0)","v":0},null,{"$f":"IF($C16=AY$11,1,0)","v":0},null,{"$f":"IF($C16=BA$11,1,0)","v":0},null,{"$f":"IF($C16=BC$11,1,0)","v":0},null,{"$f":"IF($C16=BE$11,1,0)","v":0},null,{"$f":"IF($C16=BG$11,1,0)","v":0},null,{"$f":"IF($C16=BI$11,1,0)","v":0},null,{"$f":"IF($C16=BK$11,1,0)","v":0},null,{"$f":"IF($C16=BM$11,1,0)","v":0},null,{"$f":"IF($C16=BO$11,1,0)","v":0},null,{"$f":"IF($C16=BQ$11,1,0)","v":0},null,{"$f":"IF($C16=BS$11,1,0)","v":0},null,{"$f":"IF($C16=BU$11,1,0)","v":0},null,{"$f":"IF($C16=BW$11,1,0)","v":0},null,{"$f":"IF($C16=BY$11,1,0)","v":0},null,{"$f":"IF($C16=CA$11,1,0)","v":0},null,{"$f":"IF($C16=CC$11,1,0)","v":0},null,{"$f":"IF($C16=CE$11,1,0)","v":0},null,{"$f":"IF($C16=CG$11,1,0)","v":0},null,{"$f":"IF($C16=CI$11,1,0)","v":0},null,{"$f":"IF($C16=CK$11,1,0)","v":0},null,{"$f":"IF($C16=CM$11,1,0)","v":0},null,{"$f":"IF($C16=CO$11,1,0)","v":0},null,{"$f":"IF($C16=CQ$11,1,0)","v":0},null,{"$f":"IF($C16=CS$11,1,0)","v":0},null,{"$f":"IF($C16=CU$11,1,0)","v":0},null,{"$f":"IF($C16=CW$11,1,0)","v":0},null,{"$f":"IF($C16=CY$11,1,0)","v":0},null,{"$f":"IF($C16=DA$11,1,0)","v":0},null,{"$f":"IF($C16=DC$11,1,0)","v":0},null,{"$f":"IF($C16=DE$11,1,0)","v":0},null,{"$f":"IF($C16=DG$11,1,0)","v":0},null,{"$f":"IF($C16=DI$11,1,0)","v":0},null,{"$f":"IF($C16=DK$11,1,0)","v":0},null,{"$f":"IF($C16=DM$11,1,0)","v":0},null,{"$f":"IF($C16=DO$11,1,0)","v":0},null,{"$f":"IF($C16=DQ$11,1,0)","v":0},null,{"$f":"IF($C16=DS$11,1,0)","v":0},null,{"$f":"IF($C16=DU$11,1,0)","v":0},null,{"$f":"IF($C16=DW$11,1,0)","v":0}]
[null,null,null,null,null,null,null,null,0,null,0,null,0,null,0,null,0,null,0,null,0,null,0,null,0,null,0,null,0,null,0,null,0,null,0,null,0,null,0,null,0,null,0,null,0,null,0,null,0,null,0,null,0,null,0,null,0,null,0,null,0,null,0,null,0,null,0,null,0,null,0,null,0,null,0,null,0,null,0,null,0,null,0,null,0,null,0,null,0,null,0,null,0,null,0,null,0,null,0,null,0,null,0,null,0,null,0,null,0,null,0,null,0,null,0,null,0,null,0,null,0,null,0,null,0,null,0]
[null,null,null,null,null,null,null,null,0,null,0,null,0,null,0,null,0,null,0,null,0,null,0,null,0,null,0,null,0,null,0,null,0,null,0,null,0,null,0,null,0,null,0,null,0,null,0,null,0,null,0,null,0,null,0,null,0,null,0,null,0,null,0,null,0,null,0,null,0,null,0,null,0,null,0,null,0,null,0,null,0,null,0,null,0,null,0,null,0,null,0,null,0,null,0,null,0,null,0,null,0,null,0,null,0,null,0,null,0,null,0,null,0,null,0,null,0,null,0,null,0,null,0,null,0,null,0]
[null,null,null,null,null,null,null,null,0,null,0,null,0,null,0,null,0,null,0,null,0,null,0,null,0,null,0,null,0,null,0,null,0,null,0,null,0,null,0,null,0,null,0,null,0,null,0,null,0,null,0,null,0,null,0,null,0,null,0,null,0,null,0,null,0,null,0,null,0,null,0,null,0,null,0,null,0,null,0,null,0,null,0,null,0,null,0,null,0,null,0,null,0,null,0,null,0,null,0,null,0,null,0,null,0,null,0,null,0,null,0,null,0,null,0,null,0,null,0,null,0,null,0,null,0,null,0]
[null,null,null,null,null,null,null,null,0,null,0,null,0,null,0,null,0,null,0,null,0,null,0,null,0,null,0,null,0,null,0,null,0,null,0,null,0,null,0,null,0,null,0,null,0,null,0,null,0,null,0,null,0,null,0,null,0,null,0,null,0,null,0,null,0,null,0,null,0,null,0,null,0,null,0,null,0,null,0,null,0,null,0,null,0,null,0,null,0,null,0,null,0,null,0,null,0,null,0,null,0,null,0,null,0,null,0,null,0,null,0,null,0,null,0,null,0,null,0,null,0,null,0,null,0,null,0]
[null,null,null,null,null,null,null,null,0,null,0,null,0,null,0,null,0,null,0,null,0,null,0,null,0,null,0,null,0,null,0,null,0,null,0,null,0,null,0,null,0,null,0,null,0,null,0,null,0,null,0,null,0,null,0,null,0,null,0,null,0,null,0,null,0,null,0,null,0,null,0,null,0,null,0,null,0,null,0,null,0,null,0,null,0,null,0,null,0,null,0,null,0,null,0,null,0,null,0,null,0,null,0,null,0,null,0,null,0,null,0,null,0,null,0,null,0,null,0,null,0,null,0,null,0,null,0]
[null,null,null,null,null,null,null,null,0]
[]
[null,null,"ITEM","DESCRIÇÃO","QUANT ANUAL","VALOR"]
[null,null,null,null,null,null,null,null,null,{"$f":"IF(SUM(I$15:I$22)>0,$E25*$F25,0)","v":0},null,{"$f":"IF(SUM(K$15:K$22)>0,$E25*$F25,0)","v":0},null,{"$f":"IF(SUM(M$15:M$22)>0,$E25*$F25,0)","v":0},null,{"$f":"IF(SUM(O$15:O$22)>0,$E25*$F25,0)","v":0},null,{"$f":"IF(SUM(Q$15:Q$22)>0,$E25*$F25,0)","v":0},null,{"$f":"IF(SUM(S$15:S$22)>0,$E25*$F25,0)","v":0},null,{"$f":"IF(SUM(U$15:U$22)>0,$E25*$F25,0)","v":0},null,{"$f":"IF(SUM(W$15:W$22)>0,$E25*$F25,0)","v":0},null,{"$f":"IF(SUM(Y$15:Y$22)>0,$E25*$F25,0)","v":0},null,{"$f":"IF(SUM(AA$15:AA$22)>0,$E25*$F25,0)","v":0},null,{"$f":"IF(SUM(AC$15:AC$22)>0,$E25*$F25,0)","v":0},null,{"$f":"IF(SUM(AE$15:AE$22)>0,$E25*$F25,0)","v":0},null,{"$f":"IF(SUM(AG$15:AG$22)>0,$E25*$F25,0)","v":0},null,{"$f":"IF(SUM(AI$15:AI$22)>0,$E25*$F25,0)","v":0},null,{"$f":"IF(SUM(AK$15:AK$22)>0,$E25*$F25,0)","v":0},null,{"$f":"IF(SUM(AM$15:AM$22)>0,$E25*$F25,0)","v":0},null,{"$f":"IF(SUM(AO$15:AO$22)>0,$E25*$F25,0)","v":0},null,{"$f":"IF(SUM(AQ$15:AQ$22)>0,$E25*$F25,0)","v":0},null,{"$f":"IF(SUM(AS$15:AS$22)>0,$E25*$F25,0)","v":0},null,{"$f":"IF(SUM(AU$15:AU$22)>0,$E25*$F25,0)","v":0},null,{"$f":"IF(SUM(AW$15:AW$22)>0,$E25*$F25,0)","v":0},null,{"$f":"IF(SUM(AY$15:AY$22)>0,$E25*$F25,0)","v":0},null,{"$f":"IF(SUM(BA$15:BA$22)>0,$E25*$F25,0)","v":0},null,{"$f":"IF(SUM(BC$15:BC$22)>0,$E25*$F25,0)","v":0},null,{"$f":"IF(SUM(BE$15:BE$22)>0,$E25*$F25,0)","v":0},null,{"$f":"IF(SUM(BG$15:BG$22)>0,$E25*$F25,0)","v":0},null,{"$f":"IF(SUM(BI$15:BI$22)>0,$E25*$F25,0)","v":0},null,{"$f":"IF(SUM(BK$15:BK$22)>0,$E25*$F25,0)","v":0},null,{"$f":"IF(SUM(BM$15:BM$22)>0,$E25*$F25,0)","v":0},null,{"$f":"IF(SUM(BO$15:BO$22)>0,$E25*$F25,0)","v":0},null,{"$f":"IF(SUM(BQ$15:BQ$22)>0,$E25*$F25,0)","v":0},null,{"$f":"IF(SUM(BS$15:BS$22)>0,$E25*$F25,0)","v":0},null,{"$f":"IF(SUM(BU$15:BU$22)>0,$E25*$F25,0)","v":0},null,{"$f":"IF(SUM(BW$15:BW$22)>0,$E25*$F25,0)","v":0},null,{"$f":"IF(SUM(BY$15:BY$22)>0,$E25*$F25,0)","v":0},null,{"$f":"IF(SUM(CA$15:CA$22)>0,$E25*$F25,0)","v":0},null,{"$f":"IF(SUM(CC$15:CC$22)>0,$E25*$F25,0)","v":0},null,{"$f":"IF(SUM(CE$15:CE$22)>0,$E25*$F25,0)","v":0},null,{"$f":"IF(SUM(CG$15:CG$22)>0,$E25*$F25,0)","v":0},null,{"$f":"IF(SUM(CI$15:CI$22)>0,$E25*$F25,0)","v":0},null,{"$f":"IF(SUM(CK$15:CK$22)>0,$E25*$F25,0)","v":0},null,{"$f":"IF(SUM(CM$15:CM$22)>0,$E25*$F25,0)","v":0},null,{"$f":"IF(SUM(CO$15:CO$22)>0,$E25*$F25,0)","v":0},null,{"$f":"IF(SUM(CQ$15:CQ$22)>0,$E25*$F25,0)","v":0},null,{"$f":"IF(SUM(CS$15:CS$22)>0,$E25*$F25,0)","v":0},null,{"$f":"IF(SUM(CU$15:CU$22)>0,$E25*$F25,0)","v":0},null,{"$f":"IF(SUM(CW$15:CW$22)>0,$E25*$F25,0)","v":0},null,{"$f":"IF(SUM(CY$15:CY$22)>0,$E25*$F25,0)","v":0},null,{"$f":"IF(SUM(DA$15:DA$22)>0,$E25*$F25,0)","v":0},null,{"$f":"IF(SUM(DC$15:DC$22)>0,$E25*$F25,0)","v":0},null,{"$f":"IF(SUM(DE$15:DE$22)>0,$E25*$F25,0)","v":0},null,{"$f":"IF(SUM(DG$15:DG$22)>0,$E25*$F25,0)","v":0},null,{"$f":"IF(SUM(DI$15:DI$22)>0,$E25*$F25,0)","v":0},null,{"$f":"IF(SUM(DK$15:DK$22)>0,$E25*$F25,0)","v":0},null,{"$f":"IF(SUM(DM$15:DM$22)>0,$E25*$F25,0)","v":0},null,{"$f":"IF(SUM(DO$15:DO$22)>0,$E25*$F25,0)","v":0},null,{"$f":"IF(SUM(DQ$15:DQ$22)>0,$E25*$F25,0)","v":0},null,{"$f":"IF(SUM(DS$15:DS$22)>0,$E25*$F25,0)","v":0},null,{"$f":"IF(SUM(DU$15:DU$22)>0,$E25*$F25,0)","v":0},null,{"$f":"IF(SUM(DW$15:DW$22)>0,$E25*$F25,0)","v":0}]
[null,null,null,null,null,null,null,null,null,{"$f":"IF(SUM(I$15:I$22)>0,$E26*$F26,0)","v":0},null,{"$f":"IF(SUM(K$15:K$22)>0,$E26*$F26,0)","v":0},null,{"$f":"IF(SUM(M$15:M$22)>0,$E26*$F26,0)","v":0},null,{"$f":"IF(SUM(O$15:O$22)>0,$E26*$F26,0)","v":0},null,{"$f":"IF(SUM(Q$15:Q$22)>0,$E26*$F26,0)","v":0},null,{"$f":"IF(SUM(S$15:S$22)>0,$E26*$F26,0)","v":0},null,{"$f":"IF(SUM(U$15:U$22)>0,$E26*$F26,0)","v":0},null,{"$f":"IF(SUM(W$15:W$22)>0,$E26*$F26,0)","v":0},null,{"$f":"IF(SUM(Y$15:Y$22)>0,$E26*$F26,0)","v":0},null,{"$f":"IF(SUM(AA$15:AA$22)>0,$E26*$F26,0)","v":0},null,{"$f":"IF(SUM(AC$15:AC$22)>0,$E26*$F26,0)","v":0},null,{"$f":"IF(SUM(AE$15:AE$22)>0,$E26*$F26,0)","v":0},null,{"$f":"IF(SUM(AG$15:AG$22)>0,$E26*$F26,0)","v":0},null,{"$f":"IF(SUM(AI$15:AI$22)>0,$E26*$F26,0)","v":0},null,{"$f":"IF(SUM(AK$15:AK$22)>0,$E26*$F26,0)","v":0},null,{"$f":"IF(SUM(AM$15:AM$22)>0,$E26*$F26,0)","v":0},null,{"$f":"IF(SUM(AO$15:AO$22)>0,$E26*$F26,0)","v":0},null,{"$f":"IF(SUM(AQ$15:AQ$22)>0,$E26*$F26,0)","v":0},null,{"$f":"IF(SUM(AS$15:AS$22)>0,$E26*$F26,0)","v":0},null,{"$f":"IF(SUM(AU$15:AU$22)>0,$E26*$F26,0)","v":0},null,{"$f":"IF(SUM(AW$15:AW$22)>0,$E26*$F26,0)","v":0},null,{"$f":"IF(SUM(AY$15:AY$22)>0,$E26*$F26,0)","v":0},null,{"$f":"IF(SUM(BA$15:BA$22)>0,$E26*$F26,0)","v":0},null,{"$f":"IF(SUM(BC$15:BC$22)>0,$E26*$F26,0)","v":0},null,{"$f":"IF(SUM(BE$15:BE$22)>0,$E26*$F26,0)","v":0},null,{"$f":"IF(SUM(BG$15:BG$22)>0,$E26*$F26,0)","v":0},null,{"$f":"IF(SUM(BI$15:BI$22)>0,$E26*$F26,0)","v":0},null,{"$f":"IF(SUM(BK$15:BK$22)>0,$E26*$F26,0)","v":0},null,{"$f":"IF(SUM(BM$15:BM$22)>0,$E26*$F26,0)","v":0},null,{"$f":"IF(SUM(BO$15:BO$22)>0,$E26*$F26,0)","v":0},null,{"$f":"IF(SUM(BQ$15:BQ$22)>0,$E26*$F26,0)","v":0},null,{"$f":"IF(SUM(BS$15:BS$22)>0,$E26*$F26,0)","v":0},null,{"$f":"IF(SUM(BU$15:BU$22)>0,$E26*$F26,0)","v":0},null,{"$f":"IF(SUM(BW$15:BW$22)>0,$E26*$F26,0)","v":0},null,{"$f":"IF(SUM(BY$15:BY$22)>0,$E26*$F26,0)","v":0},null,{"$f":"IF(SUM(CA$15:CA$22)>0,$E26*$F26,0)","v":0},null,{"$f":"IF(SUM(CC$15:CC$22)>0,$E26*$F26,0)","v":0},null,{"$f":"IF(SUM(CE$15:CE$22)>0,$E26*$F26,0)","v":0},null,{"$f":"IF(SUM(CG$15:CG$22)>0,$E26*$F26,0)","v":0},null,{"$f":"IF(SUM(CI$15:CI$22)>0,$E26*$F26,0)","v":0},null,{"$f":"IF(SUM(CK$15:CK$22)>0,$E26*$F26,0)","v":0},null,{"$f":"IF(SUM(CM$15:CM$22)>0,$E26*$F26,0)","v":0},null,{"$f":"IF(SUM(CO$15:CO$22)>0,$E26*$F26,0)","v":0},null,{"$f":"IF(SUM(CQ$15:CQ$22)>0,$E26*$F26,0)","v":0},null,{"$f":"IF(SUM(CS$15:CS$22)>0,$E26*$F26,0)","v":0},null,{"$f":"IF(SUM(CU$15:CU$22)>0,$E26*$F26,0)","v":0},null,{"$f":"IF(SUM(CW$15:CW$22)>0,$E26*$F26,0)","v":0},null,{"$f":"IF(SUM(CY$15:CY$22)>0,$E26*$F26,0)","v":0},null,{"$f":"IF(SUM(DA$15:DA$22)>0,$E26*$F26,0)","v":0},null,{"$f":"IF(SUM(DC$15:DC$22)>0,$E26*$F26,0)","v":0},null,{"$f":"IF(SUM(DE$15:DE$22)>0,$E26*$F26,0)","v":0},null,{"$f":"IF(SUM(DG$15:DG$22)>0,$E26*$F26,0)","v":0},null,{"$f":"IF(SUM(DI$15:DI$22)>0,$E26*$F26,0)","v":0},null,{"$f":"IF(SUM(DK$15:DK$22)>0,$E26*$F26,0)","v":0},null,{"$f":"IF(SUM(DM$15:DM$22)>0,$E26*$F26,0)","v":0},null,{"$f":"IF(SUM(DO$15:DO$22)>0,$E26*$F26,0)","v":0},null,{"$f":"IF(SUM(DQ$15:DQ$22)>0,$E26*$F26,0)","v":0},null,{"$f":"IF(SUM(DS$15:DS$22)>0,$E26*$F26,0)","v":0},null,{"$f":"IF(SUM(DU$15:DU$22)>0,$E26*$F26,0)","v":0},null,{"$f":"IF(SUM(DW$15:DW$22)>0,$E26*$F26,0)","v":0}]
[null,null,null,null,null,null,null,null,null,{"$f":"IF(SUM(I$15:I$22)>0,$E27*$F27,0)","v":0},null,{"$f":"IF(SUM(K$15:K$22)>0,$E27*$F27,0)","v":0},null,{"$f":"IF(SUM(M$15:M$22)>0,$E27*$F27,0)","v":0},null,{"$f":"IF(SUM(O$15:O$22)>0,$E27*$F27,0)","v":0},null,{"$f":"IF(SUM(Q$15:Q$22)>0,$E27*$F27,0)","v":0},null,{"$f":"IF(SUM(S$15:S$22)>0,$E27*$F27,0)","v":0},null,{"$f":"IF(SUM(U$15:U$22)>0,$E27*$F27,0)","v":0},null,{"$f":"IF(SUM(W$15:W$22)>0,$E27*$F27,0)","v":0},null,{"$f":"IF(SUM(Y$15:Y$22)>0,$E27*$F27,0)","v":0},null,{"$f":"IF(SUM(AA$15:AA$22)>0,$E27*$F27,0)","v":0},null,{"$f":"IF(SUM(AC$15:AC$22)>0,$E27*$F27,0)","v":0},null,{"$f":"IF(SUM(AE$15:AE$22)>0,$E27*$F27,0)","v":0},null,{"$f":"IF(SUM(AG$15:AG$22)>0,$E27*$F27,0)","v":0},null,{"$f":"IF(SUM(AI$15:AI$22)>0,$E27*$F27,0)","v":0},null,{"$f":"IF(SUM(AK$15:AK$22)>0,$E27*$F27,0)","v":0},null,{"$f":"IF(SUM(AM$15:AM$22)>0,$E27*$F27,0)","v":0},null,{"$f":"IF(SUM(AO$15:AO$22)>0,$E27*$F27,0)","v":0},null,{"$f":"IF(SUM(AQ$15:AQ$22)>0,$E27*$F27,0)","v":0},null,{"$f":"IF(SUM(AS$15:AS$22)>0,$E27*$F27,0)","v":0},null,{"$f":"IF(SUM(AU$15:AU$22)>0,$E27*$F27,0)","v":0},null,{"$f":"IF(SUM(AW$15:AW$22)>0,$E27*$F27,0)","v":0},null,{"$f":"IF(SUM(AY$15:AY$22)>0,$E27*$F27,0)","v":0},null,{"$f":"IF(SUM(BA$15:BA$22)>0,$E27*$F27,0)","v":0},null,{"$f":"IF(SUM(BC$15:BC$22)>0,$E27*$F27,0)","v":0},null,{"$f":"IF(SUM(BE$15:BE$22)>0,$E27*$F27,0)","v":0},null,{"$f":"IF(SUM(BG$15:BG$22)>0,$E27*$F27,0)","v":0},null,{"$f":"IF(SUM(BI$15:BI$22)>0,$E27*$F27,0)","v":0},null,{"$f":"IF(SUM(BK$15:BK$22)>0,$E27*$F27,0)","v":0},null,{"$f":"IF(SUM(BM$15:BM$22)>0,$E27*$F27,0)","v":0},null,{"$f":"IF(SUM(BO$15:BO$22)>0,$E27*$F27,0)","v":0},null,{"$f":"IF(SUM(BQ$15:BQ$22)>0,$E27*$F27,0)","v":0},null,{"$f":"IF(SUM(BS$15:BS$22)>0,$E27*$F27,0)","v":0},null,{"$f":"IF(SUM(BU$15:BU$22)>0,$E27*$F27,0)","v":0},null,{"$f":"IF(SUM(BW$15:BW$22)>0,$E27*$F27,0)","v":0},null,{"$f":"IF(SUM(BY$15:BY$22)>0,$E27*$F27,0)","v":0},null,{"$f":"IF(SUM(CA$15:CA$22)>0,$E27*$F27,0)","v":0},null,{"$f":"IF(SUM(CC$15:CC$22)>0,$E27*$F27,0)","v":0},null,{"$f":"IF(SUM(CE$15:CE$22)>0,$E27*$F27,0)","v":0},null,{"$f":"IF(SUM(CG$15:CG$22)>0,$E27*$F27,0)","v":0},null,{"$f":"IF(SUM(CI$15:CI$22)>0,$E27*$F27,0)","v":0},null,{"$f":"IF(SUM(CK$15:CK$22)>0,$E27*$F27,0)","v":0},null,{"$f":"IF(SUM(CM$15:CM$22)>0,$E27*$F27,0)","v":0},null,{"$f":"IF(SUM(CO$15:CO$22)>0,$E27*$F27,0)","v":0},null,{"$f":"IF(SUM(CQ$15:CQ$22)>0,$E27*$F27,0)","v":0},null,{"$f":"IF(SUM(CS$15:CS$22)>0,$E27*$F27,0)","v":0},null,{"$f":"IF(SUM(CU$15:CU$22)>0,$E27*$F27,0)","v":0},null,{"$f":"IF(SUM(CW$15:CW$22)>0,$E27*$F27,0)","v":0},null,{"$f":"IF(SUM(CY$15:CY$22)>0,$E27*$F27,0)","v":0},null,{"$f":"IF(SUM(DA$15:DA$22)>0,$E27*$F27,0)","v":0},null,{"$f":"IF(SUM(DC$15:DC$22)>0,$E27*$F27,0)","v":0},null,{"$f":"IF(SUM(DE$15:DE$22)>0,$E27*$F27,0)","v":0},null,{"$f":"IF(SUM(DG$15:DG$22)>0,$E27*$F27,0)","v":0},null,{"$f":"IF(SUM(DI$15:DI$22)>0,$E27*$F27,0)","v":0},null,{"$f":"IF(SUM(DK$15:DK$22)>0,$E27*$F27,0)","v":0},null,{"$f":"IF(SUM(DM$15:DM$22)>0,$E27*$F27,0)","v":0},null,{"$f":"IF(SUM(DO$15:DO$22)>0,$E27*$F27,0)","v":0},null,{"$f":"IF(SUM(DQ$15:DQ$22)>0,$E27*$F27,0)","v":0},null,{"$f":"IF(SUM(DS$15:DS$22)>0,$E27*$F27,0)","v":0},null,{"$f":"IF(SUM(DU$15:DU$22)>0,$E27*$F27,0)","v":0},null,{"$f":"IF(SUM(DW$15:DW$22)>0,$E27*$F27,0)","v":0}]
[null,null,null,null,null,null,null,null,null,{"$f":"IF(SUM(I$15:I$22)>0,$E28*$F28,0)","v":0},null,{"$f":"IF(SUM(K$15:K$22)>0,$E28*$F28,0)","v":0},null,{"$f":"IF(SUM(M$15:M$22)>0,$E28*$F28,0)","v":0},null,{"$f":"IF(SUM(O$15:O$22)>0,$E28*$F28,0)","v":0},null,{"$f":"IF(SUM(Q$15:Q$22)>0,$E28*$F28,0)","v":0},null,{"$f":"IF(SUM(S$15:S$22)>0,$E28*$F28,0)","v":0},null,{"$f":"IF(SUM(U$15:U$22)>0,$E28*$F28,0)","v":0},null,{"$f":"IF(SUM(W$15:W$22)>0,$E28*$F28,0)","v":0},null,{"$f":"IF(SUM(Y$15:Y$22)>0,$E28*$F28,0)","v":0},null,{"$f":"IF(SUM(AA$15:AA$22)>0,$E28*$F28,0)","v":0},null,{"$f":"IF(SUM(AC$15:AC$22)>0,$E28*$F28,0)","v":0},null,{"$f":"IF(SUM(AE$15:AE$22)>0,$E28*$F28,0)","v":0},null,{"$f":"IF(SUM(AG$15:AG$22)>0,$E28*$F28,0)","v":0},null,{"$f":"IF(SUM(AI$15:AI$22)>0,$E28*$F28,0)","v":0},null,{"$f":"IF(SUM(AK$15:AK$22)>0,$E28*$F28,0)","v":0},null,{"$f":"IF(SUM(AM$15:AM$22)>0,$E28*$F28,0)","v":0},null,{"$f":"IF(SUM(AO$15:AO$22)>0,$E28*$F28,0)","v":0},null,{"$f":"IF(SUM(AQ$15:AQ$22)>0,$E28*$F28,0)","v":0},null,{"$f":"IF(SUM(AS$15:AS$22)>0,$E28*$F28,0)","v":0},null,{"$f":"IF(SUM(AU$15:AU$22)>0,$E28*$F28,0)","v":0},null,{"$f":"IF(SUM(AW$15:AW$22)>0,$E28*$F28,0)","v":0},null,{"$f":"IF(SUM(AY$15:AY$22)>0,$E28*$F28,0)","v":0},null,{"$f":"IF(SUM(BA$15:BA$22)>0,$E28*$F28,0)","v":0},null,{"$f":"IF(SUM(BC$15:BC$22)>0,$E28*$F28,0)","v":0},null,{"$f":"IF(SUM(BE$15:BE$22)>0,$E28*$F28,0)","v":0},null,{"$f":"IF(SUM(BG$15:BG$22)>0,$E28*$F28,0)","v":0},null,{"$f":"IF(SUM(BI$15:BI$22)>0,$E28*$F28,0)","v":0},null,{"$f":"IF(SUM(BK$15:BK$22)>0,$E28*$F28,0)","v":0},null,{"$f":"IF(SUM(BM$15:BM$22)>0,$E28*$F28,0)","v":0},null,{"$f":"IF(SUM(BO$15:BO$22)>0,$E28*$F28,0)","v":0},null,{"$f":"IF(SUM(BQ$15:BQ$22)>0,$E28*$F28,0)","v":0},null,{"$f":"IF(SUM(BS$15:BS$22)>0,$E28*$F28,0)","v":0},null,{"$f":"IF(SUM(BU$15:BU$22)>0,$E28*$F28,0)","v":0},null,{"$f":"IF(SUM(BW$15:BW$22)>0,$E28*$F28,0)","v":0},null,{"$f":"IF(SUM(BY$15:BY$22)>0,$E28*$F28,0)","v":0},null,{"$f":"IF(SUM(CA$15:CA$22)>0,$E28*$F28,0)","v":0},null,{"$f":"IF(SUM(CC$15:CC$22)>0,$E28*$F28,0)","v":0},null,{"$f":"IF(SUM(CE$15:CE$22)>0,$E28*$F28,0)","v":0},null,{"$f":"IF(SUM(CG$15:CG$22)>0,$E28*$F28,0)","v":0},null,{"$f":"IF(SUM(CI$15:CI$22)>0,$E28*$F28,0)","v":0},null,{"$f":"IF(SUM(CK$15:CK$22)>0,$E28*$F28,0)","v":0},null,{"$f":"IF(SUM(CM$15:CM$22)>0,$E28*$F28,0)","v":0},null,{"$f":"IF(SUM(CO$15:CO$22)>0,$E28*$F28,0)","v":0},null,{"$f":"IF(SUM(CQ$15:CQ$22)>0,$E28*$F28,0)","v":0},null,{"$f":"IF(SUM(CS$15:CS$22)>0,$E28*$F28,0)","v":0},null,{"$f":"IF(SUM(CU$15:CU$22)>0,$E28*$F28,0)","v":0},null,{"$f":"IF(SUM(CW$15:CW$22)>0,$E28*$F28,0)","v":0},null,{"$f":"IF(SUM(CY$15:CY$22)>0,$E28*$F28,0)","v":0},null,{"$f":"IF(SUM(DA$15:DA$22)>0,$E28*$F28,0)","v":0},null,{"$f":"IF(SUM(DC$15:DC$22)>0,$E28*$F28,0)","v":0},null,{"$f":"IF(SUM(DE$15:DE$22)>0,$E28*$F28,0)","v":0},null,{"$f":"IF(SUM(DG$15:DG$22)>0,$E28*$F28,0)","v":0},null,{"$f":"IF(SUM(DI$15:DI$22)>0,$E28*$F28,0)","v":0},null,{"$f":"IF(SUM(DK$15:DK$22)>0,$E28*$F28,0)","v":0},null,{"$f":"IF(SUM(DM$15:DM$22)>0,$E28*$F28,0)","v":0},null,{"$f":"IF(SUM(DO$15:DO$22)>0,$E28*$F28,0)","v":0},null,{"$f":"IF(SUM(DQ$15:DQ$22)>0,$E28*$F28,0)","v":0},null,{"$f":"IF(SUM(DS$15:DS$22)>0,$E28*$F28,0)","v":0},null,{"$f":"IF(SUM(DU$15:DU$22)>0,$E28*$F28,0)","v":0},null,{"$f":"IF(SUM(DW$15:DW$22)>0,$E28*$F28,0)","v":0}]

{"sheet":"Mat Perm","index":23,"n_rows":113,"n_cols":136,"rows_kept":113,"cut":false,"hidden":true,"merged":[[9,1,9,3],[10,1,10,14]]}
[null,null,"CÂMARA DOS DEPUTADOS"]
[null,null,"DEPARTAMENTO TÉCNICO"]
[null,null,"Coordenação de Planejamento e Gestão"]
[]
[null,null,"Data:",{"$f":"'Dados Gerais'!#REF!","v":{"$error":"#REF!"}}]
[null,null,"Processo:",{"$f":"'Dados Gerais'!#REF!","v":{"$error":"#REF!"}}]
[null,null,"Objeto:",{"$f":"'Dados Gerais'!#REF!","v":{"$error":"#REF!"}}]
[]
[]
[]
[null,"MATERIAIS PERMANENTES RELACIONADOS AO POSTO - PAGAMENTO DA DEPRECIAÇÃO / MANUTENÇÃO",null,null,null,null,null,null,null,null,null,null,null,null,null,null,1,null,{"$f":"Q11+1","v":2},null,{"$f":"S11+1","v":3},null,{"$f":"U11+1","v":4},null,{"$f":"W11+1","v":5},null,{"$f":"Y11+1","v":6},null,{"$f":"AA11+1","v":7},null,{"$f":"AC11+1","v":8},null,{"$f":"AE11+1","v":9},null,{"$f":"AG11+1","v":10},null,{"$f":"AI11+1","v":11},null,{"$f":"AK11+1","v":12},null,{"$f":"AM11+1","v":13},null,{"$f":"AO11+1","v":14},null,{"$f":"AQ11+1","v":15},null,{"$f":"AS11+1","v":16},null,{"$f":"AU11+1","v":17},null,{"$f":"AW11+1","v":18},null,{"$f":"AY11+1","v":19},null,{"$f":"BA11+1","v":20},null,{"$f":"BC11+1","v":21},null,{"$f":"BE11+1","v":22},null,{"$f":"BG11+1","v":23},null,{"$f":"BI11+1","v":24},null,{"$f":"BK11+1","v":25},null,{"$f":"BM11+1","v":26},null,{"$f":"BO11+1","v":27},null,{"$f":"BQ11+1","v":28},null,{"$f":"BS11+1","v":29},null,{"$f":"BU11+1","v":30},null,{"$f":"BW11+1","v":31},null,{"$f":"BY11+1","v":32},null,{"$f":"CA11+1","v":33},null,{"$f":"CC11+1","v":34},null,{"$f":"CE11+1","v":35},null,{"$f":"CG11+1","v":36},null,{"$f":"CI11+1","v":37},null,{"$f":"CK11+1","v":38},null,{"$f":"CM11+1","v":39},null,{"$f":"CO11+1","v":40},null,{"$f":"CQ11+1","v":41},null,{"$f":"CS11+1","v":42},null,{"$f":"CU11+1","v":43},null,{"$f":"CW11+1","v":44},null,{"$f":"CY11+1","v":45},null,{"$f":"DA11+1","v":46},null,{"$f":"DC11+1","v":47},null,{"$f":"DE11+1","v":48},null,{"$f":"DG11+1","v":49},null,{"$f":"DI11+1","v":50},null,{"$f":"DK11+1","v":51},null,{"$f":"DM11+1","v":52},null,{"$f":"DO11+1","v":53},null,{"$f":"DQ11+1","v":54},null,{"$f":"DS11+1","v":55},null,{"$f":"DU11+1","v":56},null,{"$f":"DW11+1","v":57},null,{"$f":"DY11+1","v":58},null,{"$f":"EA11+1","v":59},null,{"$f":"EC11+1","v":60}]
[]
[null,null,null,null,null,null,null,null,null,null,null,null,null,null,null,null,{"$f":"SUM(R12:R94)","v":0},null,{"$f":"SUM(T12:T94)","v":0},null,{"$f":"SUM(V12:V94)","v":0},null,{"$f":"SUM(X12:X94)","v":0},null,{"$f":"SUM(Z12:Z94)","v":0},null,{"$f":"SUM(AB12:AB94)","v":0},null,{"$f":"SUM(AD12:AD94)","v":0},null,{"$f":"SUM(AF12:AF94)","v":0},null,{"$f":"SUM(AH12:AH94)","v":0},null,{"$f":"SUM(AJ12:AJ94)","v":0},null,{"$f":"SUM(AL12:AL94)","v":0},null,{"$f":"SUM(AN12:AN94)","v":0},null,{"$f":"SUM(AP12:AP94)","v":0},null,{"$f":"SUM(AR12:AR94)","v":0},null,{"$f":"SUM(AT12:AT94)","v":0},null,{"$f":"SUM(AV12:AV94)","v":0},null,{"$f":"SUM(AX12:AX94)","v":0},null,{"$f":"SUM(AZ12:AZ94)","v":0},null,{"$f":"SUM(BB12:BB94)","v":0},null,{"$f":"SUM(BD12:BD94)","v":0},null,{"$f":"SUM(BF12:BF94)","v":0},null,{"$f":"SUM(BH12:BH94)","v":0},null,{"$f":"SUM(BJ12:BJ94)","v":0},null,{"$f":"SUM(BL12:BL94)","v":0},null,{"$f":"SUM(BN12:BN94)","v":0},null,{"$f":"SUM(BP12:BP94)","v":0},null,{"$f":"SUM(BR12:BR94)","v":0},null,{"$f":"SUM(BT12:BT94)","v":0},null,{"$f":"SUM(BV12:BV94)","v":0},null,{"$f":"SUM(BX12:BX94)","v":0},null,{"$f":"SUM(BZ12:BZ94)","v":0},null,{"$f":"SUM(CB12:CB94)","v":0},null,{"$f":"SUM(CD12:CD94)","v":0},null,{"$f":"SUM(CF12:CF94)","v":0},null,{"$f":"SUM(CH12:CH94)","v":0},null,{"$f":"SUM(CJ12:CJ94)","v":0},null,{"$f":"SUM(CL12:CL94)","v":0},null,{"$f":"SUM(CN12:CN94)","v":0},null,{"$f":"SUM(CP12:CP94)","v":0},null,{"$f":"SUM(CR12:CR94)","v":0},null,{"$f":"SUM(CT12:CT94)","v":0},null,{"$f":"SUM(CV12:CV94)","v":0},null,{"$f":"SUM(CX12:CX94)","v":0},null,{"$f":"SUM(CZ12:CZ94)","v":0},null,{"$f":"SUM(DB12:DB94)","v":0},null,{"$f":"SUM(DD12:DD94)","v":0},null,{"$f":"SUM(DF12:DF94)","v":0},null,{"$f":"SUM(DH12:DH94)","v":0},null,{"$f":"SUM(DJ12:DJ94)","v":0},null,{"$f":"SUM(DL12:DL94)","v":0},null,{"$f":"SUM(DN12:DN94)","v":0},null,{"$f":"SUM(DP12:DP94)","v":0},null,{"$f":"SUM(DR12:DR94)","v":0},null,{"$f":"SUM(DT12:DT94)","v":0},null,{"$f":"SUM(DV12:DV94)","v":0},null,{"$f":"SUM(DX12:DX94)","v":0},null,{"$f":"SUM(DZ12:DZ94)","v":0},null,{"$f":"SUM(EB12:EB94)","v":0},null,{"$f":"SUM(ED12:ED94)","v":0},null,{"$f":"SUM(EF12:EF94)","v":0}]
[null,null,"CATEGORIAS",null,"QUANTIDADE"]
[null,null,null,null,null,null,null,null,null,null,null,null,null,null,null,null,{"$f":"IF($C15=Q$11,1,0)","v":0},null,{"$f":"IF($C15=S$11,1,0)","v":0},null,{"$f":"IF($C15=U$11,1,0)","v":0},null,{"$f":"IF($C15=W$11,1,0)","v":0},null,{"$f":"IF($C15=Y$11,1,0)","v":0},null,{"$f":"IF($C15=AA$11,1,0)","v":0},null,{"$f":"IF($C15=AC$11,1,0)","v":0},null,{"$f":"IF($C15=AE$11,1,0)","v":0},null,{"$f":"IF($C15=AG$11,1,0)","v":0},null,{"$f":"IF($C15=AI$11,1,0)","v":0},null,{"$f":"IF($C15=AK$11,1,0)","v":0},null,{"$f":"IF($C15=AM$11,1,0)","v":0},null,{"$f":"IF($C15=AO$11,1,0)","v":0},null,{"$f":"IF($C15=AQ$11,1,0)","v":0},null,{"$f":"IF($C15=AS$11,1,0)","v":0},null,{"$f":"IF($C15=AU$11,1,0)","v":0},null,{"$f":"IF($C15=AW$11,1,0)","v":0},null,{"$f":"IF($C15=AY$11,1,0)","v":0},null,{"$f":"IF($C15=BA$11,1,0)","v":0},null,{"$f":"IF($C15=BC$11,1,0)","v":0},null,{"$f":"IF($C15=BE$11,1,0)","v":0},null,{"$f":"IF($C15=BG$11,1,0)","v":0},null,{"$f":"IF($C15=BI$11,1,0)","v":0},null,{"$f":"IF($C15=BK$11,1,0)","v":0},null,{"$f":"IF($C15=BM$11,1,0)","v":0},null,{"$f":"IF($C15=BO$11,1,0)","v":0},null,{"$f":"IF($C15=BQ$11,1,0)","v":0},null,{"$f":"IF($C15=BS$11,1,0)","v":0},null,{"$f":"IF($C15=BU$11,1,0)","v":0},null,{"$f":"IF($C15=BW$11,1,0)","v":0},null,{"$f":"IF($C15=BY$11,1,0)","v":0},null,{"$f":"IF($C15=CA$11,1,0)","v":0},null,{"$f":"IF($C15=CC$11,1,0)","v":0},null,{"$f":"IF($C15=CE$11,1,0)","v":0},null,{"$f":"IF($C15=CG$11,1,0)","v":0},null,{"$f":"IF($C15=CI$11,1,0)","v":0},null,{"$f":"IF($C15=CK$11,1,0)","v":0},null,{"$f":"IF($C15=CM$11,1,0)","v":0},null,{"$f":"IF($C15=CO$11,1,0)","v":0},null,{"$f":"IF($C15=CQ$11,1,0)","v":0},null,{"$f":"IF($C15=CS$11,1,0)","v":0},null,{"$f":"IF($C15=CU$11,1,0)","v":0},null,{"$f":"IF($C15=CW$11,1,0)","v":0},null,{"$f":"IF($C15=CY$11,1,0)","v":0},null,{"$f":"IF($C15=DA$11,1,0)","v":0},null,{"$f":"IF($C15=DC$11,1,0)","v":0},null,{"$f":"IF($C15=DE$11,1,0)","v":0},null,{"$f":"IF($C15=DG$11,1,0)","v":0},null,{"$f":"IF($C15=DI$11,1,0)","v":0},null,{"$f":"IF($C15=DK$11,1,0)","v":0},null,{"$f":"IF($C15=DM$11,1,0)","v":0},null,{"$f":"IF($C15=DO$11,1,0)","v":0},null,{"$f":"IF($C15=DQ$11,1,0)","v":0},null,{"$f":"IF($C15=DS$11,1,0)","v":0},null,{"$f":"IF($C15=DU$11,1,0)","v":0},null,{"$f":"IF($C15=DW$11,1,0)","v":0},null,{"$f":"IF($C15=DY$11,1,0)","v":0},null,{"$f":"IF($C15=EA$11,1,0)","v":0},null,{"$f":"IF($C15=EC$11,1,0)","v":0},null,{"$f":"IF($C15=EE$11,1,0)","v":0}]
[null,null,null,{"$f":"HLOOKUP($C16,'Dados Gerais'!$D$5:$BK$10,6)","v":{"$error":"#N/A"}},{"$f":"HLOOKUP($C16,'Dados Gerais'!$D$5:$BK$14,10)","v":{"$error":"#N/A"}},null,null,null,null,null,null,null,null,null,null,null,0,null,0,null,0,null,0,null,0,null,0,null,0,null,0,null,0,null,0,null,0,null,0,null,0,null,0,null,0,null,0,null,0,null,0,null,0,null,0,null,0,null,0,null,0,null,0,null,0,null,0,null,0,null,0,null,0,null,0,null,0,null,0,null,0,null,0,null,0,null,0,null,0,null,0,null,0,null,0,null,0,null,0,null,0,null,0,null,0,null,0,null,0,null,0,null,0,null,0,null,0,null,0,null,0,null,0,null,0,null,0,null,0,null,0,null,0,null,0]
[null,null,null,{"$f":"HLOOKUP($C17,'Dados Gerais'!$D$5:$BK$10,6)","v":{"$error":"#N/A"}},{"$f":"HLOOKUP($C17,'Dados Gerais'!$D$5:$BK$14,10)","v":{"$error":"#N/A"}},null,null,null,null,null,null,null,null,null,null,null,0,null,0,null,0,null,0,null,0,null,0,null,0,null,0,null,0,null,0,null,0,null,0,null,0,null,0,null,0,null,0,null,0,null,0,null,0,null,0,null,0,null,0,null,0,null,0,null,0,null,0,null,0,null,0,null,0,null,0,null,0,null,0,null,0,null,0,null,0,null,0,null,0,null,0,null,0,null,0,null,0,null,0,null,0,null,0,null,0,null,0,null,0,null,0,null,0,null,0,null,0,null,0,null,0,null,0,null,0,null,0,null,0,null,0,null,0,null,0]
[null,null,null,{"$f":"HLOOKUP($C18,'Dados Gerais'!$D$5:$BK$10,6)","v":{"$error":"#N/A"}},{"$f":"HLOOKUP($C18,'Dados Gerais'!$D$5:$BK$14,10)","v":{"$error":"#N/A"}},null,null,null,null,null,null,null,null,null,null,null,0,null,0,null,0,null,0,null,0,null,0,null,0,null,0,null,0,null,0,null,0,null,0,null,0,null,0,null,0,null,0,null,0,null,0,null,0,null,0,null,0,null,0,null,0,null,0,null,0,null,0,null,0,null,0,null,0,null,0,null,0,null,0,null,0,null,0,null,0,null,0,null,0,null,0,null,0,null,0,null,0,null,0,null,0,null,0,null,0,null,0,null,0,null,0,null,0,null,0,null,0,null,0,null,0,null,0,null,0,null,0,null,0,null,0,null,0,null,0]
[null,null,null,{"$f":"HLOOKUP($C19,'Dados Gerais'!$D$5:$BK$10,6)","v":{"$error":"#N/A"}},{"$f":"HLOOKUP($C19,'Dados Gerais'!$D$5:$BK$14,10)","v":{"$error":"#N/A"}},null,null,null,null,null,null,null,null,null,null,null,0,null,0,null,0,null,0,null,0,null,0,null,0,null,0,null,0,null,0,null,0,null,0,null,0,null,0,null,0,null,0,null,0,null,0,null,0,null,0,null,0,null,0,null,0,null,0,null,0,null,0,null,0,null,0,null,0,null,0,null,0,null,0,null,0,null,0,null,0,null,0,null,0,null,0,null,0,null,0,null,0,null,0,null,0,null,0,null,0,null,0,null,0,null,0,null,0,null,0,null,0,null,0,null,0,null,0,null,0,null,0,null,0,null,0,null,0,null,0]
[null,null,null,{"$f":"HLOOKUP($C20,'Dados Gerais'!$D$5:$BK$10,6)","v":{"$error":"#N/A"}},{"$f":"HLOOKUP($C20,'Dados Gerais'!$D$5:$BK$14,10)","v":{"$error":"#N/A"}},null,null,null,null,null,null,null,null,null,null,null,0,null,0,null,0,null,0,null,0,null,0,null,0,null,0,null,0,null,0,null,0,null,0,null,0,null,0,null,0,null,0,null,0,null,0,null,0,null,0,null,0,null,0,null,0,null,0,null,0,null,0,null,0,null,0,null,0,null,0,null,0,null,0,null,0,null,0,null,0,null,0,null,0,null,0,null,0,null,0,null,0,null,0,null,0,null,0,null,0,null,0,null,0,null,0,null,0,null,0,null,0,null,0,null,0,null,0,null,0,null,0,null,0,null,0,null,0,null,0]
[null,null,null,{"$f":"HLOOKUP($C21,'Dados Gerais'!$D$5:$BK$10,6)","v":{"$error":"#N/A"}},{"$f":"HLOOKUP($C21,'Dados Gerais'!$D$5:$BK$14,10)","v":{"$error":"#N/A"}},null,null,null,null,null,null,null,null,null,null,null,0,null,0,null,0,null,0,null,0,null,0,null,0,null,0,null,0,null,0,null,0,null,0,null,0,null,0,null,0,null,0,null,0,null,0,null,0,null,0,null,0,null,0,null,0,null,0,null,0,null,0,null,0,null,0,null,0,null,0,null,0,null,0,null,0,null,0,null,0,null,0,null,0,null,0,null,0,null,0,null,0,null,0,null,0,null,0,null,0,null,0,null,0,null,0,null,0,null,0,null,0,null,0,null,0,null,0,null,0,null,0,null,0,null,0,null,0,null,0]
[null,null,null,null,null,null,null,null,null,null,null,null,null,null,null,null,0,null,0,null,0,null,0,null,0,null,0,null,0,null,0,null,0,null,0,null,0,null,0,null,0,null,0,null,0,null,0,null,0,null,0,null,0,null,0,null,0,null,0,null,0,null,0,null,0,null,0,null,0,null,0,null,0,null,0,null,0,null,0,null,0,null,0,null,0,null,0,null,0,null,0,null,0,null,0,null,0,null,0,null,0,null,0,null,0,null,0,null,0,null,0,null,0,null,0,null,0,null,0,null,0,null,0,null,0,null,0,null,0,null,0,null,0,null,0]
[]
[null,null,"PAGAMENTO DA DEPRECIAÇÃO"]
[null,null,"ITEM","DESCRIÇÃO","QUANT ANUAL","CONTA SIAFI","VALOR DE AQ.","% RESIDUAL","VIDA ÚTIL","DEP. MENSAL","CUSTO TOTAL","BDI (%)","PREÇO TOTAL","FONTE","REFERÊNCIA"]
[]
[null,null,null,null,null,"12311.01.09",89.34,0.1,10,{"$f":"G27*(1-H27)/(I27*12)","v":0.67005000000000003},{"$f":"J27*E27","v":0},{"$f":"BDI!$E$26","v":0.25509999999999999},{"$f":"ROUND(K27*(1+L27),2)","v":0},"COTAÇÃO"]
[null,null,null,null,null,"12311.01.09",39,0.1,10,{"$f":"G28*(1-H28)/(I28*12)","v":0.29250000000000004},{"$f":"J28*E28","v":0},{"$f":"BDI!$E$26","v":0.25509999999999999},{"$f":"ROUND(K28*(1+L28),2)","v":0},"COTAÇÃO"]
[null,null,null,null,null,"12311.01.09",22.08,0.1,10,0.1656,0,{"$f":"BDI!$E$26","v":0.25509999999999999},0,"COTAÇÃO"]
[null,null,null,null,null,"12311.01.09",8.02,0.1,10,6.0150000000000002E-2,0,{"$f":"BDI!$E$26","v":0.25509999999999999},0,"COTAÇÃO"]
[null,null,null,null,null,"12311.01.09",15.64,0.1,10,0.1173,0,{"$f":"BDI!$E$26","v":0.25509999999999999},0,"COTAÇÃO"]
[null,null,null,null,null,"12311.01.09",7.63,0.1,10,5.7224999999999998E-2,0,{"$f":"BDI!$E$26","v":0.25509999999999999},0,"COTAÇÃO"]
[null,null,null,null,null,"12311.01.09",21.48,0.1,10,0.16109999999999999,0,{"$f":"BDI!$E$26","v":0.25509999999999999},0,"COTAÇÃO"]
[null,null,null,null,null,"12311.01.09",7.87,0.1,10,5.9025000000000001E-2,0,{"$f":"BDI!$E$26","v":0.25509999999999999},0,"COTAÇÃO"]
[null,null,null,null,null,"12311.01.09",6.73,0.1,10,5.0475000000000006E-2,0,{"$f":"BDI!$E$26","v":0.25509999999999999},0,"COTAÇÃO"]
[null,null,null,null,null,"12311.01.09",15.35,0.1,10,0.11512499999999999,0,{"$f":"BDI!$E$26","v":0.25509999999999999},0,"COTAÇÃO"]
[null,null,null,null,null,"12311.01.09",12.86,0.1,10,9.6449999999999994E-2,0,{"$f":"BDI!$E$26","v":0.25509999999999999},0,"COTAÇÃO"]
[null,null,null,null,null,"12311.01.09",10.119999999999999,0.1,10,7.5899999999999995E-2,0,{"$f":"BDI!$E$26","v":0.25509999999999999},0,"COTAÇÃO"]
[null,null,null,null,null,"12311.01.09",61.31,0.1,10,0.45982500000000004,0,{"$f":"BDI!$E$26","v":0.25509999999999999},0,"COTAÇÃO"]
[null,null,null,null,null,"12311.01.09",40.409999999999997,0.1,10,0.30307499999999998,0,{"$f":"BDI!$E$26","v":0.25509999999999999},0,"COTAÇÃO"]
[null,null,null,null,null,"12311.01.09",120.53,0.1,10,0.90397500000000008,0,{"$f":"BDI!$E$26","v":0.25509999999999999},0,"COTAÇÃO"]
[null,null,null,null,null,"12311.01.09",31.48,0.1,10,0.2361,0,{"$f":"BDI!$E$26","v":0.25509999999999999},0,"COTAÇÃO"]
[null,null,null,null,null,"12311.01.09",191.93,0.1,10,1.4394750000000003,0,{"$f":"BDI!$E$26","v":0.25509999999999999},0,"COTAÇÃO"]
[null,null,null,null,null,"12311.01.09",92.78,0.1,10,0.69585000000000008,0,{"$f":"BDI!$E$26","v":0.25509999999999999},0,"COTAÇÃO"]
[null,null,null,null,null,"12311.01.09",36.01,0.1,10,0.27007500000000001,0,{"$f":"BDI!$E$26","v":0.25509999999999999},0,"COTAÇÃO"]
[null,null,null,null,null,"12311.01.09",16.579999999999998,0.1,10,0.12434999999999999,0,{"$f":"BDI!$E$26","v":0.25509999999999999},0,"COTAÇÃO"]
[null,null,null,null,null,"12311.01.09",57.93,0.1,10,0.434475,0,{"$f":"BDI!$E$26","v":0.25509999999999999},0,"COTAÇÃO"]
[null,null,null,null,null,"12311.01.09",47.81,0.1,10,0.35857500000000003,0,{"$f":"BDI!$E$26","v":0.25509999999999999},0,"COTAÇÃO"]
[null,null,null,null,null,"12311.01.09",31.18,0.1,10,0.23385,0,{"$f":"BDI!$E$26","v":0.25509999999999999},0,"COTAÇÃO"]
[null,null,null,null,null,"12311.01.09",23.95,0.1,10,0.17962500000000001,0,{"$f":"BDI!$E$26","v":0.25509999999999999},0,"COTAÇÃO"]
[null,null,null,null,null,"12311.01.09",35.04,0.1,10,0.26280000000000003,0,{"$f":"BDI!$E$26","v":0.25509999999999999},0,"COTAÇÃO"]
[null,null,null,null,null,"12311.01.09",200.31,0.1,10,1.5023249999999999,0,{"$f":"BDI!$E$26","v":0.25509999999999999},0,"COTAÇÃO"]
[null,null,null,null,null,"12311.01.09",79.59,0.1,10,0.59692500000000004,0,{"$f":"BDI!$E$26","v":0.25509999999999999},0,"COTAÇÃO"]
[null,null,null,null,null,"12311.01.09",227.75,0.1,10,1.7081249999999999,0,{"$f":"BDI!$E$26","v":0.25509999999999999},0,"COTAÇÃO"]
[null,null,null,null,null,"12311.01.09",127.59,0.1,10,0.95692500000000003,0,{"$f":"BDI!$E$26","v":0.25509999999999999},0,"COTAÇÃO"]
[]
[]
[null,null,"PAGAMENTO DA MANUTENÇÃO"]
[null,null,"ITEM","DESCRIÇÃO",null,null,null,"K (calculado)","MENSAL DEPR.","% MAN X DEP","MENSAL MAN.","BDI (%)","PREÇO TOTAL"]
[]
[null,null,null,null,null,null,null,{"$f":"H68","v":0.42411600000000005},{"$f":"SUM(M27:M55)","v":0},{"$f":"H61","v":0.42411600000000005},{"$f":"I61*H61","v":0},{"$f":"L27","v":0.25509999999999999},{"$f":"ROUND(K61*(1+L61),2)","v":0}]
[]
[null,null,null,null,"K1","K2","K3","K4"]
[null,null,null,null,0.85,1,0.8,1]
[null,null,null,null,"K5","K6","K7","K8"]
[null,null,null,null,1,0.6,0.5,1.1000000000000001]
[null,null,null,null,"K9","K10","K11","RESULTADO"]
[null,null,null,"* a descrição de cada coeficiente segue abaixo",1.5,0.9,1.4,{"$f":"E64*F64*G64*H64*E66*F66*G66*H66*E68*F68*G68","v":0.42411600000000005}]
[]
[]
[null,null,"MATERIAL DE CONSUMO ASSOCIADO"]
[null,null,"ITEM","DESCRIÇÃO",null,null,null,"QUANTID/ANO","UNIDADE","VALOR DE AQ.","MENSAL MAT","BDI (%)","PREÇO TOTAL"]
[]
[null,null,null,null,null,null,null,null,null,null,{"$f":"J74*H74/12","v":0},{"$f":"L61","v":0.25509999999999999},{"$f":"ROUND(K74*(1+L74),2)","v":0}]
[]
[]
[null,null,"MATERIAL DE CONSUMO ASSOCIADO"]
[null,null,"ITEM","DESCRIÇÃO",null,null,null,null,null,null,null,null,"PREÇO TOTAL"]
[]
[null,null,1,"Componente DEPRECIAÇÃO - POR POSTO",null,null,null,null,null,null,null,null,{"$f":"I61","v":0}]
[null,null,2,"Componente MANUTENÇÃO - POR POSTO",null,null,null,null,null,null,null,null,{"$f":"M61","v":0}]
[null,null,3,"Componente MATERIAL DE CONSUMO ASSOCIADO - POR POSTO",null,null,null,null,null,null,null,null,{"$f":"M74","v":0}]
[]
[null,null,null,null,null,null,null,null,null,null,null,"SOMATÓRIO TOTAL MENSAL - POR POSTO",{"$f":"SUM(M79:M83)","v":0},null,null,null,null,{"$f":"IF(SUM(Q$15:Q$22)>0,$M84,0)","v":0},null,{"$f":"IF(SUM(S$15:S$22)>0,$M84,0)","v":0},null,{"$f":"IF(SUM(U$15:U$22)>0,$M84,0)","v":0},null,{"$f":"IF(SUM(W$15:W$22)>0,$M84,0)","v":0},null,{"$f":"IF(SUM(Y$15:Y$22)>0,$M84,0)","v":0},null,{"$f":"IF(SUM(AA$15:AA$22)>0,$M84,0)","v":0},null,{"$f":"IF(SUM(AC$15:AC$22)>0,$M84,0)","v":0},null,{"$f":"IF(SUM(AE$15:AE$22)>0,$M84,0)","v":0},null,{"$f":"IF(SUM(AG$15:AG$22)>0,$M84,0)","v":0},null,{"$f":"IF(SUM(AI$15:AI$22)>0,$M84,0)","v":0},null,{"$f":"IF(SUM(AK$15:AK$22)>0,$M84,0)","v":0},null,{"$f":"IF(SUM(AM$15:AM$22)>0,$M84,0)","v":0},null,{"$f":"IF(SUM(AO$15:AO$22)>0,$M84,0)","v":0},null,{"$f":"IF(SUM(AQ$15:AQ$22)>0,$M84,0)","v":0},null,{"$f":"IF(SUM(AS$15:AS$22)>0,$M84,0)","v":0},null,{"$f":"IF(SUM(AU$15:AU$22)>0,$M84,0)","v":0},null,{"$f":"IF(SUM(AW$15:AW$22)>0,$M84,0)","v":0},null,{"$f":"IF(SUM(AY$15:AY$22)>0,$M84,0)","v":0},null,{"$f":"IF(SUM(BA$15:BA$22)>0,$M84,0)","v":0},null,{"$f":"IF(SUM(BC$15:BC$22)>0,$M84,0)","v":0},null,{"$f":"IF(SUM(BE$15:BE$22)>0,$M84,0)","v":0},null,{"$f":"IF(SUM(BG$15:BG$22)>0,$M84,0)","v":0},null,{"$f":"IF(SUM(BI$15:BI$22)>0,$M84,0)","v":0},null,{"$f":"IF(SUM(BK$15:BK$22)>0,$M84,0)","v":0},null,{"$f":"IF(SUM(BM$15:BM$22)>0,$M84,0)","v":0},null,{"$f":"IF(SUM(BO$15:BO$22)>0,$M84,0)","v":0},null,{"$f":"IF(SUM(BQ$15:BQ$22)>0,$M84,0)","v":0},null,{"$f":"IF(SUM(BS$15:BS$22)>0,$M84,0)","v":0},null,{"$f":"IF(SUM(BU$15:BU$22)>0,$M84,0)","v":0},null,{"$f":"IF(SUM(BW$15:BW$22)>0,$M84,0)","v":0},null,{"$f":"IF(SUM(BY$15:BY$22)>0,$M84,0)","v":0},null,{"$f":"IF(SUM(CA$15:CA$22)>0,$M84,0)","v":0},null,{"$f":"IF(SUM(CC$15:CC$22)>0,$M84,0)","v":0},null,{"$f":"IF(SUM(CE$15:CE$22)>0,$M84,0)","v":0},null,{"$f":"IF(SUM(CG$15:CG$22)>0,$M84,0)","v":0},null,{"$f":"IF(SUM(CI$15:CI$22)>0,$M84,0)","v":0},null,{"$f":"IF(SUM(CK$15:CK$22)>0,$M84,0)","v":0},null,{"$f":"IF(SUM(CM$15:CM$22)>0,$M84,0)","v":0},null,{"$f":"IF(SUM(CO$15:CO$22)>0,$M84,0)","v":0},null,{"$f":"IF(SUM(CQ$15:CQ$22)>0,$M84,0)","v":0},null,{"$f":"IF(SUM(CS$15:CS$22)>0,$M84,0)","v":0},null,{"$f":"IF(SUM(CU$15:CU$22)>0,$M84,0)","v":0},null,{"$f":"IF(SUM(CW$15:CW$22)>0,$M84,0)","v":0},null,{"$f":"IF(SUM(CY$15:CY$22)>0,$M84,0)","v":0},null,{"$f":"IF(SUM(DA$15:DA$22)>0,$M84,0)","v":0},null,{"$f":"IF(SUM(DC$15:DC$22)>0,$M84,0)","v":0},null,{"$f":"IF(SUM(DE$15:DE$22)>0,$M84,0)","v":0},null,{"$f":"IF(SUM(DG$15:DG$22)>0,$M84,0)","v":0},null,{"$f":"IF(SUM(DI$15:DI$22)>0,$M84,0)","v":0},null,{"$f":"IF(SUM(DK$15:DK$22)>0,$M84,0)","v":0},null,{"$f":"IF(SUM(DM$15:DM$22)>0,$M84,0)","v":0},null,{"$f":"IF(SUM(DO$15:DO$22)>0,$M84,0)","v":0},null,{"$f":"IF(SUM(DQ$15:DQ$22)>0,$M84,0)","v":0},null,{"$f":"IF(SUM(DS$15:DS$22)>0,$M84,0)","v":0},null,{"$f":"IF(SUM(DU$15:DU$22)>0,$M84,0)","v":0},null,{"$f":"IF(SUM(DW$15:DW$22)>0,$M84,0)","v":0},null,{"$f":"IF(SUM(DY$15:DY$22)>0,$M84,0)","v":0},null,{"$f":"IF(SUM(EA$15:EA$22)>0,$M84,0)","v":0},null,{"$f":"IF(SUM(EC$15:EC$22)>0,$M84,0)","v":0},null,{"$f":"IF(SUM(EE$15:EE$22)>0,$M84,0)","v":0}]
[null,null,null,null,null,null,null,null,null,null,null,"SOMATÓRIO TOTAL ANUAL - POR POSTO",{"$f":"M84*12","v":0}]
[]
[]
[null,null,"MATERIAL DE CONSUMO ASSOCIADO"]
[null,null,"MEMÓRIA DE CÁLCULO DO COEFICIENTE DE CORRELAÇÃO MANUTENÇÃO X DEPRECIAÇÃO (K)"]
[]
[null,null,"JUSTIFICATIVAS",null,"TIPO","K1",null,"Condições de Trab","K4",null,"Tempo Vida (anos)","K6",null,"Temperatura","K8"]
[null,null,null,null,"Guindaste",0.5,null,"Em espera",0.4,null,1,0.6,null,"Muito quente (> 40º C)",1.3]
[null,null,"K1","Considerado o valor médio de 0,85","Caminhão-comum",0.8,null,"Leves",0.8,null,2,0.7,null,"Quente (30º a 40º C)",1.1000000000000001]
[null,null,"K2","Considerado o operador médio","Fora-de-estrada",1,null,"Médias",1,null,3,0.8,null,"Médio (10º a 30º C)",1]
[null,null,"K3","Consideradas ferramentas de primeira qualidade","Carregadeira",1,null,"Pesadas",1.4,null,4,0.9,null,"Frio (< 10º C)",1.2]
[null,null,"K4","Há todo o tipo de trabalho, foi considerado o valor médio","Escavadeira",1.4,null,"Severas",2,null,5,1]
[null,null,"K5","Considerando manutenção normal","Motoescrêiper",1.1000000000000001,null,null,null,null,6,1,null,"Ritmo de Trabalho","K9"]
[null,null,"K6","Equipamentos novos","Trator de esteira",1.2,null,"Manutenção","K5",null,7,1,null,"Folgado",0.9]
[null,null,"K7","220h por mês, 252 dias por ano",null,null,null,"Excelente",0.6,null,8,1.2,null,"Médio ",1]
[null,null,"K8","Clima quente, acima de 30º C","Qualid do Operador","K2",null,"Boa",0.8,null,9,1.3,null,"Com pressa",1.5]
[null,null,"K9","Ritmo de trabalho usualmente com pressa","Excelente",0.8,null,"Média",1,null,10,1.4]
[null,null,"K10","Considerado o operador médio","Boa",0.9,null,"Ruim ",1.5,null,11,2,null,"Conh do Serviço","K10"]
[null,null,"K11","Foi considerada a opção de aluguel a terceiros, ainda que a simulação seja dos custos do contratado, contudo a execução dos serviços é em local de terceiros","Média",1,null,"Inexistente",3,null,15,2,null,"Grande ",0.8]
[null,null,null,null,"Ruim",1.2,null,null,null,null,null,null,null,"Médio     ",0.9]
[null,null,null,null,"Péssima",2,null,"Horas de Uso ","K7",6000,1,null,null,"Pouco ",1]
[null,null,null,null,null,null,null,1000,0.5,8000,1.3]
[null,null,null,null,"Qualidade do Equip","K3",null,2000,0.5,10000,1.6,null,null,"Tipo do Serviço","K11"]
[null,null,null,null,"De primeira",0.8,null,3000,0.6,12000,1.9,null,null,"Mina ou Pedreira",0.8]
[null,null,null,null,"Média",1,null,4000,0.7,15000,2.2999999999999998,null,null,"Construção Geral",1]
[null,null,null,null,"Ruim",1.5,null,5000,0.9,20000,3,null,null,"Aluguel a Terceiros",1.4]
[]
[null,null,null,null,"Fonte: "]
[null,null,null,null,"MATTOS, Aldo Dórea. Como preparar orçamentos de obras. São Paulo: Pini, 2006. 281 p., il"]

{"sheet":"SREP","index":24,"n_rows":74,"n_cols":15,"rows_kept":74,"cut":false,"hidden":true,"merged":[[1,1,1,3],[2,1,2,14]]}
[]
[]
[null,"SISTEMA DE REGISTRO ELETRÔNICO DE PRESENÇA - SREP"]
[]
[]
[null,null,"PAGAMENTO DA DEPRECIAÇÃO"]
[null,null,"ITEM","DESCRIÇÃO","QUANT ANUAL","CONTA SIAFI","VALOR DE AQ.","% RESIDUAL","VIDA ÚTIL","DEP. MENSAL","CUSTO TOTAL","BDI (%)","PREÇO TOTAL","FONTE","REFERÊNCIA"]
[]
[null,null,1,"Equipamento de Registro Eletrônico de Ponto, de parede, com teclado externo e leitor biométrico, em conformidade com a Portaria 1.510/2009 do MT",3,"12311.01.24\n(máquinas e equip\neletrônicos)",1661.4,0.1,10,{"$f":"G9*(1-H9)/(I9*12)","v":12.460500000000001},{"$f":"J9*E9","v":37.381500000000003},{"$f":"BDI!E26","v":0.25509999999999999},{"$f":"ROUND(K9*(1+L9),2)","v":46.92},"COTAÇÃO"]
[]
[]
[null,null,"PAGAMENTO DA MANUTENÇÃO"]
[null,null,"ITEM","DESCRIÇÃO",null,null,null,"K (calculado)","MENSAL DEPR.","% MAN X DEP","MENSAL MAN.","BDI (%)","PREÇO TOTAL"]
[]
[null,null,2,"Todos os itens",null,null,null,{"$f":"H22","v":1.9000396799999999},{"$f":"K9","v":37.381500000000003},{"$f":"H15","v":1.9000396799999999},{"$f":"I15*H15","v":71.026333297920004},{"$f":"L9","v":0.25509999999999999},{"$f":"ROUND(K15*(1+L15),2)","v":89.15}]
[]
[null,null,null,null,"K1","K2","K3","K4"]
[null,null,null,null,0.85,1,0.8,1.4]
[null,null,null,null,"K5","K6","K7","K8"]
[null,null,null,null,1,0.6,1.6,1.1000000000000001]
[null,null,null,null,"K9","K10","K11","RESULTADO"]
[null,null,null,"* a descrição de cada coeficiente segue abaixo",1.5,0.9,1.4,{"$f":"E18*F18*G18*H18*E20*F20*G20*H20*E22*F22*G22","v":1.9000396799999999}]
[]
[]
[null,null,"PAGAMENTO DO SOFTWARE"]
[null,null,"ITEM","DESCRIÇÃO",null,null,null,"QUANTIDADE","UNIDADE","VALOR DE AQ.","UNIT. MENSAL","BDI (%)","PREÇO TOTAL"]
[]
[null,null,3,"Software Ponto Secullum 4 - manutenção e suporte técnico com backup - Web Nuvem - Mensalidade 278 usuários",null,null,null,3,"Licença/mês",452.25,{"$f":"J28*H28","v":1356.75},{"$f":"L34","v":0.25509999999999999},{"$f":"ROUND(K28*(1+L28),2)","v":1702.86},"COTAÇÃO"]
[]
[]
[null,null,"MATERIAL DE CONSUMO ASSOCIADO"]
[null,null,"ITEM","DESCRIÇÃO",null,null,null,"QUANTID/ANO","UNIDADE","VALOR DE AQ.","MENSAL MAT","BDI (%)","PREÇO TOTAL"]
[]
[null,null,4,"Bobina térmica específica para o registrador eletrônico de ponto, com papel termossensível, superfície de impressão externa ao rolo, durabilidade de impressão mínima de 5 anos e comprimento mínimo de 300m","* estimado um gasto anual de 16 bobinas",null,null,{"$f":"ROUNDUP(90*4*22*12*0.05/300,0)","v":16},"Bobina",31.37,{"$f":"J34*H34/12","v":41.826666666666668},{"$f":"L15","v":0.25509999999999999},{"$f":"ROUND(K34*(1+L34),2)","v":52.5},"COTAÇÃO"]
[]
[]
[null,null,"MATERIAL DE CONSUMO ASSOCIADO"]
[null,null,"ITEM","DESCRIÇÃO",null,null,null,null,null,null,null,null,"PREÇO TOTAL"]
[]
[null,null,1,"Componente DEPRECIAÇÃO",null,null,null,null,null,null,null,null,{"$f":"M9","v":46.92}]
[null,null,2,"Componente MANUTENÇÃO",null,null,null,null,null,null,null,null,{"$f":"M15","v":89.15}]
[null,null,3,"Componente SOFTWARE",null,null,null,null,null,null,null,null,{"$f":"M28","v":1702.86}]
[null,null,4,"Componente MATERIAL DE CONSUMO ASSOCIADO",null,null,null,null,null,null,null,null,{"$f":"M34","v":52.5}]
[]
[null,null,null,null,null,null,null,null,null,null,null,"SOMATÓRIO TOTAL MENSAL",{"$f":"SUM(M39:M44)","v":1891.4299999999998}]
[null,null,null,null,null,null,null,null,null,null,null,"SOMATÓRIO TOTAL ANUAL",{"$f":"M45*12","v":22697.159999999996}]
[]
[]
[null,null,"MATERIAL DE CONSUMO ASSOCIADO"]
[null,null,"MEMÓRIA DE CÁLCULO DO COEFICIENTE DE CORRELAÇÃO MANUTENÇÃO X DEPRECIAÇÃO (K)"]
[]
[null,null,"JUSTIFICATIVAS",null,"TIPO","K1",null,"Condições de Trab","K4",null,"Tempo Vida (anos)","K6",null,"Temperatura","K8"]
[null,null,null,null,"Guindaste",0.5,null,"Em espera",0.4,null,1,0.6,null,"Muito quente (> 40º C)",1.3]
[null,null,"K1","Considerado o valor médio de 0,85","Caminhão-comum",0.8,null,"Leves",0.8,null,2,0.7,null,"Quente (30º a 40º C)",1.1000000000000001]
[null,null,"K2","Considerado o operador médio","Fora-de-estrada",1,null,"Médias",1,null,3,0.8,null,"Médio (10º a 30º C)",1]
[null,null,"K3","Consideradas ferramentas de primeira qualidade","Carregadeira",1,null,"Pesadas",1.4,null,4,0.9,null,"Frio (< 10º C)",1.2]
[null,null,"K4","Há todo o tipo de trabalho, foi considerado condições pesadas","Escavadeira",1.4,null,"Severas",2,null,5,1]
[null,null,"K5","Considerando manutenção normal","Motoescrêiper",1.1000000000000001,null,null,null,null,6,1,null,"Ritmo de Trabalho","K9"]
[null,null,"K6","Equipamentos novos","Trator de esteira",1.2,null,"Manutenção","K5",null,7,1,null,"Folgado",0.9]
[null,null,"K7","44h por dia, 252 dias por ano",null,null,null,"Excelente",0.6,null,8,1.2,null,"Médio ",1]
[null,null,"K8","Clima quente, acima de 30º C","Qualid do Operador","K2",null,"Boa",0.8,null,9,1.3,null,"Com pressa",1.5]
[null,null,"K9","Ritmo de trabalho usualmente com pressa","Excelente",0.8,null,"Média",1,null,10,1.4]
[null,null,"K10","Considerado o operador médio","Boa",0.9,null,"Ruim ",1.5,null,11,2,null,"Conh do Serviço","K10"]
[null,null,"K11","Foi considerada a opção de aluguel a terceiros, ainda que a simulação seja dos custos do contratado, contudo a execução dos serviços é em local de terceiros","Média",1,null,"Inexistente",3,null,15,2,null,"Grande ",0.8]
[null,null,null,null,"Ruim",1.2,null,null,null,null,null,null,null,"Médio     ",0.9]
[null,null,null,null,"Péssima",2,null,"Horas de Uso ","K7",6000,1,null,null,"Pouco ",1]
[null,null,null,null,null,null,null,1000,0.5,8000,1.3]
[null,null,null,null,"Qualidade do Equip","K3",null,2000,0.5,10000,1.6,null,null,"Tipo do Serviço","K11"]
[null,null,null,null,"De primeira",0.8,null,3000,0.6,12000,1.9,null,null,"Mina ou Pedreira",0.8]
[null,null,null,null,"Média",1,null,4000,0.7,15000,2.2999999999999998,null,null,"Construção Geral",1]
[null,null,null,null,"Ruim",1.5,null,5000,0.9,20000,3,null,null,"Aluguel a Terceiros",1.4]
[]
[null,null,null,null,"Fonte: "]
[null,null,null,null,"MATTOS, Aldo Dórea. Como preparar orçamentos de obras. São Paulo: Pini, 2006. 281 p., il"]

{"sheet":"Não Rel - EPI","index":25,"n_rows":20,"n_cols":15,"rows_kept":20,"cut":false,"hidden":false,"merged":[[2,1,2,4],[3,1,3,11]]}
[]
[]
[]
[null,"EPIS NÃO RELACIONADOS DIRETAMENTE A UM POSTO DE TRABALHO - AQUISIÇÃO"]
[]
[]
[null,null,null,"ITEM","DESCRIÇÃO","QUANT ANUAL","UNIDADE","CUSTO UNITÁRIO","CUSTO ANUAL","BDI (%)","PREÇO TOTAL","FONTE"]
[]
[null,null,null,1,"Cinto de segurança, tipo paraquedista, produzido em material sintético, com 2 pontos de ancoragem - Frontal e dorsal - ajuste nas pernas e cintura. Acompanhado de talabarte duplo (comprimento aproximado de 1,5m) e absorvedor de energia do mesmo fabricante do cinto. Ref.: Gulin",2,"UND",492.19,{"$f":"H9*F9","v":984.38},{"$f":"BDI!$E$26","v":0.25509999999999999},{"$f":"ROUND(I9*(1+J9),2)","v":1235.5},"COTAÇÃO"]
[null,null,null,2,"Rolo de fita de sinalização (zebrada), com listas amarela e preta intercaladas, rolo 180mx65mm.",10,"UND",10.53,105.3,{"$f":"BDI!$E$26","v":0.25509999999999999},132.16,"COTAÇÃO"]
[null,null,null,3,"Barreira totalmente confeccionada em material plástico (polietileno), composta por 6 módulos, que permite diversas formas de utilização, como uma barreira efetiva de isolamento, como um sinalizador, como um delimitador de áreas e em a sua estrutura modular resulta em um pequeno volume para ser guardada ou estocada. Dimensões (cm) 240 x 100 2 38 x 100 cm Peso (kg) 9 e 1,45 kg",3,"CONJ",1892.85,5678.5499999999993,{"$f":"BDI!$E$26","v":0.25509999999999999},7127.15,"COTAÇÃO"]
[null,null,null,4,"Luva de segurança confeccionada em vaqueta na palma e face palmar dos dedos, dorso e face dorsal dos dedos em raspa, reforço interno em vaqueta na palma, com cano longo em raspa (20 cm)",20,"PARES",25.98,519.6,{"$f":"BDI!$E$26","v":0.25509999999999999},652.15,"COTAÇÃO"]
[null,null,null,5,"Luvas em poliuretano, cor preta, acabamento liso, com forro em poliamida, sem costura, punho tricotado c/ elástico. Tamanhos P, M e G",40,"PARES",4.71,188.4,{"$f":"BDI!$E$26","v":0.25509999999999999},236.46,"COTAÇÃO"]
[null,null,null,6,"Respirador purificador de ar tipo, peça semifacial filtrante para partículas (PFF2), com formato dobrável, solda ultrassônica em todo o seu perímetro. Fita elástica branca fixada nas laterais externas do respirador, perfazendo uma alça na para fixação na parte superior da cabeça e a outra na parte inferior, para fixação na altura da nuca do usuário. A parte superior externa da peça possui tira de material metálico moldável, utilizada para ajuste no septo nasal. Na face lateral do respirador existe um dispositivo de material plástico, dotado internamente de uma válvula de exalação. DEVERÁ APRESENTAR O SELO DE APROVAÇÃO DO INMETRO. Ref. 3M\nObs: Enquanto durar a pandemia da Covid 19 as máscaras deverão ser fornecidas sem a válvula de exalação",40,"UND",3.71,148.4,{"$f":"BDI!$E$26","v":0.25509999999999999},186.26,"COTAÇÃO"]
[null,null,null,7,"Botina de segurança, fechamento em elástico, sem componentes metálicos, confeccionada em couro\ncurtido ao cromo, na cor preta, elásticos laterais, BIQUEIRA EM COMPOSITE ou POLIPROPILENO,\nsolado de poliuretano bidensidade injetado diretamente ao cabedal, solado com perfil antiderrapante e sistemas de absorção de impacto. Deverá possuir proteção contra risco de choques elétricos. Com selo conforto. Em conformidade com as Normas de segurança da ABNT NBR ISO 20344 e 20347.",2,"PARES",124.73,249.46,{"$f":"BDI!$E$26","v":0.25509999999999999},313.10000000000002,"COTAÇÃO"]
[null,null,null,8,"ÓCULOS DE SEGURANÇA SOBREPOR: Modelo ampla-visão INCOLOR constituído de armação confeccionada em uma única peça de plástico (policarbonato), sistema de ventilação indireta (superior e inferior) na armação, ajuste através de tirante elástico com regulagem de tamanho encaixado nas laterais do visor por meio de presilhas plásticas que permitem ajuste ao rosto do usuário.",10,"UND",22.23,{"$f":"H16*F16","v":222.3},{"$f":"BDI!$E$26","v":0.25509999999999999},{"$f":"ROUND(I16*(1+J16),2)","v":279.01},"COTAÇÃO"]
[null,null,null,9,"Corda de segurança semiestática 12 mm na cor branca, carga de ruptura 20 KN. Trançado triplo e alma central. Trançado externo em multi filamento de poliamida, trançado intermediário e alerta visual em\nmulti filamento de polipropileno, trançado interno em multi filamento de poliamida e alma central torcida em multi filamento de poliamida. Possui fita de identificação interna. Ref. ALTISEG",30,"metros",5.39,161.69999999999999,{"$f":"BDI!$E$26","v":0.25509999999999999},202.95,"COTAÇÃO"]
[]
[null,null,null,null,null,null,null,null,null,"SOMATÓRIO TOTAL MENSAL",{"$f":"K20/12","v":863.72833333333335}]
[null,null,null,null,null,null,null,null,null,"SOMATÓRIO TOTAL ANUAL",{"$f":"SUM(K8:K18)","v":10364.74},null,null,{"$f":"SUM($I$9:$I$17)","v":8258.09},"por ano sem bdi"]

{"sheet":"Não Rel - Depr","index":26,"n_rows":101,"n_cols":15,"rows_kept":101,"cut":false,"hidden":false,"merged":[[1,1,1,3],[2,1,2,14]]}
[]
[]
[null,"FERRAMENTAS NÃO RELACIONADAS DIRETAMENTE A UM POSTO DE TRABALHO - PAGAMENTO DA DEPRECIAÇÃO / MANUTENÇÃO"]
[]
[]
[null,null,"PAGAMENTO DA DEPRECIAÇÃO"]
[null,null,"ITEM","DESCRIÇÃO","QUANT ANUAL","CONTA SIAFI","VALOR DE AQ.","% RESIDUAL","VIDA ÚTIL","DEP. MENSAL","CUSTO TOTAL","BDI (%)","PREÇO TOTAL","FONTE","REFERÊNCIA"]
[]
[null,null,1,"GUIA PASSA FIO RESISTENTE DE AÇO",23,"12311.01.25",29.955000000000002,0.1,10,{"$f":"G9*(1-H9)/(I9*12)","v":0.22466250000000001},{"$f":"J9*E9","v":5.1672375000000006},{"$f":"BDI!$E$26","v":0.25509999999999999},{"$f":"ROUND(K9*(1+L9),2)","v":6.49},"COTAÇÃO"]
[null,null,2,"ALICATE UNIVERSAL 8",23,"12311.01.25",38.254999999999995,0.1,10,0.28691249999999996,6.5989874999999989,{"$f":"BDI!$E$26","v":0.25509999999999999},8.2799999999999994,"COTAÇÃO"]
[null,null,3,"ALICATE DE BICO MEIO-CANA LONGO COM CORTE “7.1/2”",23,"12311.01.25",74.715000000000003,0.1,10,0.5603625000000001,12.888337500000002,{"$f":"BDI!$E$26","v":0.25509999999999999},16.18,"COTAÇÃO"]
[null,null,4,"ALICATE DE CORTE DIAGONAL “6”",23,"12311.01.25",67.39,0.1,10,0.50542500000000001,11.624775,{"$f":"BDI!$E$26","v":0.25509999999999999},14.59,"COTAÇÃO"]
[null,null,5,"ALICATE DE CORTE DIAGONAL “4”",23,"12311.01.25",44.72,0.1,10,0.33539999999999998,7.7141999999999991,{"$f":"BDI!$E$26","v":0.25509999999999999},9.68,"COTAÇÃO"]
[null,null,6,"CHAVE DE FENDA “1/4.6”",23,"12311.01.25",14.4,0.1,10,0.10800000000000001,2.4840000000000004,{"$f":"BDI!$E$26","v":0.25509999999999999},3.12,"COTAÇÃO"]
[null,null,7,"CHAVE DE FENDA “1/8.3”",23,"12311.01.25",12.39,0.1,10,9.2925000000000008E-2,2.1372750000000003,{"$f":"BDI!$E$26","v":0.25509999999999999},2.68,"COTAÇÃO"]
[null,null,8,"CHAVE PHILLIPS “1/4.6”",23,"12311.01.25",18.664999999999999,0.1,10,0.13998750000000001,3.2197125000000004,{"$f":"BDI!$E$26","v":0.25509999999999999},4.04,"COTAÇÃO"]
[null,null,9,"CHAVE PHILLIPS “1/8.3”",23,"12311.01.25",10.355,0.1,10,7.7662500000000009E-2,1.7862375000000001,{"$f":"BDI!$E$26","v":0.25509999999999999},2.2400000000000002,"COTAÇÃO"]
[null,null,10,"TESTE DE LED UTP/RJ45",23,"12311.01.25",2554.5250000000001,0.1,10,19.1589375,440.65556250000003,{"$f":"BDI!$E$26","v":0.25509999999999999},553.07000000000005,"COTAÇÃO"]
[null,null,11,"ALICATE DE CRIMPAGEM RJ-45 PARA CABO DE CATEGORIA 5E 6 AMP",23,"12311.01.25",37.340000000000003,0.1,10,0.28005000000000002,6.4411500000000004,{"$f":"BDI!$E$26","v":0.25509999999999999},8.08,"COTAÇÃO"]
[null,null,12,"ALICATE DE CRIMPAGEM RJ-45 PARA CABO DE CATEGORIA 5E 6",23,"12311.01.25",71.05,0.1,10,{"$f":"G20*(1-H20)/(I20*12)","v":0.53287499999999999},{"$f":"J20*E20","v":12.256124999999999},{"$f":"BDI!$E$26","v":0.25509999999999999},{"$f":"ROUND(K20*(1+L20),2)","v":15.38},"COTAÇÃO"]
[null,null,13,"ALICATE DE CRIMPAGEM RÁPIDA PREMIUM - PARA TOMADAS AMP RJ45",23,"12311.01.25",683.42000000000007,0.1,10,5.1256500000000011,117.88995000000003,{"$f":"BDI!$E$26","v":0.25509999999999999},147.96,"COTAÇÃO"]
[null,null,14,"ALICATE DE CRIMPAGEM RÁPIDA\nPREMIUM - PARA TOMADAS FURUKAWA RJ-45",23,"12311.01.25",564.94499999999994,0.1,10,4.2370874999999995,97.453012499999986,{"$f":"BDI!$E$26","v":0.25509999999999999},122.31,"COTAÇÃO"]
[null,null,15,"ALICATE PUNCH DOWN (SOCO BAIXO)\nPARA 1 VIA",23,"12311.01.25",30.34,0.1,10,0.22755,5.2336499999999999,{"$f":"BDI!$E$26","v":0.25509999999999999},6.57,"COTAÇÃO"]
[null,null,16,"ALICATE PUNCH DOWN (SOCO BAIXO)\nPARA 8 VIAS",23,"12311.01.25",590.875,0.1,10,4.4315625000000001,101.9259375,{"$f":"BDI!$E$26","v":0.25509999999999999},127.93,"COTAÇÃO"]
[null,null,17,"DECAPADOR DE CABOS UTP",23,"12311.01.25",26.183333333333334,0.1,10,0.19637500000000002,4.5166250000000003,{"$f":"BDI!$E$26","v":0.25509999999999999},5.67,"COTAÇÃO"]
[null,null,18,"TESTE DE LED UTP/RJ45 (PROLAN 500 SPARTEC, IDEAL, MINIPA)",23,"12311.01.25",123.095,0.1,10,0.92321249999999999,21.233887500000002,{"$f":"BDI!$E$26","v":0.25509999999999999},26.65,"COTAÇÃO"]
[null,null,19,"ESTILETE COM LÂMINA 18MM",23,"12311.01.25",48.784999999999997,0.1,10,0.36588750000000003,8.4154125000000004,{"$f":"BDI!$E$26","v":0.25509999999999999},10.56,"COTAÇÃO"]
[null,null,20,"LANTERNA LED DE MÃO COM BATERIA RECARREGÁVEL",23,"12311.01.25",105.22,0.1,10,0.78915000000000002,18.150449999999999,{"$f":"BDI!$E$26","v":0.25509999999999999},22.78,"COTAÇÃO"]
[null,null,21,"MALA DE FERRAMENTAS",23,"12311.01.25",253.72500000000002,0.1,10,1.9029375000000002,43.767562500000004,{"$f":"BDI!$E$26","v":0.25509999999999999},54.93,"COTAÇÃO"]
[null,null,22,"POWER METER – MEDIDOR DE POTÊNCIA\nÓPTICA",23,"12311.01.25",311.56,0.1,10,2.3367,53.744100000000003,{"$f":"BDI!$E$26","v":0.25509999999999999},67.45,"COTAÇÃO"]
[null,null,23,"CANETA LASER PARA FIBRAS ÓPTICAS DE 10KM OU SUPERIOR  IDENTIFICADOR\nVISUAL DE FALHAS",23,"12311.01.25",103.98,0.1,10,0.77985000000000004,17.93655,{"$f":"BDI!$E$26","v":0.25509999999999999},22.51,"COTAÇÃO"]
[null,null,24,"KIT CANETAS PARA LIMPEZA FIBRA\nÓPTICA 2.3mm E 1.25mm",23,"12311.01.25",300.14499999999998,0.1,10,2.2510874999999997,51.775012499999995,{"$f":"BDI!$E$26","v":0.25509999999999999},64.98,"COTAÇÃO"]
[null,null,25,"PARAFUSADEIRA/FURADEIRA\nCapacidades:\nAço 13mm, Madeira 36mm, Concreto 13mm. Impactos por minuto: Alta 0 – 21.000, Baixa 0\n– 6.000 Rotações por minuto: Alta 0-1.400, Baixa 0 – 400 Torque máximo: J. Rígida / J.Flexível 42/24 N.m Dimensões (C x L x A)\n239 x 79 x 240mm Peso: 1.7kg Bateria: 18V",23,"12311.01.25",1247.3400000000001,0.1,10,9.3550500000000021,215.16615000000004,{"$f":"BDI!$E$26","v":0.25509999999999999},270.06,"COTAÇÃO"]
[null,null,26,"MULTÍMETRO DIGITAL MINIPA",23,"12311.01.25",100.44499999999999,0.1,10,0.75333749999999999,17.326762500000001,{"$f":"BDI!$E$26","v":0.25509999999999999},21.75,"COTAÇÃO"]
[null,null,27,"ESCADA COM 04 DEGRAUS MARCA(S)/MODELO(S) DE REFERÊNCIA:COGUMELO CARACTERÍSTICA(S): TIPO TESOURA, DUPLO ACESSO, COM 4 (QUATRO) DEGRAUS; USO PROFISSIONAL; DEGRAUS ESTRUTURADOS; COM TRAVA DE SEGURANÇA; PROTEÇÃO CONTRA AGARRAMENTO; CAPACIDADE MÍNIMA DE CARGA DE 120 KGF; A FABRICAÇÃO DEVERÁ RESPEITAR AS NORMAS DE SEGURANÇA; DEVERÁ POSSUIR RESISTÊNCIA A CORROSÃO QUÍMICA E NÃO PODERÁ CONDUZIR ELETRICIDADE. MATERIAL(IS): ESTRUTURA EM FIBRA DE VIDRO; PÉS EMBORRACHADOS.",5,"12311.01.25",732.98,0.1,10,{"$f":"G35*(1-H35)/(I35*12)","v":5.49735},{"$f":"J35*E35","v":27.486750000000001},{"$f":"BDI!$E$26","v":0.25509999999999999},{"$f":"ROUND(K35*(1+L35),2)","v":34.5},"COTAÇÃO"]
[null,null,28,"ESCADA COM 06 DEGRAUS MARCA(S)/MODELO(S) DE REFERÊNCIA: COGUMELO CARACTERÍSTICA(S): TIPO TESOURA, DUPLO ACESSO, COM 6 (SEIS) DEGRAUS; USO PROFISSIONAL; DEGRAUS ESTRUTURADOS; COM TRAVA DE SEGURANÇA; PROTEÇÃO CONTRA AGARRAMENTO; CAPACIDADE MÍNIMA DE CARGA DE 120 KGF; A FABRICAÇÃO DEVERÁ RESPEITAR AS NORMAS DE SEGURANÇA; DEVERÁ POSSUIR RESISTÊNCIA A CORROSÃO QUÍMICA E NÃO PODERÁ CONDUZIR ELETRICIDADE. MATERIAL(IS): ESTRUTURA EM FIBRA DE VIDRO; PÉS EMBORRACHADOS.",5,"12311.01.25",964.86,0.1,10,7.2364500000000005,36.182250000000003,{"$f":"BDI!$E$26","v":0.25509999999999999},45.41,"COTAÇÃO"]
[]
[]
[null,null,"PAGAMENTO DA MANUTENÇÃO"]
[null,null,"ITEM","DESCRIÇÃO",null,null,null,"K (calculado)","MENSAL DEPR.","% MAN X DEP","MENSAL MAN.","BDI (%)","PREÇO TOTAL"]
[]
[null,null,null,"Todos os itens",null,null,null,{"$f":"H49","v":0.38170440000000005},{"$f":"SUM(M9:M36)","v":1695.8500000000004},{"$f":"H42","v":0.38170440000000005},{"$f":"I42*H42","v":647.31340674000023},{"$f":"BDI!E26","v":0.25509999999999999},{"$f":"ROUND(K42*(1+L42),2)","v":812.44}]
[]
[null,null,null,null,"K1","K2","K3","K4"]
[null,null,null,null,0.85,0.9,0.8,1]
[null,null,null,null,"K5","K6","K7","K8"]
[null,null,null,null,1,0.6,0.5,1.1000000000000001]
[null,null,null,null,"K9","K10","K11","RESULTADO"]
[null,null,null,"* a descrição de cada coeficiente segue abaixo",1.5,0.9,1.4,{"$f":"E45*F45*G45*H45*E47*F47*G47*H47*E49*F49*G49","v":0.38170440000000005}]
[]
[]
[null,null,"MATERIAL DE CONSUMO ASSOCIADO"]
[null,null,"ITEM","DESCRIÇÃO",null,null,null,"QUANTID/ANO","UNIDADE","VALOR DE AQ.","MENSAL MAT","BDI (%)","PREÇO TOTAL"]
[]
[null,null,null,null,null,null,null,null,null,null,{"$f":"J55*H55/12","v":0},{"$f":"BDI!E26","v":0.25509999999999999},{"$f":"ROUND(K55*(1+L55),2)","v":0}]
[]
[]
[null,null,"MATERIAL DE CONSUMO ASSOCIADO"]
[null,null,"ITEM","DESCRIÇÃO",null,null,null,null,null,null,null,null,"PREÇO TOTAL"]
[]
[null,null,1,"Componente DEPRECIAÇÃO",null,null,null,null,null,null,null,null,{"$f":"I42","v":1695.8500000000004}]
[null,null,2,"Componente MANUTENÇÃO",null,null,null,null,null,null,null,null,{"$f":"M42","v":812.44}]
[null,null,3,"Componente MATERIAL DE CONSUMO ASSOCIADO",null,null,null,null,null,null,null,null,{"$f":"M55","v":0}]
[]
[null,null,null,null,null,null,null,null,null,null,null,"SOMATÓRIO TOTAL MENSAL",{"$f":"SUM(M60:M64)","v":2508.2900000000004}]
[null,null,null,null,null,null,null,null,null,null,null,"SOMATÓRIO TOTAL ANUAL",{"$f":"M65*12","v":30099.480000000003}]
[]
[]
[null,null,"MATERIAL DE CONSUMO ASSOCIADO"]
[null,null,"MEMÓRIA DE CÁLCULO DO COEFICIENTE DE CORRELAÇÃO MANUTENÇÃO X DEPRECIAÇÃO (K)"]
[]
[null,null,"JUSTIFICATIVAS",null,"TIPO","K1",null,"Condições de Trab","K4",null,"Tempo Vida (anos)","K6",null,"Temperatura","K8"]
[null,null,null,null,"Guindaste",0.5,null,"Em espera",0.4,null,1,0.6,null,"Muito quente (> 40º C)",1.3]
[null,null,"K1","Considerado o valor médio de 0,85","Caminhão-comum",0.8,null,"Leves",0.8,null,2,0.7,null,"Quente (30º a 40º C)",1.1000000000000001]
[null,null,"K2","Considerado o operador bom","Fora-de-estrada",1,null,"Médias",1,null,3,0.8,null,"Médio (10º a 30º C)",1]
[null,null,"K3","Consideradas ferramentas de primeira qualidade","Carregadeira",1,null,"Pesadas",1.4,null,4,0.9,null,"Frio (< 10º C)",1.2]
[null,null,"K4","Há todo o tipo de trabalho, foi considerado o valor médio","Escavadeira",1.4,null,"Severas",2,null,5,1]
[null,null,"K5","Considerando manutenção normal","Motoescrêiper",1.1000000000000001,null,null,null,null,6,1,null,"Ritmo de Trabalho","K9"]
[null,null,"K6","Equipamentos novos","Trator de esteira",1.2,null,"Manutenção","K5",null,7,1,null,"Folgado",0.9]
[null,null,"K7","220h por mês, 252 dias por ano",null,null,null,"Excelente",0.6,null,8,1.2,null,"Médio ",1]
[null,null,"K8","Clima quente, acima de 30º C","Qualid do Operador","K2",null,"Boa",0.8,null,9,1.3,null,"Com pressa",1.5]
[null,null,"K9","Ritmo de trabalho usualmente com pressa","Excelente",0.8,null,"Média",1,null,10,1.4]
[null,null,"K10","Considerado o operador médio","Boa",0.9,null,"Ruim ",1.5,null,11,2,null,"Conh do Serviço","K10"]
[null,null,"K11","Foi considerada a opção de aluguel a terceiros, ainda que a simulação seja dos custos do contratado, contudo a execução dos serviços é em local de terceiros","Média",1,null,"Inexistente",3,null,15,2,null,"Grande ",0.8]
[null,null,null,null,"Ruim",1.2,null,null,null,null,null,null,null,"Médio     ",0.9]
[null,null,null,null,"Péssima",2,null,"Horas de Uso ","K7",6000,1,null,null,"Pouco ",1]
[null,null,null,null,null,null,null,1000,0.5,8000,1.3]
[null,null,null,null,"Qualidade do Equip","K3",null,2000,0.5,10000,1.6,null,null,"Tipo do Serviço","K11"]
[null,null,null,null,"De primeira",0.8,null,3000,0.6,12000,1.9,null,null,"Mina ou Pedreira",0.8]
[null,null,null,null,"Média",1,null,4000,0.7,15000,2.2999999999999998,null,null,"Construção Geral",1]
[null,null,null,null,"Ruim",1.5,null,5000,0.9,20000,3,null,null,"Aluguel a Terceiros",1.4]
[]
[null,null,null,null,"Fonte: "]
[null,null,null,null,"MATTOS, Aldo Dórea. Como preparar orçamentos de obras. São Paulo: Pini, 2006. 281 p., il"]
[]
[]
[]
[]
[null,null,null,null,null,null,null,null,null,null,null,null,{"$f":"M66/M101","v":2.1947581862160883E-3}]
[]
[null,null,null,null,null,null,null,null,null,null,null,null,13714257.993903894]

{"sheet":"Uniformes - SOB DEMANDA","index":27,"n_rows":26,"n_cols":15,"rows_kept":26,"cut":false,"hidden":false,"merged":[[1,1,1,4],[2,1,2,11],[7,2,7,11]]}
[]
[]
[null,"UNIFORMES - AQUISIÇÃO SOB DEMANDA"]
[]
[]
[null,null,null,"ITEM","DESCRIÇÃO","QUANT ANUAL","UNIDADE","CUSTO UNITÁRIO","CUSTO ANUAL","BDI (%)","PREÇO TOTAL","FONTE"]
[]
[null,null,"ANALISTA DE INFRAESTRUTURA DE TI SÊNIOR E MASTER"]
[null,null,null,1,"Terno preto modelo Slim em tecido risca de giz (Blazer e calça social e/ou saia social na altura do joelho)",4,"UND",{"$f":"(324.9+381.6)/2","v":353.25},{"$f":"H9*F9","v":1413},{"$f":"BDI!$E$26","v":0.25509999999999999},{"$f":"ROUND(I9*(1+J9),2)","v":1773.46},"COTAÇÃO"]
[null,null,null,2,"Camisa azul, 40% algodão, 60% poliéster",12,"UND",104.97,{"$f":"H10*F10","v":1259.6399999999999},{"$f":"BDI!$E$26","v":0.25509999999999999},1580.97,"COTAÇÃO"]
[null,null,null,3,"Sapato social preto",4,"UND",106.23,424.92,{"$f":"BDI!$E$26","v":0.25509999999999999},533.32000000000005,"COTAÇÃO"]
[null,null,null,4,"Meia social cor preta para os homens e meia calça cor preta fio 40 para as mulheres",12,"UND",{"$f":"(27.71+13.65)/2","v":20.68},248.16,{"$f":"BDI!$E$26","v":0.25509999999999999},311.47000000000003,"COTAÇÃO"]
[null,null,null,5,"Cinto preto",4,"UND",44.33,177.32,{"$f":"BDI!$E$26","v":0.25509999999999999},222.55,"COTAÇÃO"]
[null,null,null,6,"Gravata com zíper listrada com tonalidades em azul",8,"UND",37.450000000000003,299.60000000000002,{"$f":"BDI!$E$26","v":0.25509999999999999},376.03,"COTAÇÃO"]
[]
[]
[null,null,null,null,null,null,null,null,null,"SOMATÓRIO TOTAL MENSAL",{"$f":"K18/12","v":399.81666666666666}]
[null,null,null,null,null,null,null,null,null,"SOMATÓRIO TOTAL ANUAL",{"$f":"SUM(K7:K16)","v":4797.8},null,null,{"$f":"SUM($I$9:$I$15)","v":3822.64},"por ano sem bdi"]
[]
[]
[]
[null,null,null,null,null,null,null,null,null,null,{"$f":"K18/K24","v":3.4984029045776035E-4}]
[null,null,null,null,null,{"$f":"#REF!/18","v":{"$error":"#REF!"}}]
[null,null,null,null,null,{"$f":"#REF!/18","v":{"$error":"#REF!"}},null,null,null,null,13714257.993903894]
[null,null,null,null,null,{"$f":"#REF!/18","v":{"$error":"#REF!"}}]
[null,null,null,null,null,{"$f":"#REF!/18","v":{"$error":"#REF!"}}]

{"sheet":"Not. Demanda","index":28,"n_rows":49,"n_cols":8,"rows_kept":49,"cut":false,"hidden":false,"merged":[[1,1,1,3],[2,1,2,7]]}
[]
[]
[null,"ADICIONAL NOTURNO SOB DEMANDA"]
[]
[]
[null,null,"CATEGORIAS",null,null,null,"HORAS / MÊS","% NOTURNA"]
[]
[null,null,11,{"$f":"HLOOKUP($C8,'Dados Gerais'!$D$5:$BK$10,6)","v":"ANALISTA DE INFRAESTRUTURA DE TI MASTER"},null,null,60,0.2]
[null,null,12,{"$f":"HLOOKUP($C9,'Dados Gerais'!$D$5:$BK$10,6)","v":"SUPERVISOR TÉCNICO"},null,null,30,0.2]
[]
[]
[null,null,"AJUSTE DE HORAS FICTAS",null,"AJUSTE H.NOT","HORA NORMAL","H.FICTAS/MÊS","H.ÚTEIS/MÊS"]
[]
[null,null,11,{"$f":"HLOOKUP($C14,'Dados Gerais'!$D$5:$BK$10,6)","v":"ANALISTA DE INFRAESTRUTURA DE TI MASTER"},52.5,60,{"$f":"G8*(F14/E14)","v":68.571428571428569},{"$f":"HLOOKUP(C14,'Dados Gerais'!$D$5:$P$16,12,0)","v":220}]
[null,null,12,{"$f":"HLOOKUP($C15,'Dados Gerais'!$D$5:$BK$10,6)","v":"SUPERVISOR TÉCNICO"},52.5,60,{"$f":"G9*(F15/E15)","v":34.285714285714285},{"$f":"HLOOKUP(C15,'Dados Gerais'!$D$5:$P$16,12,0)","v":220}]
[]
[]
[null,null,"VALOR DO ADICIONAL NOTURNO",null,null,"SALÁRIO MÊS","VL.H.NORMAL","ADIC.H.FICTAS"]
[]
[null,null,11,{"$f":"HLOOKUP($C20,'Dados Gerais'!$D$5:$BK$10,6)","v":"ANALISTA DE INFRAESTRUTURA DE TI MASTER"},null,{"$f":"HLOOKUP(C20,'Dados Gerais'!$D$5:$P$12,8,0)","v":10366.92},{"$f":"F20/H14","v":47.122363636363637},{"$f":"G20*(H8)","v":9.4244727272727271}]
[null,null,12,{"$f":"HLOOKUP($C21,'Dados Gerais'!$D$5:$BK$10,6)","v":"SUPERVISOR TÉCNICO"},null,{"$f":"HLOOKUP(C21,'Dados Gerais'!$D$5:$P$12,8,0)","v":13944.34},{"$f":"F21/H15","v":63.38336363636364},{"$f":"G21*(H9)","v":12.676672727272729}]
[]
[]
[null,null,"RESUMO DO ADICIONAL NOTURNO SOB DEMANDA"]
[null,null,"TOTAIS MENSAIS",null,null,null,"PREÇO MENSAL"]
[]
[null,null,11,{"$f":"HLOOKUP($C27,'Dados Gerais'!$D$5:$BK$10,6)","v":"ANALISTA DE INFRAESTRUTURA DE TI MASTER"},null,null,{"$f":"H20*G14","v":646.24955844155841}]
[null,null,12,{"$f":"HLOOKUP($C28,'Dados Gerais'!$D$5:$BK$10,6)","v":"SUPERVISOR TÉCNICO"},null,null,{"$f":"H21*G15","v":434.62877922077928}]
[]
[null,null,null,null,null,"SOMATÓRIO TOTAL MENSAL",{"$f":"SUM(G27:G28)","v":1080.8783376623378}]
[null,null,null,null,null,"SOMATÓRIO TOTAL ANUAL",{"$f":"G30*12","v":12970.540051948054}]
[]
[]
[null,null,"ENCARGOS SOCIAIS E BDI SOBRE ADICIONAL NOTURNO SOB DEMANDA"]
[null,null,"TOTAIS MENSAIS",null,null,"PERCENTUAIS","PREÇO MENSAL"]
[]
[null,null,null,"ENCARGOS SOCIAIS",null,{"$f":"'Encargos Sociais'!$E$45","v":0.71419999999999995},{"$f":"F37*G30","v":771.9633087584416}]
[null,null,null,"BDI",null,{"$f":"BDI!$E$26","v":0.25509999999999999},{"$f":"F38*(G30+G37)","v":472.65990400194079}]
[]
[null,null,null,null,null,"SOMATÓRIO TOTAL MENSAL",{"$f":"SUM(G37:G39)","v":1244.6232127603823}]
[null,null,null,null,null,"SOMATÓRIO TOTAL ANUAL",{"$f":"G40*12","v":14935.478553124587}]
[]
[]
[null,null,"VALOR TOTAL ADICIONAL NOTURNO SOB DEMANDA (COM ENCARGOS SOCIAIS E BDI INCLUSOS)"]
[]
[]
[]
[null,null,null,null,null,"SOMATÓRIO TOTAL MENSAL",{"$f":"G30+G40","v":2325.5015504227204}]
[null,null,null,null,null,"SOMATÓRIO TOTAL ANUAL",{"$f":"G48*12","v":27906.018605072644}]

{"sheet":"SOBREAVISO","index":29,"n_rows":43,"n_cols":10,"rows_kept":43,"cut":false,"hidden":false,"merged":[[1,1,1,3],[2,1,2,7]]}
[]
[]
[null,"HORAS DE SOBREAVISO SOB DEMANDA"]
[]
[]
[null,null,"CATEGORIAS",null,null,null,"HORAS / MÊS","% NOTURNA"]
[]
[null,null,11,{"$f":"HLOOKUP($C8,'Dados Gerais'!$D$5:$BK$10,6)","v":"ANALISTA DE INFRAESTRUTURA DE TI MASTER"},null,null,1195,{"$f":"1/3","v":0.33333333333333331}]
[null,null,12,{"$f":"HLOOKUP($C9,'Dados Gerais'!$D$5:$BK$10,6)","v":"SUPERVISOR TÉCNICO"},null,null,220,{"$f":"H8","v":0.33333333333333331}]
[]
[]
[null,null,"VALOR DO SOBREAVISO",null,null,"SALÁRIO MÊS","VL.H.NORMAL","ADIC.H.FICTAS"]
[]
[null,null,11,{"$f":"HLOOKUP($C14,'Dados Gerais'!$D$5:$BK$10,6)","v":"ANALISTA DE INFRAESTRUTURA DE TI MASTER"},null,{"$f":"HLOOKUP(C14,'Dados Gerais'!$D$5:$P$12,8,0)","v":10366.92},{"$f":"F14/220","v":47.122363636363637},{"$f":"G14*(H8)","v":15.707454545454546},null,{"$f":"G14/3","v":15.707454545454546}]
[null,null,12,{"$f":"HLOOKUP($C15,'Dados Gerais'!$D$5:$BK$10,6)","v":"SUPERVISOR TÉCNICO"},null,{"$f":"HLOOKUP(C15,'Dados Gerais'!$D$5:$P$12,8,0)","v":13944.34},{"$f":"F15/220","v":63.38336363636364},{"$f":"G15*(H9)","v":21.127787878787878},null,{"$f":"G15/3","v":21.127787878787881}]
[]
[]
[null,null,"RESUMO DO SOBREAVISO SOB DEMANDA"]
[null,null,"TOTAIS MENSAIS",null,null,null,"PREÇO MENSAL"]
[]
[null,null,11,{"$f":"HLOOKUP($C21,'Dados Gerais'!$D$5:$BK$10,6)","v":"ANALISTA DE INFRAESTRUTURA DE TI MASTER"},null,null,{"$f":"H14*G8","v":18770.408181818184}]
[null,null,12,{"$f":"HLOOKUP($C22,'Dados Gerais'!$D$5:$BK$10,6)","v":"SUPERVISOR TÉCNICO"},null,null,{"$f":"H15*G9","v":4648.1133333333328}]
[]
[null,null,null,null,null,"SOMATÓRIO TOTAL MENSAL",{"$f":"SUM(G21:G22)","v":23418.521515151515}]
[null,null,null,null,null,"SOMATÓRIO TOTAL ANUAL",{"$f":"G24*12","v":281022.25818181818}]
[]
[]
[null,null,"ENCARGOS SOCIAIS E BDI SOBRE SOBREAVISO SOB DEMANDA"]
[null,null,"TOTAIS MENSAIS",null,null,"PERCENTUAIS","PREÇO MENSAL"]
[]
[null,null,null,"ENCARGOS SOCIAIS",null,{"$f":"'Encargos Sociais'!$E$45","v":0.71419999999999995},{"$f":"F31*G24","v":16725.508066121212}]
[null,null,null,"BDI",null,{"$f":"BDI!$E$26","v":0.25509999999999999},{"$f":"F32*(G24+G31)","v":10240.741946182672}]
[]
[null,null,null,null,null,"SOMATÓRIO TOTAL MENSAL",{"$f":"SUM(G31:G33)","v":26966.250012303884}]
[null,null,null,null,null,"SOMATÓRIO TOTAL ANUAL",{"$f":"G34*12","v":323595.00014764664}]
[]
[]
[null,null,"VALOR TOTAL SOBREAVISO SOB DEMANDA (COM ENCARGOS SOCIAIS E BDI INCLUSOS)"]
[]
[]
[]
[null,null,null,null,null,"SOMATÓRIO TOTAL MENSAL",{"$f":"G24+G34","v":50384.771527455399}]
[null,null,null,null,null,"SOMATÓRIO TOTAL ANUAL",{"$f":"G42*12","v":604617.25832946482}]

{"sheet":"plano de saúde","index":30,"n_rows":37,"n_cols":2,"rows_kept":37,"cut":false,"hidden":true,"merged":[]}
[]
[null,532.86]
[null,418.82]
[null,299.69]
[null,224.33]
[null,223.17]
[null,214.69]
[null,214.69]
[null,204.16]
[null,200.74]
[null,200.74]
[null,199.9]
[null,198.02]
[null,197.14]
[null,190.91]
[null,188.95]
[null,181]
[null,176.05]
[null,175.8]
[null,168.95]
[null,168.81]
[null,161.76]
[null,160.47999999999999]
[null,158.80000000000001]
[null,157.71]
[null,156.71]
[null,156.71]
[null,156.69999999999999]
[null,153.63999999999999]
[null,150]
[null,149.43]
[null,148.82]
[null,138.15]
[null,117.37]
[null,98]
[null,97.45]
["média",{"$f":"AVERAGE(B2:B36)","v":192.60428571428568}]

{"sheet":"Horas extras_Demanda","index":31,"n_rows":77,"n_cols":8,"rows_kept":77,"cut":false,"hidden":true,"merged":[[6,3,7,7],[9,1,9,3],[10,1,10,7],[38,2,38,3]]}
[null,null,"CÂMARA DOS DEPUTADOS"]
[null,null,"DEPARTAMENTO TÉCNICO"]
[null,null,"Coordenação de Planejamento e Gestão"]
[]
[null,null,"Data:",{"$f":"'Dados Gerais'!#REF!","v":{"$error":"#REF!"}}]
[null,null,"Processo:",{"$f":"'Dados Gerais'!#REF!","v":{"$error":"#REF!"}}]
[null,null,"Objeto:",{"$f":"'Dados Gerais'!#REF!","v":{"$error":"#REF!"}}]
[]
[]
[]
[null,"HORAS EXTRAORDINÁRIAS SOB DEMANDA"]
[]
[]
[null,null,"CATEGORIAS (HORAS EXTRAS EM DIAS COMUNS E SÁBADOS)",null,null,null,"HORAS / MÊS","% HORA EXTRA"]
[]
[null,null,11,{"$f":"HLOOKUP($C16,'Dados Gerais'!$D$5:$BK$10,6)","v":"ANALISTA DE INFRAESTRUTURA DE TI MASTER"},null,null,null,1.5]
[null,null,12,{"$f":"HLOOKUP($C17,'Dados Gerais'!$D$5:$BK$10,6)","v":"SUPERVISOR TÉCNICO"},null,null,null,1.5]
[]
[]
[null,null,"VALOR DA HORA EXTRA (DIAS COMUNS E SÁBADOS)",null,"SALÁRIO MÊS","H.ÚTEIS/MÊS","VL.H.NORMAL","VL.H.EXTRA"]
[]
[null,null,11,{"$f":"HLOOKUP($C22,'Dados Gerais'!$D$5:$BK$10,6)","v":"ANALISTA DE INFRAESTRUTURA DE TI MASTER"},{"$f":"HLOOKUP($C22,'Dados Gerais'!$D$5:$P$12,8,0)","v":10366.92},{"$f":"HLOOKUP(C22,'Dados Gerais'!$D$5:$P$16,12,0)","v":220},{"$f":"E22/F22","v":47.122363636363637},{"$f":"G22*(H16)","v":70.683545454545452}]
[null,null,12,{"$f":"HLOOKUP($C23,'Dados Gerais'!$D$5:$BK$10,6)","v":"SUPERVISOR TÉCNICO"},{"$f":"HLOOKUP($C23,'Dados Gerais'!$D$5:$P$12,8,0)","v":13944.34},{"$f":"HLOOKUP(C23,'Dados Gerais'!$D$5:$P$16,12,0)","v":220},{"$f":"E23/F23","v":63.38336363636364},{"$f":"G23*(H17)","v":95.07504545454546}]
[]
[]
[null,null,"CATEGORIAS (HORAS EXTRAS EM DOMINGOS E FERIADOS)",null,null,null,"HORAS / MÊS","% HORA EXTRA"]
[]
[null,null,11,{"$f":"HLOOKUP($C28,'Dados Gerais'!$D$5:$BK$10,6)","v":"ANALISTA DE INFRAESTRUTURA DE TI MASTER"},null,null,null,2]
[null,null,12,{"$f":"HLOOKUP($C29,'Dados Gerais'!$D$5:$BK$10,6)","v":"SUPERVISOR TÉCNICO"},null,null,null,2]
[]
[]
[null,null,"VALOR DA HORA EXTRA (DOMINGOS E FERIADOS)",null,"SALÁRIO MÊS","H.ÚTEIS/MÊS","VL.H.NORMAL","VL.H.EXTRA"]
[]
[null,null,11,{"$f":"HLOOKUP($C34,'Dados Gerais'!$D$5:$BK$10,6)","v":"ANALISTA DE INFRAESTRUTURA DE TI MASTER"},{"$f":"HLOOKUP($C34,'Dados Gerais'!$D$5:$P$12,8,0)","v":10366.92},{"$f":"HLOOKUP(C34,'Dados Gerais'!$D$5:$P$16,12,0)","v":220},{"$f":"E34/F34","v":47.122363636363637},{"$f":"G34*(H28)","v":94.244727272727275}]
[null,null,12,{"$f":"HLOOKUP($C35,'Dados Gerais'!$D$5:$BK$10,6)","v":"SUPERVISOR TÉCNICO"},{"$f":"HLOOKUP($C35,'Dados Gerais'!$D$5:$P$12,8,0)","v":13944.34},{"$f":"HLOOKUP(C35,'Dados Gerais'!$D$5:$P$16,12,0)","v":220},{"$f":"E35/F35","v":63.38336363636364},{"$f":"G35*(H29)","v":126.76672727272728}]
[]
[]
[null,null,"RESUMO DO ADICIONAL DE HORA EXTRA"]
[null,null,"TOTAIS MENSAIS",null,"DIAS COMUNS E SÁBADOS","DOMINGOS E FERIADO","PREÇO MENSAL"]
[]
[null,null,11,{"$f":"HLOOKUP($C41,'Dados Gerais'!$D$5:$BK$10,6)","v":"ANALISTA DE INFRAESTRUTURA DE TI MASTER"},{"$f":"$G$16*$H$22","v":0},{"$f":"$H$34*$G$28","v":0},{"$f":"F41+E41","v":0}]
[null,null,12,{"$f":"HLOOKUP($C42,'Dados Gerais'!$D$5:$BK$10,6)","v":"SUPERVISOR TÉCNICO"},{"$f":"$G$17*$H$23","v":0},{"$f":"$H$35*$G$29","v":0},{"$f":"F42+E42","v":0}]
[]
[null,null,null,null,null,"SOMATÓRIO TOTAL MENSAL",{"$f":"SUM(G41:G42)","v":0}]
[null,null,null,null,null,"SOMATÓRIO TOTAL ANUAL",{"$f":"G44*12","v":0}]
[]
[]
[null,null,"VALOR DO AUXÍLIO TRANSPORTE (HORA EXTRA)",null,"QTDE PESSOAS","DIAS","VL.AUX.TRANS.","VL.MENSAL"]
[]
[null,null,11,{"$f":"HLOOKUP($C50,'Dados Gerais'!$D$5:$BK$10,6)","v":"ANALISTA DE INFRAESTRUTURA DE TI MASTER"},6,2,{"$f":"HLOOKUP($C$50,'Dados Gerais'!$D$5:$O$86,82,FALSE)/HLOOKUP($C$50,'Dados Gerais'!$D$5:$O$17,13,FALSE)","v":0},{"$f":"E50*F50*2*G50","v":0}]
[null,null,12,{"$f":"HLOOKUP($C51,'Dados Gerais'!$D$5:$BK$10,6)","v":"SUPERVISOR TÉCNICO"},3,2,{"$f":"HLOOKUP($C$51,'Dados Gerais'!$D$5:$O$86,82,FALSE)/HLOOKUP($C$51,'Dados Gerais'!$D$5:$O$17,13,FALSE)","v":0},{"$f":"E51*F51*2*G51","v":0}]
[]
[]
[null,null,"VALOR DO AUXÍLIO ALIMENTAÇÃO (HORA EXTRA)",null,"QTDE PESSOAS","DIAS","VL.AUX.ALIM.","VL.MENSAL"]
[]
[null,null,11,{"$f":"HLOOKUP($C56,'Dados Gerais'!$D$5:$BK$10,6)","v":"ANALISTA DE INFRAESTRUTURA DE TI MASTER"},6,{"$f":"F50","v":2},null,{"$f":"E56*F56*G56","v":0}]
[null,null,12,{"$f":"HLOOKUP($C57,'Dados Gerais'!$D$5:$BK$10,6)","v":"SUPERVISOR TÉCNICO"},3,{"$f":"F51","v":2},null,{"$f":"E57*F57*G57","v":0}]
[]
[]
[null,null,"ENCARGOS SOCIAIS AUXÍLIOS TRANSPORTE E ALIMENTAÇÃO E BDI SOBRE HORA EXTRA"]
[null,null,"TOTAIS MENSAIS",null,null,"PERCENTUAIS","PREÇO MENSAL"]
[]
[null,null,null,"ENCARGOS SOCIAIS",null,{"$f":"'Encargos Sociais'!$E$45","v":0.71419999999999995},{"$f":"F63*G44","v":0}]
[null,null,null,"AUXÍLIO TRANSPORTE",null,null,{"$f":"$H$50+$H$51","v":0}]
[null,null,null,"AUXÍLIO ALIMENTAÇÃO",null,null,{"$f":"$H$56+$H$57","v":0}]
[null,null,null,"BDI",null,{"$f":"BDI!$E$26","v":0.25509999999999999},{"$f":"F66*(G44+G63+G64+G65)","v":0}]
[]
[null,null,null,null,null,"SOMATÓRIO TOTAL MENSAL",{"$f":"SUM(G63:G67)","v":0}]
[null,null,null,null,null,"SOMATÓRIO TOTAL ANUAL",{"$f":"G68*12","v":0}]
[]
[]
[null,null,"VALOR TOTAL ADICIONAL HORA EXTRA SOB DEMANDA"]
[]
[]
[]
[null,null,null,null,null,"SOMATÓRIO TOTAL MENSAL",{"$f":"G44+G68","v":0}]
[null,null,null,null,null,"SOMATÓRIO TOTAL ANUAL",{"$f":"G76*12","v":0}]

{"sheet":"Não Rel - Mat Consumo","index":32,"n_rows":57,"n_cols":14,"rows_kept":57,"cut":false,"hidden":true,"merged":[[9,1,9,4],[10,1,10,13]]}
[null,null,"CÂMARA DOS DEPUTADOS"]
[null,null,"DEPARTAMENTO TÉCNICO"]
[null,null,"Coordenação de Planejamento e Gestão"]
[]
[null,null,"Data:",{"$f":"'Dados Gerais'!#REF!","v":{"$error":"#REF!"}}]
[null,null,"Processo:",{"$f":"'Dados Gerais'!#REF!","v":{"$error":"#REF!"}}]
[null,null,"Objeto:",{"$f":"'Dados Gerais'!#REF!","v":{"$error":"#REF!"}}]
[]
[]
[]
[null,"MATERIAIS NÃO RELACIONADOS DIRETAMENTE A UM POSTO DE TRABALHO - AQUISIÇÃO SOB DEMANDA"]
[]
[]
[null,null,"ITEM","CÓDIGO","DESCRIÇÃO","QUANT MENSAL","QUANT ANUAL","UNIDADE","CUSTO UNITÁRIO","CUSTO TOTAL","BDI (%)","PREÇO TOTAL","FONTE","REFERÊNCIA"]
[]
[null,null,1,null,null,null,null,null,null,{"$f":"I16*G16","v":0},{"$f":"BDI!E26","v":0.25509999999999999},{"$f":"ROUND(J16*(1+K16),2)","v":0},"Cotação"]
[null,null,2,null,null,null,null,null,null,{"$f":"I17*G17","v":0},{"$f":"K16","v":0.25509999999999999},{"$f":"ROUND(J17*(1+K17),2)","v":0},"Cotação"]
[null,null,3,null,null,null,null,null,null,0,{"$f":"K17","v":0.25509999999999999},0,"Cotação"]
[null,null,4,null,null,null,null,null,null,0,0.25509999999999999,0,"Cotação"]
[null,null,5,null,null,null,null,null,null,0,0.25509999999999999,0,"Cotação"]
[null,null,6,null,null,null,null,null,null,0,0.25509999999999999,0,"Cotação"]
[null,null,7,null,null,null,null,null,null,0,0.25509999999999999,0,"Cotação"]
[null,null,8,null,null,null,null,null,null,0,0.25509999999999999,0,"Cotação"]
[null,null,9,null,null,null,null,null,null,0,0.25509999999999999,0,"Cotação"]
[null,null,10,null,null,null,null,null,null,0,0.25509999999999999,0,"Cotação"]
[null,null,11,null,null,null,null,null,null,0,0.25509999999999999,0,"Cotação"]
[null,null,12,null,null,null,null,null,null,0,0.25509999999999999,0,"Cotação"]
[null,null,13,null,null,null,null,null,null,0,0.25509999999999999,0,"Cotação"]
[null,null,14,null,null,null,null,null,null,0,0.25509999999999999,0,"Cotação"]
[null,null,15,null,null,null,null,null,null,0,0.25509999999999999,0,"Cotação"]
[null,null,16,null,null,null,null,null,null,0,0.25509999999999999,0,"Cotação"]
[null,null,17,null,null,null,null,null,null,0,0.25509999999999999,0,"Cotação"]
[null,null,18,null,null,null,null,null,null,0,0.25509999999999999,0,"Cotação"]
[null,null,19,null,null,null,null,null,null,0,0.25509999999999999,0,"Cotação"]
[null,null,20,null,null,null,null,null,null,0,0.25509999999999999,0,"Cotação"]
[null,null,21,null,null,null,null,null,null,0,0.25509999999999999,0,"Cotação"]
[null,null,22,null,null,null,null,null,null,0,0.25509999999999999,0,"Cotação"]
[null,null,23,null,null,null,null,null,null,0,0.25509999999999999,0,"Cotação"]
[null,null,24,null,null,null,null,null,null,0,0.25509999999999999,0,"Cotação"]
[null,null,25,null,null,null,null,null,null,0,0.25509999999999999,0,"Cotação"]
[null,null,26,null,null,null,null,null,null,0,0.25509999999999999,{"$f":"ROUND(J41*(1+K41),2)","v":0},"Cotação"]
[null,null,27,null,null,null,null,null,null,0,0.25509999999999999,0,"Cotação"]
[null,null,28,null,null,null,null,null,null,0,0.25509999999999999,0,"Cotação"]
[null,null,29,null,null,null,null,null,null,0,0.25509999999999999,0,"Cotação"]
[null,null,30,null,null,null,null,null,null,0,0.25509999999999999,0,"Cotação"]
[null,null,31,null,null,null,null,null,null,0,0.25509999999999999,0,"Cotação"]
[null,null,32,null,null,null,null,null,null,0,0.25509999999999999,0,"Cotação"]
[null,null,33,null,null,null,null,null,null,{"$f":"I48*G48","v":0},0.25509999999999999,0,"Cotação"]
[null,null,34,null,null,null,null,null,null,{"$f":"I49*G49","v":0},0.25509999999999999,0,"Cotação"]
[null,null,35,null,null,null,null,null,null,0,0.25509999999999999,0,"Cotação"]
[null,null,36,null,null,null,null,null,null,0,0.25509999999999999,0,"Cotação"]
[null,null,37,null,null,null,null,null,null,0,0.25509999999999999,0,"Cotação"]
[null,null,38,null,null,null,null,null,null,{"$f":"I53*G53","v":0},0.25509999999999999,0,"Cotação"]
[null,null,39,null,null,null,null,null,null,0,0.25509999999999999,0,"Cotação"]
[]
[null,null,null,null,null,null,null,null,null,null,"SOMATÓRIO TOTAL MENSAL",{"$f":"L57/12","v":0}]
[null,null,null,null,null,null,null,null,null,null,"SOMATÓRIO TOTAL ANUAL",{"$f":"SUM(L15:L55)","v":0}]

{"sheet":"Não Rel - Mat Cons Durável","index":33,"n_rows":43,"n_cols":14,"rows_kept":43,"cut":false,"hidden":true,"merged":[[9,1,9,4],[10,1,10,13]]}
[null,null,"CÂMARA DOS DEPUTADOS"]
[null,null,"DEPARTAMENTO TÉCNICO"]
[null,null,"Coordenação de Planejamento e Gestão"]
[]
[null,null,"Data:",{"$f":"'Dados Gerais'!#REF!","v":{"$error":"#REF!"}}]
[null,null,"Processo:",{"$f":"'Dados Gerais'!#REF!","v":{"$error":"#REF!"}}]
[null,null,"Objeto:",{"$f":"'Dados Gerais'!#REF!","v":{"$error":"#REF!"}}]
[]
[]
[]
[null,"MATERIAIS DE CONSUMO PERMANENTE NÃO RELACIONADOS DIRETAMENTE A UM POSTO DE TRABALHO - AQUISIÇÃO SOB DEMANDA"]
[]
[]
[null,null,"ITEM","CÓDIGO","DESCRIÇÃO","ESTOQUE INICIAL","QUANT ANUAL","UNIDADE","CUSTO UNITÁRIO","CUSTO TOTAL","BDI (%)","PREÇO TOTAL","FONTE","REFERÊNCIA"]
[]
[null,null,1,null,null,null,180,"Unidade",null,{"$f":"I16*G16","v":0},{"$f":"BDI!E26","v":0.25509999999999999},{"$f":"ROUND(J16*(1+K16),2)","v":0},"Cotação"]
[null,null,2,null,null,null,85,"Unidade",null,{"$f":"I17*G17","v":0},{"$f":"K16","v":0.25509999999999999},{"$f":"ROUND(J17*(1+K17),2)","v":0},"Cotação"]
[null,null,3,null,null,null,5,"Unidade",null,0,{"$f":"K17","v":0.25509999999999999},0,"Cotação"]
[null,null,4,null,null,null,200,"Metro",null,0,0.25509999999999999,0,"Cotação"]
[null,null,5,null,null,null,80,"Unidade",null,0,0.25509999999999999,0,"Cotação"]
[null,null,6,null,null,null,18,"Unidade",null,0,0.25509999999999999,0,"Cotação"]
[null,null,7,null,null,null,30,"Unidade",null,0,0.25509999999999999,0,"Cotação"]
[null,null,8,null,null,null,54,"Unidade",null,0,0.25509999999999999,0,"Cotação"]
[null,null,9,null,null,null,15,"Unidade",null,0,0.25509999999999999,0,"Cotação"]
[null,null,10,null,null,null,26,"Unidade",null,0,0.25509999999999999,0,"Cotação"]
[null,null,11,null,null,null,16,"Unidade",null,0,0.25509999999999999,0,"Cotação"]
[null,null,12,null,null,null,120,"Unidade",null,0,0.25509999999999999,0,"Cotação"]
[null,null,13,null,null,null,80,"Unidade",null,0,0.25509999999999999,0,"Cotação"]
[null,null,14,null,null,null,130,"Unidade",null,0,0.25509999999999999,0,"Cotação"]
[null,null,15,null,null,null,54,"Unidade",null,0,0.25509999999999999,0,"Cotação"]
[null,null,16,null,null,null,42,"Unidade",null,0,0.25509999999999999,0,"Cotação"]
[null,null,17,null,null,null,5,"Unidade",null,0,0.25509999999999999,0,"Cotação"]
[null,null,18,null,null,null,5,"Unidade",null,0,0.25509999999999999,0,"Cotação"]
[null,null,19,null,null,null,519,"Unidade",null,0,0.25509999999999999,0,"Cotação"]
[null,null,20,null,null,null,300,"Unidade",null,0,0.25509999999999999,0,"Cotação"]
[null,null,21,null,null,null,337,"Unidade",null,0,0.25509999999999999,0,"Cotação"]
[null,null,22,null,null,null,84,"Unidade",null,0,0.25509999999999999,0,"Cotação"]
[null,null,23,null,null,null,63,"Unidade",null,0,0.25509999999999999,0,"Cotação"]
[null,null,24,null,null,null,137,"Unidade",null,0,0.25509999999999999,0,"Cotação"]
[null,null,25,null,null,null,105,"Unidade",null,0,0.25509999999999999,0,"Cotação"]
[]
[null,null,null,null,null,null,null,null,null,null,"SOMATÓRIO TOTAL MENSAL",{"$f":"L43/12","v":0}]
[null,null,null,null,null,null,null,null,null,null,"SOMATÓRIO TOTAL ANUAL",{"$f":"SUM(L15:L41)","v":0}]

{"sheet":"Não Rel - Serviços","index":34,"n_rows":19,"n_cols":13,"rows_kept":19,"cut":false,"hidden":true,"merged":[[9,1,9,4],[10,1,10,12]]}
[null,null,"CÂMARA DOS DEPUTADOS"]
[null,null,"DEPARTAMENTO TÉCNICO"]
[null,null,"Coordenação de Planejamento e Gestão"]
[]
[null,null,"Data:",{"$f":"'Dados Gerais'!#REF!","v":{"$error":"#REF!"}}]
[null,null,"Processo:",{"$f":"'Dados Gerais'!#REF!","v":{"$error":"#REF!"}}]
[null,null,"Objeto:",{"$f":"'Dados Gerais'!#REF!","v":{"$error":"#REF!"}}]
[]
[]
[]
[null,"SERVIÇOS NÃO RELACIONADOS DIRETAMENTE A UM POSTO DE TRABALHO - AQUISIÇÃO SOB DEMANDA"]
[]
[]
[null,null,"ITEM","CÓDIGO","DESCRIÇÃO","QUANT ANUAL","UNIDADE","CUSTO UNITÁRIO","CUSTO TOTAL","BDI (%)","PREÇO TOTAL","FONTE","REFERÊNCIA"]
[]
[null,null,1,null,"SERVIÇOS DE DESINSETIZAÇÃO E DESRATIZAÇÃO",null,"aplicações",null,{"$f":"H16*F16","v":0},{"$f":"BDI!E26","v":0.25509999999999999},{"$f":"ROUND(I16*(1+J16),2)","v":0},"Cotação"]
[]
[null,null,null,null,null,null,null,null,null,"SOMATÓRIO TOTAL MENSAL",{"$f":"K19/12","v":0}]
[null,null,null,null,null,null,null,null,null,"SOMATÓRIO TOTAL ANUAL",{"$f":"SUM(K15:K17)","v":0}]