{"text_format":"1","workbook":"xlsx","n_sheets":29,"sheets":["GUIA PARA PREENCHIMENTO","MODELO PROPOSTA","Remunerações"," RESUMO","1","2","3","4","5","6","Dados Gerais","Encargos Sociais","BDI","Uniformes","EPI","Equip Rel","Mat Cons","Mat Perm","SREP","Não Rel - EPI","Não Rel - Uniformes","Não Rel - Depr","Not. Demanda","SOBREAVISO","plano de saúde","Horas extras_Demanda","Não Rel - Mat Consumo","Não Rel - Mat Cons Durável","Não Rel - Serviços"],"not_rendered":{"charts":0,"images":11,"macros":1,"external_links":0,"defined_names":35,"comments":3,"pivot_tables":0},"unopened":[],"bounds":{"document_bytes":16777216,"sheet_cells":100000,"rows_first":2000,"rows_last":500,"rows_between":2000,"halvings":0,"cell_chars":16384,"cell_head_chars":4096},"cells_cut":0,"cells_raw":0,"read":"whole","date_system":"1900"}

{"sheet":"GUIA PARA PREENCHIMENTO","index":0,"n_rows":5,"n_cols":1,"rows_kept":5,"cut":false,"hidden":false,"merged":[]}
["GUIA PARA PREENCHIMENTO"]
[]
["1 - Preencher apenas as guias azuis:"]
[]
["2 - Recomendamos preencher somente as células com fundo azul claro. As demais possuem fórmulas e sugerimos não alterá-las."]

{"sheet":"MODELO PROPOSTA","index":1,"n_rows":63,"n_cols":2,"rows_kept":63,"cut":false,"hidden":false,"merged":[[54,1,54,9],[57,1,57,9],[58,1,58,9],[59,1,59,9],[62,1,62,9],[53,1,53,4],[53,5,53,9],[52,1,52,4],[52,5,52,9],[48,1,48,9],[50,1,50,9],[51,1,51,4],[51,5,51,9],[30,1,30,4],[30,5,30,9],[31,1,31,4],[31,5,31,9],[33,1,33,9],[34,6,34,10],[35,1,35,9],[36,1,36,9],[37,1,37,9],[38,1,38,9],[41,1,41,9],[43,1,43,9],[44,1,44,9],[45,1,45,9],[26,5,26,9],[28,1,28,4],[28,5,28,9],[29,1,29,4],[29,5,29,9],[27,1,27,4],[27,5,27,9],[26,1,26,4],[25,1,25,4],[25,5,25,9],[10,1,10,9],[11,1,11,9],[12,1,12,9],[14,1,14,9],[15,1,15,9],[16,1,16,2],[17,1,18,9],[19,1,19,9],[21,1,21,9],[22,1,22,9],[23,1,23,9],[9,1,9,9],[1,1,1,9],[4,1,4,9],[6,1,6,9],[7,1,7,9],[8,1,8,9]]}
[]
[null,"MODELO DA PROPOSTA COMPLETA"]
[]
[null,"."]
[null,"I – FORMALIZAÇÃO"]
[]
{"$rows_left_out":58}
{"sheet":"Remunerações","index":2,"n_rows":11,"n_cols":13,"rows_kept":11,"cut":false,"hidden":false,"merged":[[0,1,0,10]]}
[null,"QUADRO DE REMUNERAÇÕES"]
[]
[null,null,"ITEM","POSTO DE TRABALHO","QUANTIDADE","SALÁRIO","ADICIONAL DE PERICULOSIDADE","ADICIONAL DE INSALUBRIDADE","ADICIONAL NOTURNO","OUTROS","SALÁRIO COM ADICIONAIS"]
[null,null,null,"POSTO DE TRABALHO - EQUIPE DE TRABALHO"]
[null,null,1,{"$f":"HLOOKUP($C5,'Dados Gerais'!$D$5:$I$68,6)","v":"SUPERVISOR"},{"$f":"HLOOKUP($C5,'Dados Gerais'!$D$5:$I$68,10)","v":2},{"$f":"HLOOKUP($C5,'Dados Gerais'!$D$5:$I$68,8)","v":5177.57},{"$f":"HLOOKUP($C5,'Dados Gerais'!$D$5:$I$68,25)","v":0},{"$f":"HLOOKUP($C5,'Dados Gerais'!$D$5:$I$68,31)","v":0},{"$f":"HLOOKUP($C5,'Dados Gerais'!$D$5:$I$68,46)","v":0},{"$f":"HLOOKUP($C5,'Dados Gerais'!$D$5:$I$68,33)","v":0},{"$f":"SUM(F5:J5)","v":5177.57},null,{"$f":"E5*K5","v":10355.14}]
[null,null,2,{"$f":"HLOOKUP($C6,'Dados Gerais'!$D$5:$I$68,6)","v":"RECEPCIONISTA BILINGUE "},{"$f":"HLOOKUP($C6,'Dados Gerais'!$D$5:$I$68,10)","v":14},{"$f":"HLOOKUP($C6,'Dados Gerais'!$D$5:$I$68,8)","v":4706.88},{"$f":"HLOOKUP($C6,'Dados Gerais'!$D$5:$I$68,25)","v":0},{"$f":"HLOOKUP($C6,'Dados Gerais'!$D$5:$I$68,31)","v":0},{"$f":"HLOOKUP($C6,'Dados Gerais'!$D$5:$I$68,46)","v":0},{"$f":"HLOOKUP($C6,'Dados Gerais'!$D$5:$I$68,33)","v":0},{"$f":"SUM(F6:J6)","v":4706.88},null,{"$f":"E6*K6","v":65896.320000000007}]
{"$rows_left_out":6}
{"sheet":" RESUMO","index":3,"n_rows":102,"n_cols":12,"rows_kept":102,"cut":false,"hidden":false,"merged":[[2,1,2,8],[30,1,30,8],[16,1,16,8],[69,3,69,7],[91,3,91,7],[86,3,86,7],[58,3,58,7],[73,3,73,7],[82,3,82,7]]}
[]
[]
[null,"RESUMO  - TOTAIS MENSAIS - FATURA ORDINÁRIA (SEM O 13º E SEM OS ITENS SOB DEMANDA)"]
[]
[]
[null,null,"ITEM","POSTO DE TRABALHO","QUANTIDADE","PREÇO UNIT       (SEM O 13º)","DESTAQUE DO 13º","PREÇO POR EMPREGADO","PREÇO TOTAL (MENSAL)"]
{"$rows_left_out":97}
{"sheet":"1","index":4,"n_rows":119,"n_cols":8,"rows_kept":119,"cut":false,"hidden":false,"merged":[[106,1,106,3],[1,1,1,5],[2,1,2,5],[7,1,7,3],[17,1,17,3],[4,1,4,2],[46,1,46,3],[56,1,56,3],[74,1,74,3],[83,1,83,3],[5,1,5,2],[39,3,39,5],[68,3,68,5]]}
[]
[null,"PLANILHA DE ESTIMATIVA DE CUSTOS"]
[null,"Padrão IN 05/2017 e IN 07/2018 - MPDG"]
[]
[null,1,null,{"$f":"HLOOKUP($B$5,'Dados Gerais'!$D$5:$BE$20,6)","v":"SUPERVISOR"},"QUANTIDADE",{"$f":"HLOOKUP($B$5,'Dados Gerais'!$D$5:$BE$20,10)","v":2}]
[null,"CCT",null,{"$f":"HLOOKUP($B$5,'Dados Gerais'!$D$5:$BE$20,15)","v":"SEAC/DF X SINDSERVIÇOS/DF 2022/2022 Nº DF000015/2021"},"DATA-BASE",{"$f":"'Dados Gerais'!E20","v":"2022-01-01"}]
{"$rows_left_out":114}
{"sheet":"2","index":5,"n_rows":119,"n_cols":8,"rows_kept":119,"cut":false,"hidden":false,"merged":[[17,1,17,3],[1,1,1,5],[2,1,2,5],[4,1,4,2],[5,1,5,2],[7,1,7,3],[106,1,106,3],[39,3,39,5],[46,1,46,3],[56,1,56,3],[68,3,68,5],[74,1,74,3],[83,1,83,3]]}
[]
[null,"PLANILHA DE ESTIMATIVA DE CUSTOS"]
[null,"Padrão IN 05/2017 e IN 07/2018 - MPDG"]
[]
[null,2,null,{"$f":"HLOOKUP($B$5,'Dados Gerais'!$D$5:$BE$20,6)","v":"RECEPCIONISTA BILINGUE "},"QUANTIDADE",{"$f":"HLOOKUP($B$5,'Dados Gerais'!$D$5:$BE$20,10)","v":14}]
[null,"CCT",null,{"$f":"HLOOKUP($B$5,'Dados Gerais'!$D$5:$BE$20,15)","v":"SEAC/DF X SINDSERVIÇOS/DF 2022/2022 Nº DF000015/2021"},"DATA-BASE",{"$f":"'Dados Gerais'!E20","v":"2022-01-01"}]
{"$rows_left_out":114}
{"sheet":"3","index":6,"n_rows":119,"n_cols":8,"rows_kept":119,"cut":false,"hidden":false,"merged":[[17,1,17,3],[1,1,1,5],[2,1,2,5],[4,1,4,2],[5,1,5,2],[7,1,7,3],[106,1,106,3],[39,3,39,5],[46,1,46,3],[56,1,56,3],[68,3,68,5],[74,1,74,3],[83,1,83,3]]}
[]
[null,"PLANILHA DE ESTIMATIVA DE CUSTOS"]
[null,"Padrão IN 05/2017 e IN 07/2018 - MPDG"]
[]
[null,3,null,{"$f":"HLOOKUP($B$5,'Dados Gerais'!$D$5:$BE$20,6)","v":"CERIMONIALISTA"},"QUANTIDADE",{"$f":"HLOOKUP($B$5,'Dados Gerais'!$D$5:$BE$20,10)","v":6}]
[null,"CCT",null,{"$f":"HLOOKUP($B$5,'Dados Gerais'!$D$5:$BE$20,15)","v":"SEAC/DF X SINDSERVIÇOS/DF 2022/2022 Nº DF000015/2021"},"DATA-BASE",{"$f":"'Dados Gerais'!E20","v":"2022-01-01"}]
{"$rows_left_out":114}
{"sheet":"4","index":7,"n_rows":119,"n_cols":8,"rows_kept":119,"cut":false,"hidden":false,"merged":[[17,1,17,3],[1,1,1,5],[2,1,2,5],[4,1,4,2],[5,1,5,2],[7,1,7,3],[106,1,106,3],[39,3,39,5],[46,1,46,3],[56,1,56,3],[68,3,68,5],[74,1,74,3],[83,1,83,3]]}
[]
[null,"PLANILHA DE ESTIMATIVA DE CUSTOS"]
[null,"Padrão IN 05/2017 e IN 07/2018 - MPDG"]
[]
[null,4,null,{"$f":"HLOOKUP($B$5,'Dados Gerais'!$D$5:$BE$20,6)","v":"RECEPCIONISTA"},"QUANTIDADE",{"$f":"HLOOKUP($B$5,'Dados Gerais'!$D$5:$BE$20,10)","v":42}]
[null,"CCT",null,{"$f":"HLOOKUP($B$5,'Dados Gerais'!$D$5:$BE$20,15)","v":"SEAC/DF X SINDSERVIÇOS/DF 2022/2022 Nº DF000015/2021"},"DATA-BASE",{"$f":"'Dados Gerais'!E20","v":"2022-01-01"}]
{"$rows_left_out":114}
{"sheet":"5","index":8,"n_rows":119,"n_cols":8,"rows_kept":119,"cut":false,"hidden":false,"merged":[[17,1,17,3],[1,1,1,5],[2,1,2,5],[4,1,4,2],[5,1,5,2],[7,1,7,3],[106,1,106,3],[39,3,39,5],[46,1,46,3],[56,1,56,3],[68,3,68,5],[74,1,74,3],[83,1,83,3]]}
[]
[null,"PLANILHA DE ESTIMATIVA DE CUSTOS"]
[null,"Padrão IN 05/2017 e IN 07/2018 - MPDG"]
[]
[null,5,null,{"$f":"HLOOKUP($B$5,'Dados Gerais'!$D$5:$BE$20,6)","v":"RECEPCIONISTA COM ADICIONAL DE INSALUBRIDADE"},"QUANTIDADE",{"$f":"HLOOKUP($B$5,'Dados Gerais'!$D$5:$BE$20,10)","v":14}]
[null,"CCT",null,{"$f":"HLOOKUP($B$5,'Dados Gerais'!$D$5:$BE$20,15)","v":"SEAC/DF X SINDSERVIÇOS/DF 2022/2022 Nº DF000015/2021"},"DATA-BASE",{"$f":"'Dados Gerais'!E20","v":"2022-01-01"}]
{"$rows_left_out":114}
{"sheet":"6","index":9,"n_rows":119,"n_cols":8,"rows_kept":119,"cut":false,"hidden":false,"merged":[[17,1,17,3],[1,1,1,5],[2,1,2,5],[4,1,4,2],[5,1,5,2],[7,1,7,3],[106,1,106,3],[39,3,39,5],[46,1,46,3],[56,1,56,3],[68,3,68,5],[74,1,74,3],[83,1,83,3]]}
[]
[null,"PLANILHA DE ESTIMATIVA DE CUSTOS"]
[null,"Padrão IN 05/2017 e IN 07/2018 - MPDG"]
[]
[null,6,null,{"$f":"HLOOKUP($B$5,'Dados Gerais'!$D$5:$BE$20,6)","v":"RECEPCIONISTA BILINGUE PLANTONISTAS (12H/36H)"},"QUANTIDADE",{"$f":"HLOOKUP($B$5,'Dados Gerais'!$D$5:$BE$20,10)","v":0}]
[null,"CCT",null,{"$f":"HLOOKUP($B$5,'Dados Gerais'!$D$5:$BE$20,15)","v":"SEAC/DF X SINDSERVIÇOS/DF 2022/2022 Nº DF000015/2021"},"DATA-BASE",{"$f":"'Dados Gerais'!E20","v":"2022-01-01"}]
{"$rows_left_out":114}
{"sheet":"Dados Gerais","index":10,"n_rows":118,"n_cols":57,"rows_kept":118,"cut":false,"hidden":false,"merged":[[2,1,2,2]]}
[]
[]
[null,"INFORMAÇÕES DE ENTRADA"]
[]
[null,null,null,1,2,3,4,5,6,13,14,15,16,17,18,19,20,21,22,23,24,25,26,27,28,29,30,31,32,33,34,35,36,37,38,39,40,41,42,43,44,45,46,47,48,49,50,51,52,53,54,55,56,57,58,59,60]
[null,"",null,"CARGO 1","CARGO 2","CARGO 3","CARGO 4","CARGO 5","CARGO 6","CARGO 13","CARGO 14","CARGO 15","CARGO 16","CARGO 17","CARGO 18","CARGO 19","CARGO 20","CARGO 21","CARGO 22","CARGO 23","CARGO 24","CARGO 25","CARGO 26","CARGO 27","CARGO 28","CARGO 29","CARGO 30","CARGO 31","CARGO 32","CARGO 33","CARGO 34","CARGO 35","CARGO 36","CARGO 37","CARGO 38","CARGO 39","CARGO 40","CARGO 41","CARGO 42","CARGO 43","CARGO 44","CARGO 45","CARGO 46","CARGO 47","CARGO 48","CARGO 49","CARGO 50","CARGO 51","CARGO 52","CARGO 53","CARGO 54","CARGO 55","CARGO 56","CARGO 57","CARGO 58","CARGO 59","CARGO 60"]
{"$rows_left_out":113}
{"sheet":"Encargos Sociais","index":11,"n_rows":45,"n_cols":7,"rows_kept":45,"cut":false,"hidden":false,"merged":[[1,1,1,3],[2,1,2,4]]}
[]
[]
[null,"ENCARGOS SOCIAIS SOBRE A MÃO DE OBRA"]
[null,null,null,null,"Percentuais"]
[]
[null,"Referência:"]
{"$rows_left_out":40}
{"sheet":"BDI","index":12,"n_rows":26,"n_cols":7,"rows_kept":26,"cut":false,"hidden":false,"merged":[[1,1,1,3],[2,1,2,4]]}
[]
[]
[null,"COMPOSIÇÃO DA TAXA DE CUSTOS INDIRETOS, TRIBUTOS E LUCRO - BDI"]
[null,"APLICAÇÃO: MÃO DE OBRA, 13º, MATERIAIS, EPC E EQUIPAMENTO DE REGISTRO DE FREQUÊNCIA",null,null,"Percentuais"]
[]
[null,"Custos Indiretos da Contratada",null,null,{"$f":"SUM(E7:E8)","v":3.5700000000000003E-2}]
{"$rows_left_out":21}
{"sheet":"Uniformes","index":13,"n_rows":36,"n_cols":14,"rows_kept":36,"cut":false,"hidden":false,"merged":[[4,1,4,3],[5,1,5,8],[20,2,26,2],[27,2,34,2]]}
[null,null,"CÂMARA DOS DEPUTADOS"]
[null,null,"DEPARTAMENTO TÉCNICO"]
[]
[]
[]
[null,"UNIFORMES - AQUISIÇÃO"]
{"$rows_left_out":31}
{"sheet":"EPI","index":14,"n_rows":51,"n_cols":128,"rows_kept":51,"cut":false,"hidden":true,"merged":[[1,1,1,3],[2,1,2,5]]}
[]
[]
[null,"EQUIPAMENTOS DE PROTEÇÃO INDIVIDUAL - AQUISIÇÃO",null,null,null,null,null,null,1,null,{"$f":"I3+1","v":2},null,{"$f":"K3+1","v":3},null,{"$f":"M3+1","v":4},null,{"$f":"O3+1","v":5},null,{"$f":"Q3+1","v":6},null,{"$f":"S3+1","v":7},null,{"$f":"U3+1","v":8},null,{"$f":"W3+1","v":9},null,{"$f":"Y3+1","v":10},null,{"$f":"AA3+1","v":11},null,{"$f":"AC3+1","v":12},null,{"$f":"AE3+1","v":13},null,{"$f":"AG3+1","v":14},null,{"$f":"AI3+1","v":15},null,{"$f":"AK3+1","v":16},null,{"$f":"AM3+1","v":17},null,{"$f":"AO3+1","v":18},null,{"$f":"AQ3+1","v":19},null,{"$f":"AS3+1","v":20},null,{"$f":"AU3+1","v":21},null,{"$f":"AW3+1","v":22},null,{"$f":"AY3+1","v":23},null,{"$f":"BA3+1","v":24},null,{"$f":"BC3+1","v":25},null,{"$f":"BE3+1","v":26},null,{"$f":"BG3+1","v":27},null,{"$f":"BI3+1","v":28},null,{"$f":"BK3+1","v":29},null,{"$f":"BM3+1","v":30},null,{"$f":"BO3+1","v":31},null,{"$f":"BQ3+1","v":32},null,{"$f":"BS3+1","v":33},null,{"$f":"BU3+1","v":34},null,{"$f":"BW3+1","v":35},null,{"$f":"BY3+1","v":36},null,{"$f":"CA3+1","v":37},null,{"$f":"CC3+1","v":38},null,{"$f":"CE3+1","v":39},null,{"$f":"CG3+1","v":40},null,{"$f":"CI3+1","v":41},null,{"$f":"CK3+1","v":42},null,{"$f":"CM3+1","v":43},null,{"$f":"CO3+1","v":44},null,{"$f":"CQ3+1","v":45},null,{"$f":"CS3+1","v":46},null,{"$f":"CU3+1","v":47},null,{"$f":"CW3+1","v":48},null,{"$f":"CY3+1","v":49},null,{"$f":"DA3+1","v":50},null,{"$f":"DC3+1","v":51},null,{"$f":"DE3+1","v":52},null,{"$f":"DG3+1","v":53},null,{"$f":"DI3+1","v":54},null,{"$f":"DK3+1","v":55},null,{"$f":"DM3+1","v":56},null,{"$f":"DO3+1","v":57},null,{"$f":"DQ3+1","v":58},null,{"$f":"DS3+1","v":59},null,{"$f":"DU3+1","v":60}]
[]
[null,null,null,null,null,null,null,null,{"$f":"ROUND(SUM(J4:J24),2)","v":0},null,{"$f":"ROUND(SUM(L4:L24),2)","v":0},null,{"$f":"ROUND(SUM(N4:N24),2)","v":0},null,{"$f":"ROUND(SUM(P4:P24),2)","v":0},null,{"$f":"ROUND(SUM(R4:R24),2)","v":0},null,{"$f":"ROUND(SUM(T4:T24),2)","v":0},null,{"$f":"ROUND(SUM(V4:V24),2)","v":0},null,{"$f":"ROUND(SUM(X4:X24),2)","v":0},null,{"$f":"ROUND(SUM(Z4:Z24),2)","v":0},null,{"$f":"ROUND(SUM(AB4:AB24),2)","v":0},null,{"$f":"ROUND(SUM(AD4:AD24),2)","v":0},null,{"$f":"ROUND(SUM(AF4:AF24),2)","v":0},null,{"$f":"ROUND(SUM(AH4:AH24),2)","v":0},null,{"$f":"ROUND(SUM(AJ4:AJ24),2)","v":0},null,{"$f":"ROUND(SUM(AL4:AL24),2)","v":0},null,{"$f":"ROUND(SUM(AN4:AN24),2)","v":0},null,{"$f":"ROUND(SUM(AP4:AP24),2)","v":0},null,{"$f":"ROUND(SUM(AR4:AR24),2)","v":0},null,{"$f":"ROUND(SUM(AT4:AT24),2)","v":0},null,{"$f":"ROUND(SUM(AV4:AV24),2)","v":0},null,{"$f":"ROUND(SUM(AX4:AX24),2)","v":0},null,{"$f":"ROUND(SUM(AZ4:AZ24),2)","v":0},null,{"$f":"ROUND(SUM(BB4:BB24),2)","v":0},null,{"$f":"ROUND(SUM(BD4:BD24),2)","v":0},null,{"$f":"ROUND(SUM(BF4:BF24),2)","v":0},null,{"$f":"ROUND(SUM(BH4:BH24),2)","v":0},null,{"$f":"ROUND(SUM(BJ4:BJ24),2)","v":0},null,{"$f":"ROUND(SUM(BL4:BL24),2)","v":0},null,{"$f":"ROUND(SUM(BN4:BN24),2)","v":0},null,{"$f":"ROUND(SUM(BP4:BP24),2)","v":0},null,{"$f":"ROUND(SUM(BR4:BR24),2)","v":0},null,{"$f":"ROUND(SUM(BT4:BT24),2)","v":0},null,{"$f":"ROUND(SUM(BV4:BV24),2)","v":0},null,{"$f":"ROUND(SUM(BX4:BX24),2)","v":0},null,{"$f":"ROUND(SUM(BZ4:BZ24),2)","v":0},null,{"$f":"ROUND(SUM(CB4:CB24),2)","v":0},null,{"$f":"ROUND(SUM(CD4:CD24),2)","v":0},null,{"$f":"ROUND(SUM(CF4:CF24),2)","v":0},null,{"$f":"ROUND(SUM(CH4:CH24),2)","v":0},null,{"$f":"ROUND(SUM(CJ4:CJ24),2)","v":0},null,{"$f":"ROUND(SUM(CL4:CL24),2)","v":0},null,{"$f":"ROUND(SUM(CN4:CN24),2)","v":0},null,{"$f":"ROUND(SUM(CP4:CP24),2)","v":0},null,{"$f":"ROUND(SUM(CR4:CR24),2)","v":0},null,{"$f":"ROUND(SUM(CT4:CT24),2)","v":0},null,{"$f":"ROUND(SUM(CV4:CV24),2)","v":0},null,{"$f":"ROUND(SUM(CX4:CX24),2)","v":0},null,{"$f":"ROUND(SUM(CZ4:CZ24),2)","v":0},null,{"$f":"ROUND(SUM(DB4:DB24),2)","v":0},null,{"$f":"ROUND(SUM(DD4:DD24),2)","v":0},null,{"$f":"ROUND(SUM(DF4:DF24),2)","v":0},null,{"$f":"ROUND(SUM(DH4:DH24),2)","v":0},null,{"$f":"ROUND(SUM(DJ4:DJ24),2)","v":0},null,{"$f":"ROUND(SUM(DL4:DL24),2)","v":0},null,{"$f":"ROUND(SUM(DN4:DN24),2)","v":0},null,{"$f":"ROUND(SUM(DP4:DP24),2)","v":0},null,{"$f":"ROUND(SUM(DR4:DR24),2)","v":0},null,{"$f":"ROUND(SUM(DT4:DT24),2)","v":0},null,{"$f":"ROUND(SUM(DV4:DV24),2)","v":0},null,{"$f":"ROUND(SUM(DX4:DX24),2)","v":0}]
[null,null,"CATEGORIAS",null,null,"QUANTIDADE"]
{"$rows_left_out":46}
{"sheet":"Equip Rel","index":15,"n_rows":80,"n_cols":136,"rows_kept":80,"cut":false,"hidden":true,"merged":[[9,1,9,3],[10,1,10,14]]}
[null,null,"CÂMARA DOS DEPUTADOS"]
[null,null,"DEPARTAMENTO TÉCNICO"]
[null,null,"Coordenação de Planejamento e Gestão"]
[]
[null,null,"Data:",{"$f":"'Dados Gerais'!#REF!","v":{"$error":"#REF!"}}]
[null,null,"Processo:",{"$f":"'Dados Gerais'!#REF!","v":{"$error":"#REF!"}}]
{"$rows_left_out":75}
{"sheet":"Mat Cons","index":16,"n_rows":28,"n_cols":128,"rows_kept":28,"cut":false,"hidden":true,"merged":[[9,1,9,3],[10,1,10,5]]}
[null,null,"CÂMARA DOS DEPUTADOS"]
[null,null,"DEPARTAMENTO TÉCNICO"]
[null,null,"Coordenação de Planejamento e Gestão"]
[]
[null,null,"Data:",{"$f":"'Dados Gerais'!#REF!","v":{"$error":"#REF!"}}]
[null,null,"Processo:",{"$f":"'Dados Gerais'!#REF!","v":{"$error":"#REF!"}}]
{"$rows_left_out":23}
{"sheet":"Mat Perm","index":17,"n_rows":113,"n_cols":136,"rows_kept":113,"cut":false,"hidden":true,"merged":[[9,1,9,3],[10,1,10,14]]}
[null,null,"CÂMARA DOS DEPUTADOS"]
[null,null,"DEPARTAMENTO TÉCNICO"]
[null,null,"Coordenação de Planejamento e Gestão"]
[]
[null,null,"Data:",{"$f":"'Dados Gerais'!#REF!","v":{"$error":"#REF!"}}]
[null,null,"Processo:",{"$f":"'Dados Gerais'!#REF!","v":{"$error":"#REF!"}}]
{"$rows_left_out":108}
{"sheet":"SREP","index":18,"n_rows":74,"n_cols":15,"rows_kept":74,"cut":false,"hidden":false,"merged":[[1,1,1,3],[2,1,2,14]]}
[]
[]
[null,"SISTEMA DE REGISTRO ELETRÔNICO DE PRESENÇA - SREP"]
[]
[]
[null,null,"PAGAMENTO DA DEPRECIAÇÃO"]
{"$rows_left_out":69}
{"sheet":"Não Rel - EPI","index":19,"n_rows":12,"n_cols":15,"rows_kept":12,"cut":false,"hidden":true,"merged":[[2,1,2,4],[3,1,3,11]]}
[]
[]
[]
[null,"EPIS NÃO RELACIONADOS DIRETAMENTE A UM POSTO DE TRABALHO - AQUISIÇÃO"]
[]
[]
{"$rows_left_out":7}
{"sheet":"Não Rel - Uniformes","index":20,"n_rows":37,"n_cols":15,"rows_kept":37,"cut":false,"hidden":true,"merged":[[9,1,9,4],[10,1,10,11],[15,2,15,11],[23,2,23,11]]}
[null,null,"CÂMARA DOS DEPUTADOS"]
[null,null,"DEPARTAMENTO TÉCNICO"]
[null,null,"Coordenação de Planejamento e Gestão"]
[]
[null,null,"Data:",{"$f":"'Dados Gerais'!#REF!","v":{"$error":"#REF!"}}]
[null,null,"Processo:",{"$f":"'Dados Gerais'!#REF!","v":{"$error":"#REF!"}}]
{"$rows_left_out":32}
{"sheet":"Não Rel - Depr","index":21,"n_rows":107,"n_cols":15,"rows_kept":107,"cut":false,"hidden":true,"merged":[[9,1,9,3],[10,1,10,14]]}
[null,null,"CÂMARA DOS DEPUTADOS"]
[null,null,"DEPARTAMENTO TÉCNICO"]
[null,null,"Coordenação de Planejamento e Gestão"]
[]
[null,null,"Data:",{"$f":"'Dados Gerais'!#REF!","v":{"$error":"#REF!"}}]
[null,null,"Processo:",{"$f":"'Dados Gerais'!#REF!","v":{"$error":"#REF!"}}]
{"$rows_left_out":102}
{"sheet":"Not. Demanda","index":22,"n_rows":53,"n_cols":8,"rows_kept":53,"cut":false,"hidden":false,"merged":[[1,1,1,3],[2,1,2,7]]}
[]
[]
[null,"ADICIONAL NOTURNO SOB DEMANDA"]
[]
[]
[null,null,"CATEGORIAS",null,null,null,"HORAS / MÊS","% NOTURNA"]
{"$rows_left_out":48}
{"sheet":"SOBREAVISO","index":23,"n_rows":43,"n_cols":10,"rows_kept":43,"cut":false,"hidden":true,"merged":[[1,1,1,3],[2,1,2,7]]}
[]
[]
[null,"HORAS DE SOBREAVISO SOB DEMANDA"]
[]
[]
[null,null,"CATEGORIAS",null,null,null,"HORAS / MÊS","% NOTURNA"]
{"$rows_left_out":38}
{"sheet":"plano de saúde","index":24,"n_rows":37,"n_cols":2,"rows_kept":37,"cut":false,"hidden":true,"merged":[]}
[]
[null,532.86]
[null,418.82]
[null,299.69]
[null,224.33]
[null,223.17]
{"$rows_left_out":32}
{"sheet":"Horas extras_Demanda","index":25,"n_rows":77,"n_cols":8,"rows_kept":77,"cut":false,"hidden":true,"merged":[[6,3,7,7],[9,1,9,3],[10,1,10,7],[38,2,38,3]]}
[null,null,"CÂMARA DOS DEPUTADOS"]
[null,null,"DEPARTAMENTO TÉCNICO"]
[null,null,"Coordenação de Planejamento e Gestão"]
[]
[null,null,"Data:",{"$f":"'Dados Gerais'!#REF!","v":{"$error":"#REF!"}}]
[null,null,"Processo:",{"$f":"'Dados Gerais'!#REF!","v":{"$error":"#REF!"}}]
{"$rows_left_out":72}
{"sheet":"Não Rel - Mat Consumo","index":26,"n_rows":57,"n_cols":14,"rows_kept":57,"cut":false,"hidden":true,"merged":[[9,1,9,4],[10,1,10,13]]}
[null,null,"CÂMARA DOS DEPUTADOS"]
[null,null,"DEPARTAMENTO TÉCNICO"]
[null,null,"Coordenação de Planejamento e Gestão"]
[]
[null,null,"Data:",{"$f":"'Dados Gerais'!#REF!","v":{"$error":"#REF!"}}]
[null,null,"Processo:",{"$f":"'Dados Gerais'!#REF!","v":{"$error":"#REF!"}}]
{"$rows_left_out":52}
{"sheet":"Não Rel - Mat Cons Durável","index":27,"n_rows":43,"n_cols":14,"rows_kept":43,"cut":false,"hidden":true,"merged":[[9,1,9,4],[10,1,10,13]]}
[null,null,"CÂMARA DOS DEPUTADOS"]
[null,null,"DEPARTAMENTO TÉCNICO"]
[null,null,"Coordenação de Planejamento e Gestão"]
[]
[null,null,"Data:",{"$f":"'Dados Gerais'!#REF!","v":{"$error":"#REF!"}}]
[null,null,"Processo:",{"$f":"'Dados Gerais'!#REF!","v":{"$error":"#REF!"}}]
{"$rows_left_out":38}
{"sheet":"Não Rel - Serviços","index":28,"n_rows":19,"n_cols":13,"rows_kept":19,"cut":false,"hidden":true,"merged":[[9,1,9,4],[10,1,10,12]]}
[null,null,"CÂMARA DOS DEPUTADOS"]
[null,null,"DEPARTAMENTO TÉCNICO"]
[null,null,"Coordenação de Planejamento e Gestão"]
[]
[null,null,"Data:",{"$f":"'Dados Gerais'!#REF!","v":{"$error":"#REF!"}}]
[null,null,"Processo:",{"$f":"'Dados Gerais'!#REF!","v":{"$error":"#REF!"}}]
{"$rows_left_out":13}