{"text_format":"1","workbook":"xlsx","n_sheets":25,"sheets":["GUIA PARA PREENCHIMENTO","MODELO PROPOSTA","Remunerações","Resumo","1","2","3","4","5","6","Dados Gerais","Encargos Sociais","BDI","Sobreaviso","Uniformes","Mat Perm","EPI","Mat Cons","Não Rel - EPI","SREP","Not. Demanda","Equip Rel","Não Rel - Mat","Não Rel - Equip","Não Rel - Depr"],"not_rendered":{"charts":0,"images":5,"macros":1,"external_links":2,"defined_names":29,"comments":1,"pivot_tables":0},"unopened":[],"bounds":{"document_bytes":16777216,"sheet_cells":100000,"rows_first":2000,"rows_last":500,"rows_between":2000,"halvings":0,"cell_chars":16384,"cell_head_chars":4096},"cells_cut":0,"cells_raw":0,"read":"whole","date_system":"1900"}

{"sheet":"GUIA PARA PREENCHIMENTO","index":0,"n_rows":5,"n_cols":1,"rows_kept":5,"cut":false,"hidden":false,"merged":[]}
["GUIA PARA PREENCHIMENTO"]
[]
["1 - Preencher apenas as guias azuis:"]
[]
["2 - Recomendamos preencher somente as células com fundo azul claro. As demais possuem fórmulas e sugerimos não alterá-las."]

{"sheet":"MODELO PROPOSTA","index":1,"n_rows":64,"n_cols":2,"rows_kept":64,"cut":false,"hidden":false,"merged":[[55,1,55,9],[58,1,58,9],[59,1,59,9],[60,1,60,9],[63,1,63,9],[54,1,54,4],[54,5,54,9],[49,1,49,9],[51,1,51,9],[52,1,52,4],[52,5,52,9],[53,1,53,4],[53,5,53,9],[33,1,33,9],[34,6,34,10],[35,1,35,9],[36,1,36,9],[37,1,37,9],[38,1,38,9],[42,1,42,9],[44,1,44,9],[45,1,45,9],[46,1,46,9],[29,1,29,4],[29,5,29,9],[30,1,30,4],[30,5,30,9],[31,1,31,4],[31,5,31,9],[26,1,26,4],[26,5,26,9],[27,1,27,4],[27,5,27,9],[28,1,28,4],[28,5,28,9],[25,1,25,4],[25,5,25,9],[10,1,10,9],[11,1,11,9],[12,1,12,9],[14,1,14,9],[15,1,15,9],[16,1,16,2],[17,1,18,9],[19,1,19,9],[21,1,21,9],[22,1,22,9],[23,1,23,9],[9,1,9,9],[1,1,1,9],[4,1,4,9],[6,1,6,9],[7,1,7,9],[8,1,8,9]]}
[]
[null,"MODELO DA PROPOSTA COMPLETA"]
[]
[null,"."]
[null,"I – FORMALIZAÇÃO"]
[]
[null,"PREGÃO ELETRÔNICO N. 66/22"]
[null,"OBJETO: Prestação de serviços continuados, por empresa especializada, referentes a apoio a Processos, Tratamento de Dados e Inovação em Tecnologia da Informação, com dedicação exclusiva de profissionais, pelo período de 12 (doze) meses"]
[null,"LICITANTE: _____________________________________________________"]
[null,"CNPJ: ________________________________________________________"]
{"$rows_left_out":55}
{"sheet":"Remunerações","index":2,"n_rows":12,"n_cols":11,"rows_kept":12,"cut":false,"hidden":false,"merged":[[0,1,0,10]]}
[null,"QUADRO DE REMUNERAÇÕES"]
[]
[null,null,"ITEM","POSTO DE TRABALHO","QUANTIDADE","SALÁRIO","ADICIONAL DE PERICULOSIDADE","ADICIONAL DE INSALUBRIDADE","ADICIONAL NOTURNO","OUTROS","SALÁRIO COM ADICIONAIS"]
[null,null,null,"POSTO DE TRABALHO - EQUIPE DE TRABALHO"]
[null,null,1,{"$f":"HLOOKUP($C5,'Dados Gerais'!$D$5:$I$68,6)","v":"Analista de TI - Agile Master - sênior"},{"$f":"HLOOKUP($C5,'Dados Gerais'!$D$5:$I$68,10)","v":8},{"$f":"HLOOKUP($C5,'Dados Gerais'!$D$5:$H$68,8)","v":11027},{"$f":"HLOOKUP($C5,'Dados Gerais'!$D$5:$H$68,26)","v":0},{"$f":"HLOOKUP($C5,'Dados Gerais'!$D$5:$H$68,32)","v":0},{"$f":"HLOOKUP($C5,'Dados Gerais'!$D$5:$H$68,47)","v":0},{"$f":"HLOOKUP($C5,'Dados Gerais'!$D$5:$H$68,34)","v":0},{"$f":"SUM(F5:J5)","v":11027}]
[null,null,2,{"$f":"HLOOKUP($C6,'Dados Gerais'!$D$5:$I$68,6)","v":"Analista de TI - Engenheiro de Dados - sênior"},{"$f":"HLOOKUP($C6,'Dados Gerais'!$D$5:$I$68,10)","v":5},{"$f":"HLOOKUP($C6,'Dados Gerais'!$D$5:$H$68,8)","v":13998.55},{"$f":"HLOOKUP($C6,'Dados Gerais'!$D$5:$H$68,26)","v":0},{"$f":"HLOOKUP($C6,'Dados Gerais'!$D$5:$H$68,32)","v":0},{"$f":"HLOOKUP($C6,'Dados Gerais'!$D$5:$H$68,47)","v":0},{"$f":"HLOOKUP($C6,'Dados Gerais'!$D$5:$H$68,34)","v":0},{"$f":"SUM(F6:J6)","v":13998.55}]
[null,null,3,{"$f":"HLOOKUP($C7,'Dados Gerais'!$D$5:$I$68,6)","v":"Analista de TI - Analista de Dados - sênior"},{"$f":"HLOOKUP($C7,'Dados Gerais'!$D$5:$I$68,10)","v":9},{"$f":"HLOOKUP($C7,'Dados Gerais'!$D$5:$H$68,8)","v":9747.5400000000009},{"$f":"HLOOKUP($C7,'Dados Gerais'!$D$5:$H$68,26)","v":0},{"$f":"HLOOKUP($C7,'Dados Gerais'!$D$5:$H$68,32)","v":0},{"$f":"HLOOKUP($C7,'Dados Gerais'!$D$5:$H$68,47)","v":0},{"$f":"HLOOKUP($C7,'Dados Gerais'!$D$5:$H$68,34)","v":0},9747.5400000000009]
[null,null,4,{"$f":"HLOOKUP($C8,'Dados Gerais'!$D$5:$I$68,6)","v":"Analista de TI - Arquiteto de Dados - sênior"},{"$f":"HLOOKUP($C8,'Dados Gerais'!$D$5:$I$68,10)","v":6},{"$f":"HLOOKUP($C8,'Dados Gerais'!$D$5:$H$68,8)","v":11079.73},{"$f":"HLOOKUP($C8,'Dados Gerais'!$D$5:$H$68,26)","v":0},{"$f":"HLOOKUP($C8,'Dados Gerais'!$D$5:$H$68,32)","v":0},{"$f":"HLOOKUP($C8,'Dados Gerais'!$D$5:$H$68,47)","v":0},{"$f":"HLOOKUP($C8,'Dados Gerais'!$D$5:$H$68,34)","v":0},11079.73]
[null,null,5,{"$f":"HLOOKUP($C9,'Dados Gerais'!$D$5:$I$68,6)","v":"Analista de TI - Planejamento e Processos Digitais - sênior"},{"$f":"HLOOKUP($C9,'Dados Gerais'!$D$5:$I$68,10)","v":4},{"$f":"HLOOKUP($C9,'Dados Gerais'!$D$5:$H$68,8)","v":8369.94},{"$f":"HLOOKUP($C9,'Dados Gerais'!$D$5:$H$68,26)","v":0},{"$f":"HLOOKUP($C9,'Dados Gerais'!$D$5:$H$68,32)","v":0},{"$f":"HLOOKUP($C9,'Dados Gerais'!$D$5:$H$68,47)","v":0},{"$f":"HLOOKUP($C9,'Dados Gerais'!$D$5:$H$68,34)","v":0},{"$f":"SUM(F9:J9)","v":8369.94}]
[null,null,6,{"$f":"HLOOKUP($C10,'Dados Gerais'!$D$5:$I$68,6)","v":"Analista de Design e Cultura Digital - sênior"},{"$f":"HLOOKUP($C10,'Dados Gerais'!$D$5:$I$68,10)","v":2},{"$f":"HLOOKUP($C10,'Dados Gerais'!$D$5:$I$68,8)","v":7036.27},{"$f":"HLOOKUP($C10,'Dados Gerais'!$D$5:$H$68,26)","v":0},{"$f":"HLOOKUP($C10,'Dados Gerais'!$D$5:$H$68,32)","v":0},{"$f":"HLOOKUP($C10,'Dados Gerais'!$D$5:$H$68,47)","v":0},{"$f":"HLOOKUP($C10,'Dados Gerais'!$D$5:$H$68,34)","v":0},7036.27]
{"$rows_left_out":3}
{"sheet":"Resumo","index":3,"n_rows":72,"n_cols":11,"rows_kept":72,"cut":false,"hidden":false,"merged":[[2,1,2,8],[17,1,17,8],[32,1,32,8],[59,3,59,7],[69,3,69,7]]}
[]
[]
[null,"RESUMO - TOTAIS MENSAIS - FATURA ORDINÁRIA (SEM O 13º E SEM OS ITENS SOB DEMANDA)"]
[]
[]
[null,null,"ITEM","POSTO DE TRABALHO","QUANTIDADE","PREÇO UNIT       (SEM O 13º)","DESTAQUE DO 13º","PREÇO POR EMPREGADO","PREÇO TOTAL (MENSAL)"]
[null,null,"POSTO DE TRABALHO - EQUIPE DE TRABALHO"]
[null,null,1,{"$f":"HLOOKUP(C8,'Dados Gerais'!$D$5:$BH$10,6)","v":"Analista de TI - Agile Master - sênior"},{"$f":"HLOOKUP(C8,'Dados Gerais'!$D$5:$BH$14,10)","v":8},{"$f":"'1'!E105","v":23065.489880999998},0,{"$f":"G8+F8","v":23065.489880999998},{"$f":"H8*E8","v":184523.91904799998}]
[null,null,2,{"$f":"HLOOKUP(C9,'Dados Gerais'!$D$5:$BH$10,6)","v":"Analista de TI - Engenheiro de Dados - sênior"},{"$f":"HLOOKUP(C9,'Dados Gerais'!$D$5:$BH$14,10)","v":5},{"$f":"'2'!E105","v":28981.288916999994},0,28981.288916999994,144906.44458499996]
[null,null,3,{"$f":"HLOOKUP(C10,'Dados Gerais'!$D$5:$BH$10,6)","v":"Analista de TI - Analista de Dados - sênior"},{"$f":"HLOOKUP(C10,'Dados Gerais'!$D$5:$BH$14,10)","v":9},{"$f":"'3'!E105","v":20518.327430999998},0,20518.327430999998,184664.946879]
{"$rows_left_out":63}
{"sheet":"1","index":4,"n_rows":119,"n_cols":8,"rows_kept":119,"cut":false,"hidden":false,"merged":[[106,1,106,3],[1,1,1,5],[2,1,2,5],[7,1,7,3],[17,1,17,3],[4,1,4,2],[46,1,46,3],[56,1,56,3],[74,1,74,3],[83,1,83,3],[5,1,5,2],[39,3,39,5],[68,3,68,5]]}
[]
[null,"PLANILHA DE ESTIMATIVA DE CUSTOS"]
[null,"Padrão IN 05/2017 e IN 07/2018 - MPDG"]
[]
[null,1,null,{"$f":"HLOOKUP($B$5,'Dados Gerais'!$D$5:$BH$21,6)","v":"Analista de TI - Agile Master - sênior"},"QUANTIDADE",{"$f":"HLOOKUP($B$5,'Dados Gerais'!$D$5:$BH$21,10)","v":8}]
[null,"CCT",null,{"$f":"HLOOKUP($B$5,'Dados Gerais'!$D$5:$BH$21,16)","v":"SINDPD/DF X SINDESEI/DF 2021/2022 Nº DF000608/2021"},"DATA-BASE",{"$f":"HLOOKUP($B$5,'Dados Gerais'!$D$5:$BH$21,17)","v":"2021-05-01"}]
[]
[null,"MÓDULO 1 - COMPOSIÇÃO DA REMUNERAÇÃO",null,null,null,"Valor"]
[null,null,"A","Salário-Base",null,{"$f":"HLOOKUP($B$5,'Dados Gerais'!$D$5:$BH$21,8)","v":11027}]
[null,null,"B","Adicional de Periculosidade",null,{"$f":"HLOOKUP($B$5,'Dados Gerais'!$D$5:$BH$38,25)","v":0}]
{"$rows_left_out":110}
{"sheet":"2","index":5,"n_rows":119,"n_cols":8,"rows_kept":119,"cut":false,"hidden":false,"merged":[[1,1,1,5],[2,1,2,5],[4,1,4,2],[5,1,5,2],[7,1,7,3],[17,1,17,3],[106,1,106,3],[39,3,39,5],[46,1,46,3],[56,1,56,3],[68,3,68,5],[74,1,74,3],[83,1,83,3]]}
[]
[null,"PLANILHA DE ESTIMATIVA DE CUSTOS"]
[null,"Padrão IN 05/2017 e IN 07/2018 - MPDG"]
[]
[null,2,null,{"$f":"HLOOKUP($B$5,'Dados Gerais'!$D$5:$BH$21,6)","v":"Analista de TI - Engenheiro de Dados - sênior"},"QUANTIDADE",{"$f":"HLOOKUP($B$5,'Dados Gerais'!$D$5:$BH$21,10)","v":5}]
[null,"CCT",null,{"$f":"HLOOKUP($B$5,'Dados Gerais'!$D$5:$BH$21,16)","v":"SINDPD/DF X SINDESEI/DF 2021/2022 Nº DF000608/2021"},"DATA-BASE",{"$f":"HLOOKUP($B$5,'Dados Gerais'!$D$5:$BH$21,17)","v":"2021-05-01"}]
[]
[null,"MÓDULO 1 - COMPOSIÇÃO DA REMUNERAÇÃO",null,null,null,"Valor"]
[null,null,"A","Salário-Base",null,{"$f":"HLOOKUP($B$5,'Dados Gerais'!$D$5:$BH$21,8)","v":13998.55}]
[null,null,"B","Adicional de Periculosidade",null,{"$f":"HLOOKUP($B$5,'Dados Gerais'!$D$5:$BH$38,25)","v":0}]
{"$rows_left_out":110}
{"sheet":"3","index":6,"n_rows":119,"n_cols":8,"rows_kept":119,"cut":false,"hidden":false,"merged":[[1,1,1,5],[2,1,2,5],[4,1,4,2],[5,1,5,2],[7,1,7,3],[17,1,17,3],[106,1,106,3],[39,3,39,5],[46,1,46,3],[56,1,56,3],[68,3,68,5],[74,1,74,3],[83,1,83,3]]}
[]
[null,"PLANILHA DE ESTIMATIVA DE CUSTOS"]
[null,"Padrão IN 05/2017 e IN 07/2018 - MPDG"]
[]
[null,3,null,{"$f":"HLOOKUP($B$5,'Dados Gerais'!$D$5:$BH$21,6)","v":"Analista de TI - Analista de Dados - sênior"},"QUANTIDADE",{"$f":"HLOOKUP($B$5,'Dados Gerais'!$D$5:$BH$21,10)","v":9}]
[null,"CCT",null,{"$f":"HLOOKUP($B$5,'Dados Gerais'!$D$5:$BH$21,16)","v":"SINDPD/DF X SINDESEI/DF 2021/2022 Nº DF000608/2021"},"DATA-BASE",{"$f":"HLOOKUP($B$5,'Dados Gerais'!$D$5:$BH$21,17)","v":"2021-05-01"}]
[]
[null,"MÓDULO 1 - COMPOSIÇÃO DA REMUNERAÇÃO",null,null,null,"Valor"]
[null,null,"A","Salário-Base",null,{"$f":"HLOOKUP($B$5,'Dados Gerais'!$D$5:$BH$21,8)","v":9747.5400000000009}]
[null,null,"B","Adicional de Periculosidade",null,{"$f":"HLOOKUP($B$5,'Dados Gerais'!$D$5:$BH$38,25)","v":0}]
{"$rows_left_out":110}
{"sheet":"4","index":7,"n_rows":119,"n_cols":8,"rows_kept":119,"cut":false,"hidden":false,"merged":[[1,1,1,5],[2,1,2,5],[4,1,4,2],[5,1,5,2],[7,1,7,3],[17,1,17,3],[106,1,106,3],[39,3,39,5],[46,1,46,3],[56,1,56,3],[68,3,68,5],[74,1,74,3],[83,1,83,3]]}
[]
[null,"PLANILHA DE ESTIMATIVA DE CUSTOS"]
[null,"Padrão IN 05/2017 e IN 07/2018 - MPDG"]
[]
[null,4,null,{"$f":"HLOOKUP($B$5,'Dados Gerais'!$D$5:$BH$21,6)","v":"Analista de TI - Arquiteto de Dados - sênior"},"QUANTIDADE",{"$f":"HLOOKUP($B$5,'Dados Gerais'!$D$5:$BH$21,10)","v":6}]
[null,"CCT",null,{"$f":"HLOOKUP($B$5,'Dados Gerais'!$D$5:$BH$21,16)","v":"SINDPD/DF X SINDESEI/DF 2021/2022 Nº DF000608/2021"},"DATA-BASE",{"$f":"HLOOKUP($B$5,'Dados Gerais'!$D$5:$BH$21,17)","v":"2021-05-01"}]
[]
[null,"MÓDULO 1 - COMPOSIÇÃO DA REMUNERAÇÃO",null,null,null,"Valor"]
[null,null,"A","Salário-Base",null,{"$f":"HLOOKUP($B$5,'Dados Gerais'!$D$5:$BH$21,8)","v":11079.73}]
[null,null,"B","Adicional de Periculosidade",null,{"$f":"HLOOKUP($B$5,'Dados Gerais'!$D$5:$BH$38,25)","v":0}]
{"$rows_left_out":110}
{"sheet":"5","index":8,"n_rows":119,"n_cols":8,"rows_kept":119,"cut":false,"hidden":false,"merged":[[1,1,1,5],[2,1,2,5],[4,1,4,2],[5,1,5,2],[7,1,7,3],[17,1,17,3],[106,1,106,3],[39,3,39,5],[46,1,46,3],[56,1,56,3],[68,3,68,5],[74,1,74,3],[83,1,83,3]]}
[]
[null,"PLANILHA DE ESTIMATIVA DE CUSTOS"]
[null,"Padrão IN 05/2017 e IN 07/2018 - MPDG"]
[]
[null,5,null,{"$f":"HLOOKUP($B$5,'Dados Gerais'!$D$5:$BH$21,6)","v":"Analista de TI - Planejamento e Processos Digitais - sênior"},"QUANTIDADE",{"$f":"HLOOKUP($B$5,'Dados Gerais'!$D$5:$BH$21,10)","v":4}]
[null,"CCT",null,{"$f":"HLOOKUP($B$5,'Dados Gerais'!$D$5:$BH$21,16)","v":"SINDPD/DF X SINDESEI/DF 2021/2022 Nº DF000608/2021"},"DATA-BASE",{"$f":"HLOOKUP($B$5,'Dados Gerais'!$D$5:$BH$21,17)","v":"2021-05-01"}]
[]
[null,"MÓDULO 1 - COMPOSIÇÃO DA REMUNERAÇÃO",null,null,null,"Valor"]
[null,null,"A","Salário-Base",null,{"$f":"HLOOKUP($B$5,'Dados Gerais'!$D$5:$BH$21,8)","v":8369.94}]
[null,null,"B","Adicional de Periculosidade",null,{"$f":"HLOOKUP($B$5,'Dados Gerais'!$D$5:$BH$38,25)","v":0}]
{"$rows_left_out":110}
{"sheet":"6","index":9,"n_rows":119,"n_cols":8,"rows_kept":119,"cut":false,"hidden":false,"merged":[[106,1,106,3],[39,3,39,5],[46,1,46,3],[56,1,56,3],[68,3,68,5],[74,1,74,3],[83,1,83,3],[17,1,17,3],[1,1,1,5],[2,1,2,5],[4,1,4,2],[5,1,5,2],[7,1,7,3]]}
[]
[null,"PLANILHA DE ESTIMATIVA DE CUSTOS"]
[null,"Padrão IN 05/2017 e IN 07/2018 - MPDG"]
[]
[null,6,null,{"$f":"HLOOKUP($B$5,'Dados Gerais'!$D$5:$BH$21,6)","v":"Analista de Design e Cultura Digital - sênior"},"QUANTIDADE",{"$f":"HLOOKUP($B$5,'Dados Gerais'!$D$5:$BH$21,10)","v":2}]
[null,"CCT",null,{"$f":"HLOOKUP($B$5,'Dados Gerais'!$D$5:$BH$21,16)","v":"SINDPD/DF X SINDESEI/DF 2021/2022 Nº DF000608/2021"},"DATA-BASE",{"$f":"HLOOKUP($B$5,'Dados Gerais'!$D$5:$BH$21,17)","v":"2021-05-01"}]
[]
[null,"MÓDULO 1 - COMPOSIÇÃO DA REMUNERAÇÃO",null,null,null,"Valor"]
[null,null,"A","Salário-Base",null,{"$f":"HLOOKUP($B$5,'Dados Gerais'!$D$5:$BH$21,8)","v":7036.27}]
[null,null,"B","Adicional de Periculosidade",null,{"$f":"HLOOKUP($B$5,'Dados Gerais'!$D$5:$BH$38,25)","v":0}]
{"$rows_left_out":110}
{"sheet":"Dados Gerais","index":10,"n_rows":119,"n_cols":60,"rows_kept":119,"cut":false,"hidden":false,"merged":[[2,1,2,2]]}
[]
[]
[null,"INFORMAÇÕES DE ENTRADA"]
[]
[null,null,null,1,2,3,4,5,6,10,11,12,13,14,15,16,17,18,19,20,21,22,23,24,25,26,27,28,29,30,31,32,33,34,35,36,37,38,39,40,41,42,43,44,45,46,47,48,49,50,51,52,53,54,55,56,57,58,59,60]
[null,"",null,"CARGO 1","CARGO 2","CARGO 3","CARGO 4","CARGO 5","CARGO 6","CARGO 10","CARGO 11","CARGO 12","CARGO 13","CARGO 14","CARGO 15","CARGO 16","CARGO 17","CARGO 18","CARGO 19","CARGO 20","CARGO 21","CARGO 22","CARGO 23","CARGO 24","CARGO 25","CARGO 26","CARGO 27","CARGO 28","CARGO 29","CARGO 30","CARGO 31","CARGO 32","CARGO 33","CARGO 34","CARGO 35","CARGO 36","CARGO 37","CARGO 38","CARGO 39","CARGO 40","CARGO 41","CARGO 42","CARGO 43","CARGO 44","CARGO 45","CARGO 46","CARGO 47","CARGO 48","CARGO 49","CARGO 50","CARGO 51","CARGO 52","CARGO 53","CARGO 54","CARGO 55","CARGO 56","CARGO 57","CARGO 58","CARGO 59","CARGO 60"]
[null,"INFORMAÇÕES BÁSICAS"]
[]
[null,"DESCRIÇÃO DOS POSTOS DE SERVIÇO"]
[null,null,null,"Analista de TI - Agile Master - sênior","Analista de TI - Engenheiro de Dados - sênior","Analista de TI - Analista de Dados - sênior","Analista de TI - Arquiteto de Dados - sênior","Analista de TI - Planejamento e Processos Digitais - sênior","Analista de Design e Cultura Digital - sênior"]
{"$rows_left_out":110}
{"sheet":"Encargos Sociais","index":11,"n_rows":45,"n_cols":7,"rows_kept":45,"cut":false,"hidden":false,"merged":[[1,1,1,3],[2,1,2,4]]}
[]
[]
[null,"ENCARGOS SOCIAIS SOBRE A MÃO DE OBRA"]
[null,null,null,null,"Percentuais"]
[]
[null,"Referência:"]
[null,null,"SINAPI OUT/2018"]
[]
[null,"Categorias:"]
[null,null,"TODAS"]
{"$rows_left_out":36}
{"sheet":"BDI","index":12,"n_rows":26,"n_cols":7,"rows_kept":26,"cut":false,"hidden":false,"merged":[[1,1,1,3],[2,1,2,4]]}
[]
[]
[null,"COMPOSIÇÃO DA TAXA DE CUSTOS INDIRETOS, TRIBUTOS E LUCRO - BDI"]
[null,"APLICAÇÃO: MÃO DE OBRA, 13º, MATERIAIS, EPC E EQUIPAMENTO DE REGISTRO DE FREQUÊNCIA",null,null,"Percentuais"]
[]
[null,"Custos Indiretos da Contratada",null,null,{"$f":"SUM(E7:E8)","v":6.0999999999999999E-2}]
[null,null,"A","Administração Central (despesas de gestão da empresa, escritório e treinamento de seu pessoal, e eventuais como máscaras obrigatórias)",2.5999999999999999E-2,null,"* Nota 1 - O Somatório da Administração Central com o Lucro deve ser inferior a 12%"]
[null,null,"B","Seguros, Garantias e Riscos",3.5000000000000003E-2,null,"* Nota 2 - Seguros e Garantias 0,32%, Risco 0,50% (ref. valores 1 quartil constr rodovias, conforme Acordao 2.622-2013)"]
[]
[null,"Lucro",null,null,{"$f":"SUM(E11:E11)","v":0.04}]
{"$rows_left_out":17}
{"sheet":"Sobreaviso","index":13,"n_rows":45,"n_cols":8,"rows_kept":45,"cut":false,"hidden":true,"merged":[[1,1,1,3],[2,1,2,7]]}
[]
[]
[null,"HORAS DE SOBREAVISO SOB DEMANDA"]
[]
[]
[null,null,"CATEGORIAS",null,"DIAS","HORAS / DIA","HORAS / MÊS","% SOBREAVISO"]
[]
[null,null,3,{"$f":"HLOOKUP($C8,'Dados Gerais'!D$5:H$12,6)","v":"Analista de TI - Analista de Dados - sênior"},"SEG A SEX",null,{"$f":"F8*5*52/12","v":0},{"$f":"1/3","v":0.33333333333333331}]
[null,null,null,"Considerando 6 profissionais, 6h/dia, 5 dias na semana, 52 semanas no mês"]
[null,null,3,{"$f":"HLOOKUP($C10,'Dados Gerais'!D$5:H$12,6)","v":"Analista de TI - Analista de Dados - sênior"},"FINS DE SEMANA E FERIADOS",null,{"$f":"F10*2*52/12+F10","v":0},{"$f":"H8","v":0.33333333333333331}]
{"$rows_left_out":36}
{"sheet":"Uniformes","index":14,"n_rows":36,"n_cols":130,"rows_kept":36,"cut":false,"hidden":true,"merged":[[9,1,9,3],[10,1,10,7],[6,3,6,7]]}
[null,null,"CÂMARA DOS DEPUTADOS"]
[null,null,"DEPARTAMENTO TÉCNICO"]
[null,null,"Coordenação de Planejamento e Gestão"]
[]
[null,null,"Data:",{"$f":"'Dados Gerais'!#REF!","v":{"$error":"#REF!"}}]
[null,null,"Processo:",{"$f":"'Dados Gerais'!#REF!","v":{"$error":"#REF!"}}]
[null,null,"Objeto:",{"$f":"'Dados Gerais'!#REF!","v":{"$error":"#REF!"}}]
[]
[]
[]
{"$rows_left_out":27}
{"sheet":"Mat Perm","index":15,"n_rows":113,"n_cols":136,"rows_kept":113,"cut":false,"hidden":true,"merged":[[9,1,9,3],[10,1,10,14]]}
[null,null,"CÂMARA DOS DEPUTADOS"]
[null,null,"DEPARTAMENTO TÉCNICO"]
[null,null,"Coordenação de Planejamento e Gestão"]
[]
[null,null,"Data:",{"$f":"'Dados Gerais'!#REF!","v":{"$error":"#REF!"}}]
[null,null,"Processo:",{"$f":"'Dados Gerais'!#REF!","v":{"$error":"#REF!"}}]
[null,null,"Objeto:",{"$f":"'Dados Gerais'!#REF!","v":{"$error":"#REF!"}}]
[]
[]
[]
{"$rows_left_out":104}
{"sheet":"EPI","index":16,"n_rows":32,"n_cols":128,"rows_kept":32,"cut":false,"hidden":true,"merged":[[9,1,9,3],[10,1,10,5]]}
[null,null,"CÂMARA DOS DEPUTADOS"]
[null,null,"DEPARTAMENTO TÉCNICO"]
[null,null,"Coordenação de Planejamento e Gestão"]
[]
[null,null,"Data:",{"$f":"'Dados Gerais'!#REF!","v":{"$error":"#REF!"}}]
[null,null,"Processo:",{"$f":"'Dados Gerais'!#REF!","v":{"$error":"#REF!"}}]
[null,null,"Objeto:",{"$f":"'Dados Gerais'!#REF!","v":{"$error":"#REF!"}}]
[]
[]
[]
{"$rows_left_out":23}
{"sheet":"Mat Cons","index":17,"n_rows":28,"n_cols":128,"rows_kept":28,"cut":false,"hidden":true,"merged":[[9,1,9,3],[10,1,10,5]]}
[null,null,"CÂMARA DOS DEPUTADOS"]
[null,null,"DEPARTAMENTO TÉCNICO"]
[null,null,"Coordenação de Planejamento e Gestão"]
[]
[null,null,"Data:",{"$f":"'Dados Gerais'!#REF!","v":{"$error":"#REF!"}}]
[null,null,"Processo:",{"$f":"'Dados Gerais'!#REF!","v":{"$error":"#REF!"}}]
[null,null,"Objeto:",{"$f":"'Dados Gerais'!#REF!","v":{"$error":"#REF!"}}]
[]
[]
[]
{"$rows_left_out":19}
{"sheet":"Não Rel - EPI","index":18,"n_rows":38,"n_cols":15,"rows_kept":38,"cut":false,"hidden":true,"merged":[[9,1,9,4],[10,1,10,11]]}
[null,null,"CÂMARA DOS DEPUTADOS"]
[null,null,"DEPARTAMENTO TÉCNICO"]
[null,null,"Coordenação de Planejamento e Gestão"]
[]
[null,null,"Data:",{"$f":"'Dados Gerais'!#REF!","v":{"$error":"#REF!"}}]
[null,null,"Processo:",{"$f":"'Dados Gerais'!#REF!","v":{"$error":"#REF!"}}]
[null,null,"Objeto:",{"$f":"'Dados Gerais'!#REF!","v":{"$error":"#REF!"}}]
[]
[]
[]
{"$rows_left_out":29}
{"sheet":"SREP","index":19,"n_rows":82,"n_cols":15,"rows_kept":82,"cut":false,"hidden":true,"merged":[[9,1,9,3],[10,1,10,14]]}
[null,null,"CÂMARA DOS DEPUTADOS"]
[null,null,"DEPARTAMENTO TÉCNICO"]
[null,null,"Coordenação de Planejamento e Gestão"]
[]
[null,null,"Data:",{"$f":"'Dados Gerais'!#REF!","v":{"$error":"#REF!"}}]
[null,null,"Processo:",{"$f":"'Dados Gerais'!#REF!","v":{"$error":"#REF!"}}]
[null,null,"Objeto:",{"$f":"'Dados Gerais'!#REF!","v":{"$error":"#REF!"}}]
[]
[]
[]
{"$rows_left_out":73}
{"sheet":"Not. Demanda","index":20,"n_rows":44,"n_cols":8,"rows_kept":44,"cut":false,"hidden":true,"merged":[[1,1,1,3],[2,1,2,7]]}
[]
[]
[null,"ADICIONAL NOTURNO SOB DEMANDA"]
[]
[]
[null,null,"CATEGORIAS",null,null,null,"HORAS / ANO","% NOTURNA"]
[]
[null,null,3,{"$f":"HLOOKUP($C8,'Dados Gerais'!$D$5:$BH$10,6)","v":"Analista de TI - Analista de Dados - sênior"},null,null,null,0.2]
[]
[]
{"$rows_left_out":35}
{"sheet":"Equip Rel","index":21,"n_rows":80,"n_cols":136,"rows_kept":80,"cut":false,"hidden":true,"merged":[[9,1,9,3],[10,1,10,14]]}
[null,null,"CÂMARA DOS DEPUTADOS"]
[null,null,"DEPARTAMENTO TÉCNICO"]
[null,null,"Coordenação de Planejamento e Gestão"]
[]
[null,null,"Data:",{"$f":"'Dados Gerais'!#REF!","v":{"$error":"#REF!"}}]
[null,null,"Processo:",{"$f":"'Dados Gerais'!#REF!","v":{"$error":"#REF!"}}]
[null,null,"Objeto:",{"$f":"'Dados Gerais'!#REF!","v":{"$error":"#REF!"}}]
[]
[]
[]
{"$rows_left_out":71}
{"sheet":"Não Rel - Mat","index":22,"n_rows":118,"n_cols":13,"rows_kept":118,"cut":false,"hidden":true,"merged":[[9,1,9,4],[10,1,10,12]]}
[null,null,"CÂMARA DOS DEPUTADOS"]
[null,null,"DEPARTAMENTO TÉCNICO"]
[null,null,"Coordenação de Planejamento e Gestão"]
[]
[null,null,"Data:",{"$f":"'Dados Gerais'!#REF!","v":{"$error":"#REF!"}}]
[null,null,"Processo:",{"$f":"'Dados Gerais'!#REF!","v":{"$error":"#REF!"}}]
[null,null,"Objeto:",{"$f":"'Dados Gerais'!#REF!","v":{"$error":"#REF!"}}]
[]
[]
[]
{"$rows_left_out":109}
{"sheet":"Não Rel - Equip","index":23,"n_rows":50,"n_cols":13,"rows_kept":50,"cut":false,"hidden":true,"merged":[[9,1,9,4],[10,1,10,12]]}
[null,null,"CÂMARA DOS DEPUTADOS"]
[null,null,"DEPARTAMENTO TÉCNICO"]
[null,null,"Coordenação de Planejamento e Gestão"]
[]
[null,null,"Data:",{"$f":"'Dados Gerais'!#REF!","v":{"$error":"#REF!"}}]
[null,null,"Processo:",{"$f":"'Dados Gerais'!#REF!","v":{"$error":"#REF!"}}]
[null,null,"Objeto:",{"$f":"'Dados Gerais'!#REF!","v":{"$error":"#REF!"}}]
[]
[]
[]
{"$rows_left_out":41}
{"sheet":"Não Rel - Depr","index":24,"n_rows":91,"n_cols":15,"rows_kept":91,"cut":false,"hidden":true,"merged":[[9,1,9,3],[10,1,10,14]]}
[null,null,"CÂMARA DOS DEPUTADOS"]
[null,null,"DEPARTAMENTO TÉCNICO"]
[null,null,"Coordenação de Planejamento e Gestão"]
[]
[null,null,"Data:",{"$f":"'Dados Gerais'!#REF!","v":{"$error":"#REF!"}}]
[null,null,"Processo:",{"$f":"'Dados Gerais'!#REF!","v":{"$error":"#REF!"}}]
[null,null,"Objeto:",{"$f":"'Dados Gerais'!#REF!","v":{"$error":"#REF!"}}]
[]
[]
[]
{"$rows_left_out":81}