{"text_format":"1","workbook":"xlsx","n_sheets":35,"sheets":["GUIA PARA PREENCHIMENTO","MODELO PROPOSTA","Remunerações"," RESUMO","1","2","3","4","5","6","7","8","9","10","11","12","Dados Gerais","Encargos Sociais","BDI","Uniformes","EPI","Equip Rel","Mat Cons","Mat Perm","SREP","Não Rel - EPI","Não Rel - Uniformes","Não Rel - Depr","Not. Demanda","SOBREAVISO","Horas extras_Demanda","Não Rel - Mat Consumo","Não Rel - Mat Cons Durável","Não Rel - Peças de rep. sob dem","Não Rel - Serviços"],"not_rendered":{"charts":0,"images":11,"macros":1,"external_links":0,"defined_names":49,"comments":2,"pivot_tables":0},"unopened":[],"bounds":{"document_bytes":16777216,"sheet_cells":100000,"rows_first":2000,"rows_last":500,"rows_between":2000,"halvings":0,"cell_chars":16384,"cell_head_chars":4096},"cells_cut":0,"cells_raw":0,"read":"whole","date_system":"1900"}

{"sheet":"GUIA PARA PREENCHIMENTO","index":0,"n_rows":5,"n_cols":1,"rows_kept":5,"cut":false,"hidden":false,"merged":[]}
["GUIA PARA PREENCHIMENTO"]
[]
["1 - Preencher apenas as guias azuis:"]
[]
["2 - Recomendamos preencher somente as células com fundo azul claro. As demais possuem fórmulas e sugerimos não alterá-las."]

{"sheet":"MODELO PROPOSTA","index":1,"n_rows":73,"n_cols":2,"rows_kept":73,"cut":false,"hidden":false,"merged":[[9,1,9,9],[1,1,1,9],[4,1,4,9],[6,1,6,9],[7,1,7,9],[8,1,8,9],[25,1,25,4],[25,5,25,9],[10,1,10,9],[11,1,11,9],[12,1,12,9],[14,1,14,9],[15,1,15,9],[16,1,16,2],[17,1,18,9],[19,1,19,9],[21,1,21,9],[22,1,22,9],[23,1,23,9],[26,1,26,4],[26,5,26,9],[27,1,27,4],[27,5,27,9],[28,1,28,4],[28,5,28,9],[29,1,29,4],[29,5,29,9],[30,1,30,4],[30,5,30,9],[31,1,31,4],[31,5,31,9],[49,1,49,9],[33,1,33,9],[34,6,34,10],[35,1,35,9],[36,1,36,9],[37,1,37,9],[38,1,38,9],[41,1,41,9],[43,1,43,9],[45,1,45,9],[46,1,46,9],[47,1,47,9],[63,1,63,4],[63,5,63,9],[51,1,51,9],[52,1,52,9],[54,1,54,9],[55,1,55,9],[56,1,56,9],[58,1,58,9],[60,1,60,9],[61,1,61,4],[61,5,61,9],[62,1,62,4],[62,5,62,9],[64,1,64,9],[67,1,67,9],[68,1,68,9],[69,1,69,9],[72,1,72,9]]}
[]
[null,"MODELO DA PROPOSTA COMPLETA"]
[]
[null,"."]
[null,"I – FORMALIZAÇÃO"]
[]
[null,"PREGÃO ELETRÔNICO N. 54/22"]
[null,"OBJETO: Prestação de serviços continuados, por alocação de postos de trabalho, nas áreas de operação e de manutenção preventiva e corretiva dos sistemas de detecção e combate a incêndio da Câmara dos Deputados, com fornecimento de materiais de consumo, ferramentas, equipamentos e, mediante ressarcimento, de peças de reposição e de serviços especializados, pelo período de doze meses."]
[null,"LICITANTE: _____________________________________________________"]
[null,"CNPJ: ________________________________________________________"]
[null,"ENDEREÇO COMPLETO: _________________________________________"]
[null,"TELEFONE:_____________________________________________________"]
[null,"E-MAIL: ________________________________________________________"]
[]
[null,"Apresentamos nossa proposta para o item único da presente licitação, de acordo com as disposições do Edital."]
[null,"Decorre do conteúdo da presente proposta a explicitação do seguinte PREÇO DE JULGAMENTO (GLOBAL ANUAL) PARA O ITEM:"]
[null,{"$f":"' RESUMO'!H89","v":1397172.6296381105}]
[null,{"$f":"Extenso_Valor(B17)","v":"um milhão, trezentos e noventa e sete mil, cento e setenta e dois reais e sessenta e três centavos"}]
[]
[null,"(por extenso)"]
[]
[null,"No valor proposto estão incluídos todos os custos e todas as despesas, diretas e indiretas, para a execução dos serviços objeto da licitação, em conformidade com as especificações e demais condições e exigências constantes do Edital."]
[null,"Informamos que eventuais rubricas dispostas em Acordo ou Convenção Coletiva de Trabalho que não se relacionem ao custo direto da venda do serviço, tais como “Participação nos Resultados” e “Abono substitutivo de Participação nos Resultados”, serão consideradas nos custos indiretos da proposta."]
[null,"O prazo de validade da presente proposta é de ______ (por extenso) dias. (observado o disposto no Título 11 do Edital)."]
[]
[null,"Convenção coletiva de trabalho ou a norma coletiva a que estamos obrigados:"]
[null,"Data-Base:"]
[null,"Número do Registro SRT:"]
[null,"Regime de tributação da empresa:"]
[null,"Empresa é beneficiada pela desoneração da folha de pagamento instituída pela Lei n. 12.546, de 2001, alterada pela Lei n. 13.161, de 2015?"]
[null,"Empresa adere ao PAT (Programa de Alimentação do Trabalhador)?"]
[null,"(Se adere ao PAT): Os valores do auxílio-alimentação apresentados na presente proposta correspondem somente aos efetivamente pagos pela empresa aos empregados?  "]
[]
[null,"DECLARAÇÕES"]
[]
[null,"A SEREM PRESTADAS SOMENTE NA HIPÓTESE DE LICITANTE MICROEMPRESA OU EMPRESA DE PEQUENO PORTE, EM CONFORMIDADE COM OS ARTIGOS 17, 18, 30 E 31 DA LEI COMPLEMENTAR N. 123, de 2006, E O ACÓRDÃO TCU 2798/2010-PLENÁRIO"]
[null,"Declaramos que:"]
[null,"a)   em se tratando dos serviços vedados descritos no artigo 17 da Lei Complementar n. 123, de 2006, notadamente os descritos no inciso XII (cessão ou locação de mão de obra), ressalvados os serviços listados nos parágrafos 5o-B a 5o-E do artigo 18 da referida Lei, a proposta apresentada não contempla qualquer benefício tributário referente ao SIMPLES NACIONAL, conforme os subitens 5.7 e 5.8 do Edital;"]
[null,"b)   na hipótese de contratação desta Microempresa ou Empresa de Pequeno Porte inscrita no SIMPLES NACIONAL e executora de atividade vedada, ficamos sujeitos à exclusão obrigatória no SIMPLES NACIONAL a contar do mês seguinte ao da contratação, em consequência do que dispõem o artigo 17, inciso XII e o artigo 31, inciso II da Lei Complementar n, 123, de 2006, devendo entregar à Câmara dos Deputados, à título de comprovação, cópia de ofício – com comprovante de entrega e recebimento, que comunique a assinatura do contrato de prestação de serviços mediante cessão de mão de obra e encaminhado pela contratada à Receita Federal do Brasil até o último dia útil do mês subsequente ao da contratação, consoante artigo 30, § 1º, inciso II da Lei Complementar n. 123, de 2006."]
[]
[]
[]
[]
[]
[]
[null,"Declaramos, sob as penas da Lei, que:"]
[null,"a)   recolhemos a contribuição previdenciária incidente sobre o valor da receita bruta, em substituição às contribuições previdenciárias incidentes sobre a folha de pagamento, previstas nos incisos I e III do caput do artigo 22 da Lei n. 8.212, de 24 de julho de 1991, na forma do caput do artigo 7º (ou 8º) da Lei n. 12.546, de 14 de dezembro de 2011, alterada pela Lei n. 13.161, de 31 de agosto de 2015;"]
[null,"b)   temos ciência que nossa manifestação, conforme alínea “a” anterior, será remetida à Receita Federal do Brasil e que, em caso de constatação de falsidade, estará sujeita às sanções administrativas cabíveis, sem prejuízo do encaminhamento dos documentos ao Ministério Público para apuração de eventual responsabilidade criminal desta declarante."]
[]
[]
[]
[]
[]
[]
[]
[]
[]
[]
[null,"É OBRIGATÓRIA A COMPROVAÇÃO A QUE SE REFERE A ALÍNEA “A” DO SUBITEM 5.9.5 DO TÍTULO 5 DO EDITAL."]
[]
[null,"DADOS PARA ASSINATURA DO CONTRATO"]
[null,"Nome do signatário"]
[null,"Cargo"]
[null,"Qualificação\n(Naturalidade e domicílio)"]
[null,"OBS.: O signatário deve possuir poderes de administração estabelecidos em contrato social e/ou possuir procuração com poderes para assinar contratos em nome da empresa. \nA documentação comprobatória deverá ser encaminhada quando da assinatura do contrato."]
[]
[]
[null,"Brasília,     de                     de 2022."]
[]
[null,"Assinatura do representante legal da empresa"]
[]
[]
[null,"Nome do representante legal da empresa"]

{"sheet":"Remunerações","index":2,"n_rows":11,"n_cols":11,"rows_kept":11,"cut":false,"hidden":false,"merged":[[0,1,0,10]]}
[null,"QUADRO DE REMUNERAÇÕES"]
[]
[null,null,"ITEM","POSTO DE TRABALHO","QUANTIDADE","SALÁRIO","ADICIONAL DE PERICULOSIDADE","ADICIONAL DE INSALUBRIDADE","ADICIONAL NOTURNO","OUTROS","SALÁRIO COM ADICIONAIS"]
[null,null,1,{"$f":"HLOOKUP($C4,'Dados Gerais'!$D$5:$I$68,6)","v":"BOMBEIRO HIDRÁULICO DE MANUTENÇÃO"},{"$f":"HLOOKUP($C4,'Dados Gerais'!$D$5:$H$68,10)","v":1},{"$f":"HLOOKUP($C4,'Dados Gerais'!$D$5:$I$68,8)","v":2176.5817327117325},{"$f":"HLOOKUP($C4,'Dados Gerais'!$D$5:$I$68,25)","v":0},{"$f":"HLOOKUP($C4,'Dados Gerais'!$D$5:$I$68,31)","v":0},{"$f":"HLOOKUP($C4,'Dados Gerais'!$D$5:$I$68,46)","v":0},{"$f":"HLOOKUP($C4,'Dados Gerais'!$D$5:$I$68,34)","v":0},{"$f":"SUM(F4:J4)","v":2176.5817327117325}]
[null,null,2,{"$f":"HLOOKUP($C5,'Dados Gerais'!$D$5:$I$68,6)","v":"ENCARREGADO DE INSTALAÇÕES"},{"$f":"HLOOKUP($C5,'Dados Gerais'!$D$5:$H$68,10)","v":1},{"$f":"HLOOKUP($C5,'Dados Gerais'!$D$5:$I$68,8)","v":3527.9232628091827},{"$f":"HLOOKUP($C5,'Dados Gerais'!$D$5:$I$68,25)","v":0},{"$f":"HLOOKUP($C5,'Dados Gerais'!$D$5:$I$68,31)","v":0},{"$f":"HLOOKUP($C5,'Dados Gerais'!$D$5:$I$68,46)","v":0},{"$f":"HLOOKUP($C5,'Dados Gerais'!$D$5:$I$68,34)","v":0},{"$f":"SUM(F5:J5)","v":3527.9232628091827}]
[null,null,3,{"$f":"HLOOKUP($C6,'Dados Gerais'!$D$5:$I$68,6)","v":"TÉCNICO EM ELETRÔNICA (DETECÇÃO, ALARME E COMBATE A INCÊNCIO)"},{"$f":"HLOOKUP($C6,'Dados Gerais'!$D$5:$H$68,10)","v":1},{"$f":"HLOOKUP($C6,'Dados Gerais'!$D$5:$I$68,8)","v":2899.8948731090973},{"$f":"HLOOKUP($C6,'Dados Gerais'!$D$5:$I$68,25)","v":0},{"$f":"HLOOKUP($C6,'Dados Gerais'!$D$5:$I$68,31)","v":0},{"$f":"HLOOKUP($C6,'Dados Gerais'!$D$5:$I$68,46)","v":0},{"$f":"HLOOKUP($C6,'Dados Gerais'!$D$5:$I$68,34)","v":0},2899.8948731090973]
[null,null,4,{"$f":"HLOOKUP($C7,'Dados Gerais'!$D$5:$I$68,6)","v":"TÉCNICO EM ELETROTÉCNICA (QUADROS DE COMANDO E AUTOMAÇÃO)"},{"$f":"HLOOKUP($C7,'Dados Gerais'!$D$5:$H$68,10)","v":1},{"$f":"HLOOKUP($C7,'Dados Gerais'!$D$5:$I$68,8)","v":3004.8634828574245},{"$f":"HLOOKUP($C7,'Dados Gerais'!$D$5:$I$68,25)","v":0},{"$f":"HLOOKUP($C7,'Dados Gerais'!$D$5:$I$68,31)","v":0},{"$f":"HLOOKUP($C7,'Dados Gerais'!$D$5:$I$68,46)","v":0},{"$f":"HLOOKUP($C7,'Dados Gerais'!$D$5:$I$68,34)","v":0},3004.8634828574245]
[null,null,5,{"$f":"HLOOKUP($C8,'Dados Gerais'!$D$5:$I$68,6)","v":"OPERADOR DE CENTRAL DE DETECÇÃO E ALARME DE INCÊNDIO"},{"$f":"HLOOKUP($C8,'Dados Gerais'!$D$5:$H$68,10)","v":4},{"$f":"HLOOKUP($C8,'Dados Gerais'!$D$5:$I$68,8)","v":2333.4075053418801},{"$f":"HLOOKUP($C8,'Dados Gerais'!$D$5:$I$68,25)","v":0},{"$f":"HLOOKUP($C8,'Dados Gerais'!$D$5:$I$68,31)","v":0},{"$f":"HLOOKUP($C8,'Dados Gerais'!$D$5:$I$68,46)","v":0},{"$f":"HLOOKUP($C8,'Dados Gerais'!$D$5:$I$68,34)","v":0},{"$f":"SUM(F8:J8)","v":2333.4075053418801}]
[null,null,6,{"$f":"HLOOKUP($C9,'Dados Gerais'!$D$5:$I$68,6)","v":"OPERADOR DE CENTRAL DE DETECÇÃO E ALARME DE INCÊNDIO (COM ADICIONAL NOTURNO)"},{"$f":"HLOOKUP($C9,'Dados Gerais'!$D$5:$H$68,10)","v":4},{"$f":"HLOOKUP($C9,'Dados Gerais'!$D$5:$I$68,8)","v":2333.4075053418801},{"$f":"HLOOKUP($C9,'Dados Gerais'!$D$5:$I$68,25)","v":0},{"$f":"HLOOKUP($C9,'Dados Gerais'!$D$5:$I$68,31)","v":0},{"$f":"HLOOKUP($C9,'Dados Gerais'!$D$5:$I$68,46)","v":272.23},{"$f":"HLOOKUP($C9,'Dados Gerais'!$D$5:$I$68,34)","v":0},2605.6375053418801]
[]
[null,null,null,"TOTAL DE POSTOS",{"$f":"SUM(E4:E9)","v":12}]

{"sheet":" RESUMO","index":3,"n_rows":95,"n_cols":12,"rows_kept":95,"cut":false,"hidden":false,"merged":[[2,1,2,8],[30,1,30,8],[16,1,16,8],[70,3,70,7],[94,7,95,15],[86,3,86,7],[59,3,59,7],[74,3,74,7],[82,3,82,7]]}
[]
[]
[null,"RESUMO  - TOTAIS MENSAIS - FATURA ORDINÁRIA (SEM O 13º E SEM OS ITENS SOB DEMANDA)"]
[]
[]
[null,null,"ITEM","POSTO DE TRABALHO","QUANTIDADE","PREÇO UNIT       (SEM O 13º)","DESTAQUE DO 13º","PREÇO POR EMPREGADO","PREÇO TOTAL (MENSAL)"]
[null,null,1,{"$f":"HLOOKUP(C7,'Dados Gerais'!$D$5:$BK$10,6)","v":"BOMBEIRO HIDRÁULICO DE MANUTENÇÃO"},{"$f":"HLOOKUP(C7,'Dados Gerais'!$D$5:$BK$14,10)","v":1},{"$f":"'1'!$E$116","v":5613.9490875042729},0,{"$f":"G7+F7","v":5613.9490875042729},{"$f":"H7*E7","v":5613.9490875042729}]
[null,null,2,{"$f":"HLOOKUP(C8,'Dados Gerais'!$D$5:$BK$10,6)","v":"ENCARREGADO DE INSTALAÇÕES"},{"$f":"HLOOKUP(C8,'Dados Gerais'!$D$5:$BK$14,10)","v":1},{"$f":"'2'!$E$116","v":8374.0963078099758},0,8374.0963078099758,8374.0963078099758]
[null,null,3,{"$f":"HLOOKUP(C9,'Dados Gerais'!$D$5:$BK$10,6)","v":"TÉCNICO EM ELETRÔNICA (DETECÇÃO, ALARME E COMBATE A INCÊNCIO)"},{"$f":"HLOOKUP(C9,'Dados Gerais'!$D$5:$BK$14,10)","v":1},{"$f":"'3'!$E$116","v":7072.5698379246878},0,7072.5698379246878,7072.5698379246878]
[null,null,4,{"$f":"HLOOKUP(C10,'Dados Gerais'!$D$5:$BK$10,6)","v":"TÉCNICO EM ELETROTÉCNICA (QUADROS DE COMANDO E AUTOMAÇÃO)"},{"$f":"HLOOKUP(C10,'Dados Gerais'!$D$5:$BK$14,10)","v":1},{"$f":"'4'!$E$116","v":7281.8159691392138},0,7281.8159691392138,7281.8159691392138]
[null,null,5,{"$f":"HLOOKUP(C11,'Dados Gerais'!$D$5:$BK$10,6)","v":"OPERADOR DE CENTRAL DE DETECÇÃO E ALARME DE INCÊNDIO"},{"$f":"HLOOKUP(C11,'Dados Gerais'!$D$5:$BK$14,10)","v":4},{"$f":"'5'!$E$116","v":5992.5175184330474},0,5992.5175184330474,23970.070073732189]
[null,null,6,{"$f":"HLOOKUP(C12,'Dados Gerais'!$D$5:$BK$10,6)","v":"OPERADOR DE CENTRAL DE DETECÇÃO E ALARME DE INCÊNDIO (COM ADICIONAL NOTURNO)"},{"$f":"HLOOKUP(C12,'Dados Gerais'!$D$5:$BK$14,10)","v":4},{"$f":"'6'!$E$116","v":6547.8165484330484},0,6547.8165484330484,26191.266193732194]
[]
[null,null,null,"TOTAL MENSAL - SALÁRIOS",null,null,null,null,{"$f":"SUM(I7:I13)","v":78503.76746984254}]
[]
[]
[null,"RESUMO - TOTAIS MENSAIS - DESTAQUE DO 13º SALÁRIO"]
[]
[]
[null,null,"ITEM","POSTO DE TRABALHO","QUANTIDADE","PREÇO UNIT       (SEM O 13º)","DESTAQUE DO 13º","PREÇO POR EMPREGADO","PREÇO TOTAL (MENSAL)"]
[null,null,1,{"$f":"HLOOKUP(C21,'Dados Gerais'!$D$5:$BK$10,6)","v":"BOMBEIRO HIDRÁULICO DE MANUTENÇÃO"},{"$f":"HLOOKUP(C21,'Dados Gerais'!$D$5:$BK$14,10)","v":1},0,{"$f":"G35","v":335.06},{"$f":"G21+F21","v":335.06},{"$f":"H21*E21","v":335.06}]
[null,null,2,{"$f":"HLOOKUP(C22,'Dados Gerais'!$D$5:$BK$10,6)","v":"ENCARREGADO DE INSTALAÇÕES"},{"$f":"HLOOKUP(C22,'Dados Gerais'!$D$5:$BK$14,10)","v":1},0,543.09,{"$f":"G22+F22","v":543.09},543.09]
[null,null,3,{"$f":"HLOOKUP(C23,'Dados Gerais'!$D$5:$BK$10,6)","v":"TÉCNICO EM ELETRÔNICA (DETECÇÃO, ALARME E COMBATE A INCÊNCIO)"},{"$f":"HLOOKUP(C23,'Dados Gerais'!$D$5:$BK$14,10)","v":1},0,446.40999999999997,446.40999999999997,446.40999999999997]
[null,null,4,{"$f":"HLOOKUP(C24,'Dados Gerais'!$D$5:$BK$10,6)","v":"TÉCNICO EM ELETROTÉCNICA (QUADROS DE COMANDO E AUTOMAÇÃO)"},{"$f":"HLOOKUP(C24,'Dados Gerais'!$D$5:$BK$14,10)","v":1},0,462.58000000000004,462.58000000000004,462.58000000000004]
[null,null,5,{"$f":"HLOOKUP(C25,'Dados Gerais'!$D$5:$BK$10,6)","v":"OPERADOR DE CENTRAL DE DETECÇÃO E ALARME DE INCÊNDIO"},{"$f":"HLOOKUP(C25,'Dados Gerais'!$D$5:$BK$14,10)","v":4},0,383.15,383.15,1532.6]
[null,null,6,{"$f":"HLOOKUP(C26,'Dados Gerais'!$D$5:$BK$10,6)","v":"OPERADOR DE CENTRAL DE DETECÇÃO E ALARME DE INCÊNDIO (COM ADICIONAL NOTURNO)"},{"$f":"HLOOKUP(C26,'Dados Gerais'!$D$5:$BK$14,10)","v":4},0,425.07000000000005,425.07000000000005,1700.2800000000002]
[]
[null,null,null,"TOTAL MENSAL - DESTAQUE DO 13º",null,null,null,null,{"$f":"SUM(I21:I27)","v":5020.0200000000004}]
[]
[]
[null,"RESUMO  - TOTAIS MENSAIS - FATURA ORDINÁRIA TOTAL"]
[]
[]
[null,null,"ITEM","POSTO DE TRABALHO","QUANTIDADE","PREÇO UNIT       (SEM O 13º)","DESTAQUE DO 13º","PREÇO POR EMPREGADO","PREÇO TOTAL (MENSAL)"]
[null,null,1,{"$f":"HLOOKUP(C35,'Dados Gerais'!$D$5:$BK$10,6)","v":"BOMBEIRO HIDRÁULICO DE MANUTENÇÃO"},{"$f":"HLOOKUP(C35,'Dados Gerais'!$D$5:$BK$14,10)","v":1},{"$f":"'1'!$E$116","v":5613.9490875042729},{"$f":"'1'!$E$117","v":335.06},{"$f":"G35+F35","v":5949.0090875042733},{"$f":"H35*E35","v":5949.0090875042733},null,{"$f":"I35/$I$42","v":7.1225327151887702E-2},{"$f":"$I$58*K35","v":2343.8307152988641}]
[null,null,2,{"$f":"HLOOKUP(C36,'Dados Gerais'!$D$5:$BK$10,6)","v":"ENCARREGADO DE INSTALAÇÕES"},{"$f":"HLOOKUP(C36,'Dados Gerais'!$D$5:$BK$14,10)","v":1},{"$f":"'2'!$E$116","v":8374.0963078099758},{"$f":"'2'!$E$117","v":543.09},8917.1863078099759,8917.1863078099759,null,0.10676223598013505,3513.2531913908397]
[null,null,3,{"$f":"HLOOKUP(C37,'Dados Gerais'!$D$5:$BK$10,6)","v":"TÉCNICO EM ELETRÔNICA (DETECÇÃO, ALARME E COMBATE A INCÊNCIO)"},{"$f":"HLOOKUP(C37,'Dados Gerais'!$D$5:$BK$14,10)","v":1},{"$f":"'3'!$E$116","v":7072.5698379246878},{"$f":"'3'!$E$117","v":446.40999999999997},7518.9798379246877,7518.9798379246877,null,9.0022017268308427E-2,2962.3783780828021]
[null,null,4,{"$f":"HLOOKUP(C38,'Dados Gerais'!$D$5:$BK$10,6)","v":"TÉCNICO EM ELETROTÉCNICA (QUADROS DE COMANDO E AUTOMAÇÃO)"},{"$f":"HLOOKUP(C38,'Dados Gerais'!$D$5:$BK$14,10)","v":1},{"$f":"'4'!$E$116","v":7281.8159691392138},{"$f":"'4'!$E$117","v":462.58000000000004},7744.3959691392138,7744.3959691392138,null,9.2720842813018262E-2,3051.1893454713381]
[null,null,5,{"$f":"HLOOKUP(C39,'Dados Gerais'!$D$5:$BK$10,6)","v":"OPERADOR DE CENTRAL DE DETECÇÃO E ALARME DE INCÊNDIO"},{"$f":"HLOOKUP(C39,'Dados Gerais'!$D$5:$BK$14,10)","v":4},{"$f":"'5'!$E$116","v":5992.5175184330474},{"$f":"'5'!$E$117","v":383.15},6375.667518433047,25502.670073732188,null,0.3053342149138088,10047.713923735661]
[null,null,6,{"$f":"HLOOKUP(C40,'Dados Gerais'!$D$5:$BK$10,6)","v":"OPERADOR DE CENTRAL DE DETECÇÃO E ALARME DE INCÊNDIO (COM ADICIONAL NOTURNO)"},{"$f":"HLOOKUP(C40,'Dados Gerais'!$D$5:$BK$14,10)","v":4},{"$f":"'6'!$E$116","v":6547.8165484330484},{"$f":"'6'!$E$117","v":425.07000000000005},6972.8865484330481,27891.546193732192,null,0.33393536187284178,10988.899446020503]
[null,null,null,null,null,null,null,null,null,null,0,{"$f":"#REF!*K41","v":{"$error":"#REF!"}}]
[null,null,null,"TOTAL MENSAL - SALÁRIOS",null,null,null,null,{"$f":"SUM(I35:I41)","v":83523.787469842529},null,null,{"$f":"#REF!*K42","v":{"$error":"#REF!"}}]
[]
[null,null,"ITEM","DESCRIÇÃO",null,null,null,null,"PREÇO TOTAL (MENSAL)"]
[null,null,"EQUIP","EQUIPAMENTOS NÃO RELACIONADOS DIRETAMENTE A UM POSTO DE TRABALHO",null,null,null,null,0]
[null,null,"HEXTRA","HORAS EXTRAS (SOB DEMANDA)",null,null,null,null,{"$f":"'Horas extras_Demanda'!G76","v":0}]
[null,null,"HNOT","ADICIONAL DE HORAS NOTURNAS (SOB DEMANDA)",null,null,null,null,{"$f":"'Not. Demanda'!G56","v":0}]
[null,null,"SOBREAV","HORAS DE SOBREAVISO (SOB DEMANDA)",null,null,null,null,{"$f":"SOBREAVISO!G50","v":0}]
[null,null,"SREP","SISTEMA DE REGISTRO ELETRÔNICO DE PRESENÇA - SREP",null,null,null,null,{"$f":"SREP!$M$45","v":629.92000000000007}]
[null,null,"EPI - N.REL","EQUIPAMENTOS DE PROTEÇÃO INDIVIDUAL NÃO RELACIONADOS DIRETAMENTE A UM POSTO DE TRABALHO",null,null,null,null,{"$f":"'Não Rel - EPI'!K15","v":98.164166666666688}]
[null,null,"UNIFORMES - N.REL","UNIFORMES NÃO RELACIONADOS DIRETAMENTE A UM POSTO DE TRABALHO",null,null,null,null,{"$f":"'Não Rel - Uniformes'!K30","v":0}]
[null,null,"FERR - N.REL","FERRAMENTAS NÃO RELACIONADAS DIRETAMENTE A UM POSTO DE TRABALHO",null,null,null,null,{"$f":"'Não Rel - Depr'!M62","v":73.710000000000008}]
[null,null,"MAT SOB DEMANDA","MATERIAIS NÃO RELACIONADOS DIRETAMENTE A UM POSTO DE TRABALHO - AQUISIÇÃO SOB DEMANDA",null,null,null,null,{"$f":"'Não Rel - Mat Consumo'!L25","v":588.37499999999989}]
[null,null,"MAT CONS DURAVEL SOB DEMANDA","MATERIAIS DE CONSUMO DURÁVEL NÃO RELACIONADOS DIRETAMENTE A UM POSTO DE TRABALHO - AQUISIÇÃO SOB DEMANDA",null,null,null,null,{"$f":"'Não Rel - Mat Cons Durável'!L42","v":0}]
[null,null,"PEÇAS REPOS. SOB DEMANDA","PREÇAS DE REPOSIÇÃO - AQUISIÇÃO SOB DEMANDA",null,null,null,null,{"$f":"'Não Rel - Peças de rep. sob dem'!K99","v":12441.606666666672}]
[null,null,"SERV SOB DEMANDA","SERVIÇOS NÃO RELACIONADOS DIRETAMENTE A UM POSTO DE TRABALHO - AQUISIÇÃO SOB DEMANDA",null,null,null,null,{"$f":"'Não Rel - Serviços'!K24","v":19075.48916666667}]
[]
[null,null,null,"TOTAL MENSAL - ITENS SOB DEMANDA",null,null,null,null,{"$f":"SUM(I45:I57)","v":32907.265000000007},null,{"$f":"(I58+I42)*12","v":1397172.6296381105}]
[]
[null,null,null,"TOTAL MENSAL  - ITENS ORDINÁRIOS"]
[null,null,null,"DESCRIÇÃO",null,null,null,"VALOR"]
[null,null,null,"Postos de Trabalho - Inclusive 13º Salário",null,null,null,{"$f":"I42","v":83523.787469842529}]
[null,null,null,"Adicional de Horas Noturnas",null,null,null,0]
[null,null,null,"Sistema de Registro Eletrônico de Presença - SREP",null,null,null,{"$f":"I49","v":629.92000000000007}]
[null,null,null,"Equipamentos de Proteção Individual não relacionados diretamente a um posto de trabalho",null,null,null,{"$f":"I50","v":98.164166666666688}]
[null,null,null,"Uniformes não relacionados diretamente a um posto de trabalho",null,null,null,0]
[null,null,null,"Ferramentas não relacionadas diretamente a um posto de trabalho",null,null,null,73.710000000000008]
[]
[null,null,null,null,null,null,"TOTAL MENSAL DA CONTRATAÇÃO",{"$f":"SUM(H62:H68)","v":84325.581636509203}]
[]
[null,null,null,"TOTAL ANUAL  - ITENS ORDINÁRIOS"]
[]
[null,null,null,null,null,null,"12 x TOTAL MENSAL",{"$f":"H69*12","v":1011906.9796381104}]
[]
[null,null,null,"TOTAL MENSAL  - ITENS SOB DEMANDA"]
[null,null,null,"DESCRIÇÃO",null,null,null,"VALOR"]
[null,null,null,"MATERIAIS NÃO RELACIONADOS DIRETAMENTE A UM POSTO DE TRABALHO (SOB DEMANDA)",null,null,null,{"$f":"I53","v":588.37499999999989}]
[null,null,null,"PEÇAS DE REPOSIÇÃO (SOB DEMANDA)",null,null,null,{"$f":"I55","v":12441.606666666672}]
[null,null,null,"SERVIÇOS (SOB DEMANDA)",null,null,null,{"$f":"I56","v":19075.48916666667}]
[]
[null,null,null,null,null,null,"TOTAL MENSAL DA CONTRATAÇÃO",{"$f":"SUM(H77:H80)","v":32105.47083333334}]
[]
[null,null,null,"TOTAL ANUAL  - ITENS SOB DEMANDA"]
[]
[null,null,null,null,null,null,"12 x TOTAL MENSAL",{"$f":"H81*12","v":385265.65000000008}]
[]
[null,null,null,"TOTAL ANUAL GLOBAL DA CONTRATAÇÃO"]
[]
[null,null,null,null,null,null,null,{"$f":"H85+H73","v":1397172.6296381105}]
[]
[]
[]
[null,null,null,null,null,null,"TOTAL MENSAL",{"$f":"H69+H81","v":116431.05246984254}]
[]
[null,null,null,null,null,null,null,{"$f":"Extenso_Valor($H$93)","v":"cento e dezesseis mil, quatrocentos e trinta e um reais e cinco centavos"}]

{"sheet":"1","index":4,"n_rows":119,"n_cols":8,"rows_kept":119,"cut":false,"hidden":false,"merged":[[106,1,106,3],[1,1,1,5],[2,1,2,5],[7,1,7,3],[17,1,17,3],[4,1,4,2],[46,1,46,3],[56,1,56,3],[74,1,74,3],[83,1,83,3],[5,1,5,2],[39,3,39,5],[68,3,68,5]]}
[]
[null,"PLANILHA DE ESTIMATIVA DE CUSTOS"]
[null,"Padrão IN 05/2017 e IN 07/2018 - MPDG"]
[]
[null,1,null,{"$f":"HLOOKUP($B$5,'Dados Gerais'!$D$5:$BK$20,6)","v":"BOMBEIRO HIDRÁULICO DE MANUTENÇÃO"},"QUANTIDADE",{"$f":"HLOOKUP($B$5,'Dados Gerais'!$D$5:$BK$20,10)","v":1}]
[null,"CCT",null,{"$f":"HLOOKUP($B$5,'Dados Gerais'!$D$5:$BK$20,15)","v":"CCT STICOMBE/DF x SINDUSCON/DF 2021/2023"},"DATA-BASE",{"$f":"'Dados Gerais'!F20","v":"2021-05-01"}]
[]
[null,"MÓDULO 1 - COMPOSIÇÃO DA REMUNERAÇÃO",null,null,null,"Valor"]
[null,null,"A","Salário-Base",null,{"$f":"HLOOKUP($B$5,'Dados Gerais'!$D$5:$BK$20,8)","v":2176.5817327117325}]
[null,null,"B","Adicional de Periculosidade",null,{"$f":"HLOOKUP($B$5,'Dados Gerais'!$D$5:$BK$37,25)","v":0}]
[null,null,"C","Adicional de Insalubridade",null,{"$f":"HLOOKUP($B$5,'Dados Gerais'!$D$5:$BK$37,31)","v":0}]
[null,null,"D","Adicional Noturno",null,{"$f":"HLOOKUP($B$5,'Dados Gerais'!$D$5:$BK$50,46)","v":0},null,"* Nota 1 - O Módulo 1 refere-se ao valor mensal devido ao empregado pela prestação do serviço no período de 12 meses."]
[null,null,"E","Adicional de Hora Extra",null,{"$f":"HLOOKUP($B$5,'Dados Gerais'!$D$5:$BK$67,63)","v":0},null,"* Nota 2 - O adicional de hora extra no feriado trabalhado foi suprimido pela Lei 13.467/17"]
[null,null,"F","Outros (especificar)",null,{"$f":"HLOOKUP($B$5,'Dados Gerais'!$D$5:$BK$59,33)","v":0},null,"* Nota 3 - ART. 7º, § 2º, DA LEI Nº 605/49.Sendo mensalista o obreiro, o adicional noturno pago de forma fixa já é considerado integrado para os efeitos do pagamento do repouso semanal remunerado, nos termos do art. 7º, § 2º, da Lei nº 605/49."]
[]
[null,null,null,"TOTAL DA REMUNERAÇÃO",null,{"$f":"SUM(F9:F14)","v":2176.5817327117325}]
[]
[null,"MÓDULO 2 - ENCARGOS E BENEFÍCIOS ANUAIS, MENSAIS E DIÁRIOS",null,null,"Percentuais","Valor"]
[null,"Submódulo 2.1 - 13º Salário, Férias e Adicional de Férias"]
[null,null,"A","13º Salário - Calculado no Módulo 7 - Destacado",0,{"$f":"ROUND(E20*F$16,2)","v":0}]
[null,null,"B","Adicional de Férias",{"$f":"'Encargos Sociais'!E30","v":3.03030303030303E-2},{"$f":"ROUND(E21*F$16,2)","v":65.959999999999994},null,"* Nota 1 - Provisiona-se, mensalmente, o proporcional a 1/12 dos valores referentes a gratificação natalina, férias e adicional de férias."]
[null,null,null,null,null,null,null,"* Nota 2 - O adicional de férias contido no Submódulo 2.1 corresponde a 1/3 da remuneração que, por sua vez, é dividida por 12 contome Nota 1."]
[null,"Submódulo 2.2 - Encargos Previdenciários (GPS), Fundo de Garantia por Tempo de Serviço (FGTS) e Outras Contribuições"]
[null,null,"A","INSS (art. 22, inciso I, Lei nº 8.212/91)",{"$f":"'Encargos Sociais'!E13","v":0.2},{"$f":"ROUND(E24*($F$16+$F$41+$F$73),2)","v":496.8}]
[null,null,"B","Salário Educação (art. 3º, inciso I, Decreto nº 87.043/82)",{"$f":"'Encargos Sociais'!E14","v":2.5000000000000001E-2},{"$f":"ROUND(E25*($F$16+$F$41+$F$73),2)","v":62.1}]
[null,null,"C","SAT/RAT (art. 22, II, Lei 8.212/91 e Anexo V, Decreto 6.042/07) - Enquadramento 8211-3/00",{"$f":"'Encargos Sociais'!E15","v":0.01},24.84]
[null,null,"D","SESC ou SESI (art. 30, Lei nº 8.036/90 e art. 1º, Lei 8.154/90)",{"$f":"'Encargos Sociais'!E16","v":1.4999999999999999E-2},37.26]
[null,null,"E","SENAI ou SENAC (Decreto nº 2.318/86)",{"$f":"'Encargos Sociais'!E17","v":0.01},24.84]
[null,null,"F","SEBRAE (§ 3º, art. 8º, Lei 8.029/90, alterada pela Lei nº 8.154/90)",{"$f":"'Encargos Sociais'!E18","v":6.0000000000000001E-3},14.9]
[null,null,"G","INCRA (art. 1º, I, Decreto Lei 1.146/70 e Lei 7.787, de 30/06/89)",{"$f":"'Encargos Sociais'!E19","v":2E-3},4.97,null,"* Nota 1 - Os percentuais dos encargos previdenciários, do FGTS e demais contribuições são estabelecidos por legislação vigente."]
[null,null,"H","FGTS (Lei Complementar nº 110/01 e art. 30, Lei nº 8.036/90)",{"$f":"'Encargos Sociais'!E20","v":0.08},198.72,null,"* Nota 2 - O SAT, a depender do grau de risco do serviço, irá variar entre 1%, para risco leve, de 2%, para risco médio, e de 3% para risco grave."]
[null,null,"I","SECONCI (Convenções Coletivas de Trabalho da construção)",{"$f":"'Encargos Sociais'!E21","v":0.01},24.84,null,"* Nota 3 - Os percentuais do Submódulo 2.2 incidem sobre o Módulo 1 e o Submódulo 2.1."]
[]
[null,"Submódulo 2.3 - Benefícios Mensais e Diários"]
[null,null,"A","Auxílio Transporte",null,{"$f":"HLOOKUP($B$5,'Dados Gerais'!$D$5:$BK$93,82)","v":302.54000000000002}]
[null,null,"B","Auxílio Alimentação",null,{"$f":"HLOOKUP($B$5,'Dados Gerais'!$D$5:$BK$93,89)","v":534.82000000000005}]
[null,null,"C","Assistência Médica e Familiar",null,{"$f":"HLOOKUP($B$5,'Dados Gerais'!$D$5:$BK$101,97)","v":0}]
[null,null,"D","Outros (Seguro de vida e auxílio funeral e auxílio odontológico)",null,{"$f":"HLOOKUP($B$5,'Dados Gerais'!$D$5:$BK$118,114)","v":0},null,"* Nota 1 - O valor informado deverá ser o custo real do benefício (descontado o valor eventualmente pago pelo empregado)."]
[null,null,null,null,null,null,null,"* Nota 2 - Observar a previsão dos benefícios contidos em Acordos, Convenções e Dissídios Coletivos de Trabalho e o disposto no art. 6º da IN 5/2017"]
[null,null,null,"QUADRO-RESUMO DO MÓDULO 2"]
[null,null,null,"2.1 - 13º Salário, Férias e Adicional de Férias - 13º Destacado - Calculado no Módulo 7 ",{"$f":"SUM(E20:E21)","v":3.03030303030303E-2},{"$f":"F20+F21","v":65.959999999999994}]
[null,null,null,"2.2 - Encargos Previdenciários (GPS), Fundo de Garantia por Tempo de Serviço (FGTS) e Contribuições",{"$f":"SUM(E24:E32)","v":0.35800000000000004},{"$f":"SUM(F24:F32)","v":889.2700000000001}]
[null,null,null,"2.3 - Benefícios Mensais e Diários",null,{"$f":"SUM(F35:F38)","v":837.36000000000013}]
[]
[null,null,null,"TOTAL DOS ENCARGOS E BENEFÍCIOS",null,{"$f":"SUM(F41:F43)","v":1792.5900000000001}]
[]
[null,"MÓDULO 3 - PREVISÃO PARA RESCISÃO",null,null,"Percentuais","Valor"]
[null,null,"A","Aviso Prévio Indenizado (Art. 7º, inciso XXI, da CF/1988 e arts. 477, 487, §1º, e 491 da CLT)",{"$f":"'Encargos Sociais'!E35","v":8.3333333333333332E-3},{"$f":"ROUND(E48*$F$16,2)","v":18.14}]
[null,null,"B","Incidência do FGTS sobre o Aviso Prévio Indenizado (Súmula 305 TST)",{"$f":"'Encargos Sociais'!E36","v":6.6666666666666664E-4},1.45,null,"* Nota 1 - Adotou-se os parâmetros do estudo do STF (http://www.stf.jus.br/arquivo/cms/sobrestfestudosci/anexo/encargos_sociais_03102007.pdf), onde 5% do pessoal é demitido pelo empregador no decurso do contrato (para estes, considerou-se o aviso prévio indenizado). Desprezou-se as demissões por justa causa e os pedidos de demissão."]
[null,null,"C","Multa do FGTS e Contribuição Social sobre o Aviso Prévio Indenizado (Art. 18, §1º, da Lei 8.036/1990 e art. 1º da LC nº 110/2001)",{"$f":"'Encargos Sociais'!E37","v":1.274074074074074E-3},2.77,null,"* Nota 2 - No cálculo do percentual, considerou-se 36 dias, correspondendo à metade da duração média dos contratos (2 anos)"]
[null,null,"D","Aviso Prévio Trabalhado (Art. 488, parágrafo único, CLT)",{"$f":"'Encargos Sociais'!E38","v":1.2037037037037035E-2},26.2,null,"* Nota 3 - Incide sobre a Remuneração + 13º salário (1/12) + Férias (1/12) + Adicional de Férias (1/36) x 50% multa (40% para o empregado e 10% de contribuição social) x 8% FGTS"]
[null,null,"E","Incidência de GPS, FGTS e outras contribuições sobre o Aviso Prévio Trabalhado",{"$f":"'Encargos Sociais'!E39","v":4.3092592592592583E-3},9.3800000000000008,null,"* Nota 4 - Os 95% restantes do cálculo, a um prazo médio de contrato de 4 anos. Assim, calcula-se 7 dias para o 1º ano de contrato e mais 3 dias para os 3 anos seguintes."]
[null,null,"F","Multa do FGTS e Contribuição Social sobre o Aviso Prévio Trabalhado",{"$f":"'Encargos Sociais'!E40","v":3.0505155555555549E-2},66.400000000000006]
[]
[null,null,null,"TOTAL DE PREVISÃO PARA RESCISÃO",null,{"$f":"SUM(F48:F53)","v":124.34}]
[]
[null,"MÓDULO 4 - CUSTO DE REPOSIÇÃO DO PROFISSIONAL AUSENTE",null,null,"Percentuais","Valor"]
[null,"Submódulo 4.1 - Ausências Legais"]
[null,null,"A","Férias (Arts. 129 e 130, inc. I, da CLT)",{"$f":"'Encargos Sociais'!E24","v":9.0909090909090912E-2},{"$f":"ROUND(E59*$F$16,2)","v":197.87},null,"* Nota 1 - As alíneas “A” a “F” referem-se somente ao custo que será pago ao repositor pelos dias \ntrabalhados quando da necessidade de substituir a mão de obra alocada na prestação do serviço."]
[null,null,"B","Ausências Legais (Arts. 131 e 473 da CLT)",{"$f":"'Encargos Sociais'!E25","v":7.9365079365079361E-3},17.27,null,"* Nota 2 - Adotou-se a estimativa do SINAPI de 2 dias por ano."]
[null,null,"C","Licença-Paternidade (Art. 7º, XIX, e art. 10, §1º, do ADCT, CF/1988 e Art. 1º, II, da Lei 11.770/2008)",{"$f":"'Encargos Sociais'!E26","v":8.2777777777777776E-4},1.8,null,"* Nota 3 - Utilizada a proporção de 50% para homens, 5 dias de afastamento, e a probabilidade de um trabalhador requerer a Licença Paternidade em 5,22%, conforme SINAPI (citando dados da PNAD 2015)"]
[null,null,"D","Ausência por Acidente de Trabalho (Art. 131, III, da CLT)",{"$f":"'Encargos Sociais'!E27","v":8.541666666666667E-4},1.86,null,"* Nota 4 - Utilzada a estatística de 1,96% dos contribuintes beneficiados com a emissão do auxílio, conforme Anuário Estatístico da Previdência Social. Afastamento de 15 dias a cargo da empresa."]
[null,null,"E","Afastamento Maternidade (Art. 71 da Lei nº 8.213/1991)",{"$f":"'Encargos Sociais'!E28","v":3.2925925925925922E-3},7.17,null,"* Nota 5 - Utilizada a proporção de 50% para mulheres, 180 dias de afastamento, e a probabilidade de uma trabalhadora requerer a Licença Maternidade em 4,91%, conforme SINAPI (citando dados do IBGE 2016)"]
[null,null,"F","Auxílio Enfermidade - Doença (Art. 59 da Lei nº 8.213/1991)",{"$f":"'Encargos Sociais'!E29","v":7.1222222222222225E-3},15.5,null,"* Nota 6 - Utilizada a estatística de 3,37% dos contribuintes beneficiados com o auxílio, conforme Anuário Estatístico da Previdência Social de 2015 (acrescidos de 2 dias ao ano, para os quais o trabalhador nem requer o benefício da Previdência - conforme SINAPI)"]
[]
[null,"Submódulo 4.2 - Intrajornada"]
[null,null,"A","Intervalo para repouso ou alimentação",{"$f":"'Encargos Sociais'!E32","v":0},{"$f":"ROUND(E67*$F$16,2)","v":0}]
[]
[null,null,null,"QUADRO-RESUMO DO MÓDULO 4",null,"Valor"]
[null,null,null,"4.1 - Ausências Legais",{"$f":"SUM(E59:E64)","v":0.11094235810485811},{"$f":"ROUND(E70*$F$16,2)","v":241.48}]
[null,null,null,"4.2 - Intrajornada",{"$f":"E67","v":0},{"$f":"ROUND(E71*$F$16,2)","v":0}]
[]
[null,null,null,"TOTAL DE PREVISÃO PARA RESCISÃO E INTERVALO INTRAJORNADA",null,{"$f":"SUM(F70:F71)","v":241.48}]
[]
[null,"MÓDULO 5 - INSUMOS DIVERSOS",null,null,null,"Valor"]
[null,null,"A","Uniformes - aquisição",null,{"$f":"ROUND(HLOOKUP($B$5,Uniformes!K3:DZ33,3)/12,2)","v":32.380000000000003}]
[null,null,"B","Materiais de consumo relacionados ao posto - aquisição",null,{"$f":"ROUND(HLOOKUP(B5,'Mat Cons'!I11:DX13,3)/12,2)","v":0}]
[null,null,"C","Materiais permanentes relacionados ao posto - remuneração da sua depreciação / manutenção",null,{"$f":"HLOOKUP(B5,'Mat Perm'!Q11:EF13,3)","v":0}]
[null,null,"D","Equipamentos relacionados ao posto - remuneração da sua depreciação / manutenção",null,{"$f":"HLOOKUP(B5,'Equip Rel'!Q11:EF13,3)","v":0}]
[null,null,"E","Equipamentos de Proteção Individual - EPI - aquisição",null,{"$f":"ROUND(HLOOKUP(B5,EPI!I3:DX67,3)/12,2)","v":55.15}]
[]
[null,null,null,"TOTAL DE INSUMOS DIVERSOS",null,{"$f":"SUM(F76:F81)","v":87.53},null,"* Nota - Valores mensais por empregado"]
[]
[null,"MÓDULO 6 - CUSTOS INDIRETOS, TRIBUTOS E LUCRO - BDI",null,null,"Percentuais","Valor"]
[null,null,"A","Custos Indiretos",{"$f":"BDI!E6","v":4.4400000000000002E-2}]
[null,null,"A.1","Administração Central",{"$f":"BDI!E7","v":3.9E-2}]
[null,null,"A.2","Seguros, Garantias e Riscos",{"$f":"BDI!E8","v":5.4000000000000003E-3}]
[null,null,"B","Lucro",{"$f":"BDI!E10","v":0.06}]
[null,null,"C","Tributos",{"$f":"SUM(E90:E91)","v":0.124}]
[null,null,"C.1","Tributos Federais (COFINS, PIS e CPRB)",{"$f":"BDI!E18","v":7.3999999999999996E-2}]
[null,null,"C.2","Tributos Distritais (ISS)",{"$f":"BDI!E23","v":0.05},null,null,"* Nota - Utilizou-se o indicado pelo Sindicato da Arquitetura e da Engenharia (Sinaenco, 2008, p. 22), que adota um percentual redutor de 20% no cálculo dos custos tributários relativos às contribuições PIS e COFINS"]
[null,null,"D","Despesas Financeiras",{"$f":"BDI!E13","v":4.4669210982628549E-3}]
[]
[null,null,null,"TOTAL DE BDI",{"$f":"BDI!E26","v":0.26939999999999997},{"$f":"E94*E102","v":1191.4273547925407}]
[]
[null,null,null,"QUADRO-RESUMO DO CUSTO MENSAL POR EMPREGADO - SEM O 13º","Valor"]
[null,null,null,"Módulo 1 - Composição da Remuneração",{"$f":"F16","v":2176.5817327117325}]
[null,null,null,"Módulo 2 - Encargos e Benefícios Anuais, Mensais e Diários",{"$f":"F45","v":1792.5900000000001}]
[null,null,null,"Módulo 3 - Provisão para Rescisão",{"$f":"F55","v":124.34}]
[null,null,null,"Módulo 4 - Custo de Reposição do Profissional Ausente",{"$f":"F73","v":241.48}]
[null,null,null,"Módulo 5 - Insumos Diversos",{"$f":"F82","v":87.53}]
[null,null,null,"SUBTOTAL (A+B+C+D+E)",{"$f":"SUM(E97:E101)","v":4422.5217327117325}]
[null,null,null,"Módulo 6 - Custos Indiretos, Tributos e Lucro",{"$f":"F94","v":1191.4273547925407}]
[]
[null,null,null,"TOTAL DO POSTO",{"$f":"SUM(E102:E103)","v":5613.9490875042729}]
[]
[null,"MÓDULO 7 - DESTAQUE DO MÓDULO 2 - 13º SALÁRIO",null,null,"Percentuais","Valor"]
[null,null,"A","13º Salário",{"$f":"'Encargos Sociais'!E31","v":8.3333333333333329E-2},{"$f":"ROUND(E108*F$16,2)","v":181.38}]
[null,null,"B","Encargos Sociais sobre o 13º Salário - Taxa calculada no SUBMÓDULO 2.2",{"$f":"SUM($E$24:$E$32)","v":0.35800000000000004},{"$f":"ROUND(E109*$F$108,2)","v":64.930000000000007},null,"* Nota 1 - Provisiona-se, mensalmente, o proporcional a 1/12 dos valores referentes a gratificação natalina e adicional de férias."]
[null,null,"C","Reincidência de férias sobre o 13º Salário",{"$f":"E59","v":9.0909090909090912E-2},{"$f":"ROUND(E110*($F$108+$F$109),2)","v":22.39}]
[null,null,"D","BDI sobre o 13º Salário - Taxa calculada no MÓDULO 6",{"$f":"E94","v":0.26939999999999997},{"$f":"ROUND(E111*($F$108+$F$109),2)","v":66.36}]
[]
[null,null,null,"TOTAL DO DESTAQUE DO 13º SALÁRIO",null,{"$f":"SUM(F108:F111)","v":335.06}]
[]
[null,null,null,"QUADRO-RESUMO DO CUSTO MENSAL POR EMPREGADO","Valor"]
[null,null,null,"Custo total - sem o 13º Salário",{"$f":"E105","v":5613.9490875042729}]
[null,null,null,"Destaque do 13º Salário (valor mensal)",{"$f":"F113","v":335.06}]
[]
[null,null,null,"TOTAL DO POSTO",{"$f":"E116+E117","v":5949.0090875042733}]

{"sheet":"2","index":5,"n_rows":119,"n_cols":8,"rows_kept":119,"cut":false,"hidden":false,"merged":[[1,1,1,5],[2,1,2,5],[4,1,4,2],[5,1,5,2],[7,1,7,3],[17,1,17,3],[106,1,106,3],[39,3,39,5],[46,1,46,3],[56,1,56,3],[68,3,68,5],[74,1,74,3],[83,1,83,3]]}
[]
[null,"PLANILHA DE ESTIMATIVA DE CUSTOS"]
[null,"Padrão IN 05/2017 e IN 07/2018 - MPDG"]
[]
[null,2,null,{"$f":"HLOOKUP($B$5,'Dados Gerais'!$D$5:$BK$20,6)","v":"ENCARREGADO DE INSTALAÇÕES"},"QUANTIDADE",{"$f":"HLOOKUP($B$5,'Dados Gerais'!$D$5:$BK$20,10)","v":1}]
[null,"CCT",null,{"$f":"HLOOKUP($B$5,'Dados Gerais'!$D$5:$BK$20,15)","v":"CCT STICOMBE/DF x SINDUSCON/DF 2021/2023"},"DATA-BASE",{"$f":"HLOOKUP($B$5,'Dados Gerais'!$D$5:$BK$20,16)","v":"2021-05-01"}]
[]
[null,"MÓDULO 1 - COMPOSIÇÃO DA REMUNERAÇÃO",null,null,null,"Valor"]
[null,null,"A","Salário-Base",null,{"$f":"HLOOKUP($B$5,'Dados Gerais'!$D$5:$BK$20,8)","v":3527.9232628091827}]
[null,null,"B","Adicional de Periculosidade",null,{"$f":"HLOOKUP($B$5,'Dados Gerais'!$D$5:$BK$37,25)","v":0}]
[null,null,"C","Adicional de Insalubridade",null,{"$f":"HLOOKUP($B$5,'Dados Gerais'!$D$5:$BK$37,31)","v":0}]
[null,null,"D","Adicional Noturno",null,{"$f":"HLOOKUP($B$5,'Dados Gerais'!$D$5:$BK$50,46)","v":0},null,"* Nota 1 - O Módulo 1 refere-se ao valor mensal devido ao empregado pela prestação do serviço no período de 12 meses."]
[null,null,"E","Adicional de Hora Extra",null,{"$f":"HLOOKUP($B$5,'Dados Gerais'!$D$5:$BK$67,63)","v":0},null,"* Nota 2 - O adicional de hora extra no feriado trabalhado foi suprimido pela Lei 13.467/17"]
[null,null,"F","Outros (especificar)",null,{"$f":"HLOOKUP($B$5,'Dados Gerais'!$D$5:$BK$59,33)","v":0},null,"* Nota 3 - ART. 7º, § 2º, DA LEI Nº 605/49.Sendo mensalista o obreiro, o adicional noturno pago de forma fixa já é considerado integrado para os efeitos do pagamento do repouso semanal remunerado, nos termos do art. 7º, § 2º, da Lei nº 605/49."]
[]
[null,null,null,"TOTAL DA REMUNERAÇÃO",null,{"$f":"SUM(F9:F14)","v":3527.9232628091827}]
[]
[null,"MÓDULO 2 - ENCARGOS E BENEFÍCIOS ANUAIS, MENSAIS E DIÁRIOS",null,null,"Percentuais","Valor"]
[null,"Submódulo 2.1 - 13º Salário, Férias e Adicional de Férias"]
[null,null,"A","13º Salário - Calculado no Módulo 7 - Destacado",0,{"$f":"ROUND(E20*F$16,2)","v":0}]
[null,null,"B","Adicional de Férias",{"$f":"'Encargos Sociais'!E30","v":3.03030303030303E-2},{"$f":"ROUND(E21*F$16,2)","v":106.91},null,"* Nota 1 - Provisiona-se, mensalmente, o proporcional a 1/12 dos valores referentes a gratificação natalina, férias e adicional de férias."]
[null,null,null,null,null,null,null,"* Nota 2 - O adicional de férias contido no Submódulo 2.1 corresponde a 1/3 da remuneração que, por sua vez, é dividida por 12 contome Nota 1."]
[null,"Submódulo 2.2 - Encargos Previdenciários (GPS), Fundo de Garantia por Tempo de Serviço (FGTS) e Outras Contribuições"]
[null,null,"A","INSS (art. 22, inciso I, Lei nº 8.212/91)",{"$f":"'Encargos Sociais'!E13","v":0.2},{"$f":"ROUND(E24*($F$16+$F$41+$F$73),2)","v":805.25}]
[null,null,"B","Salário Educação (art. 3º, inciso I, Decreto nº 87.043/82)",{"$f":"'Encargos Sociais'!E14","v":2.5000000000000001E-2},{"$f":"ROUND(E25*($F$16+$F$41+$F$73),2)","v":100.66}]
[null,null,"C","SAT/RAT (art. 22, II, Lei 8.212/91 e Anexo V, Decreto 6.042/07) - Enquadramento 8211-3/00",{"$f":"'Encargos Sociais'!E15","v":0.01},40.26]
[null,null,"D","SESC ou SESI (art. 30, Lei nº 8.036/90 e art. 1º, Lei 8.154/90)",{"$f":"'Encargos Sociais'!E16","v":1.4999999999999999E-2},60.39]
[null,null,"E","SENAI ou SENAC (Decreto nº 2.318/86)",{"$f":"'Encargos Sociais'!E17","v":0.01},40.26]
[null,null,"F","SEBRAE (§ 3º, art. 8º, Lei 8.029/90, alterada pela Lei nº 8.154/90)",{"$f":"'Encargos Sociais'!E18","v":6.0000000000000001E-3},24.16]
[null,null,"G","INCRA (art. 1º, I, Decreto Lei 1.146/70 e Lei 7.787, de 30/06/89)",{"$f":"'Encargos Sociais'!E19","v":2E-3},8.0500000000000007,null,"* Nota 1 - Os percentuais dos encargos previdenciários, do FGTS e demais contribuições são estabelecidos por legislação vigente."]
[null,null,"H","FGTS (Lei Complementar nº 110/01 e art. 30, Lei nº 8.036/90)",{"$f":"'Encargos Sociais'!E20","v":0.08},322.10000000000002,null,"* Nota 2 - O SAT, a depender do grau de risco do serviço, irá variar entre 1%, para risco leve, de 2%, para risco médio, e de 3% para risco grave."]
[null,null,"I","SECONCI (Convenções Coletivas de Trabalho da construção)",{"$f":"'Encargos Sociais'!E21","v":0.01},40.26,null,"* Nota 3 - Os percentuais do Submódulo 2.2 incidem sobre o Módulo 1 e o Submódulo 2.1."]
[]
[null,"Submódulo 2.3 - Benefícios Mensais e Diários"]
[null,null,"A","Auxílio Transporte",null,{"$f":"HLOOKUP($B$5,'Dados Gerais'!$D$5:$BK$93,82)","v":302.54000000000002}]
[null,null,"B","Auxílio Alimentação",null,{"$f":"HLOOKUP($B$5,'Dados Gerais'!$D$5:$BK$93,89)","v":534.82000000000005}]
[null,null,"C","Assistência Médica e Familiar",null,{"$f":"HLOOKUP($B$5,'Dados Gerais'!$D$5:$BK$101,97)","v":0}]
[null,null,"D","Outros (Seguro de vida e auxílio funeral e auxílio odontológico)",null,{"$f":"HLOOKUP($B$5,'Dados Gerais'!$D$5:$BK$118,114)","v":0},null,"* Nota 1 - O valor informado deverá ser o custo real do benefício (descontado o valor eventualmente pago pelo empregado)."]
[null,null,null,null,null,null,null,"* Nota 2 - Observar a previsão dos benefícios contidos em Acordos, Convenções e Dissídios Coletivos de Trabalho e o disposto no art. 6º da IN 5/2017"]
[null,null,null,"QUADRO-RESUMO DO MÓDULO 2"]
[null,null,null,"2.1 - 13º Salário, Férias e Adicional de Férias - 13º Destacado - Calculado no Módulo 7 ",{"$f":"SUM(E20:E21)","v":3.03030303030303E-2},{"$f":"F20+F21","v":106.91}]
[null,null,null,"2.2 - Encargos Previdenciários (GPS), Fundo de Garantia por Tempo de Serviço (FGTS) e Contribuições",{"$f":"SUM(E24:E32)","v":0.35800000000000004},{"$f":"SUM(F24:F32)","v":1441.39}]
[null,null,null,"2.3 - Benefícios Mensais e Diários",null,{"$f":"SUM(F35:F38)","v":837.36000000000013}]
[]
[null,null,null,"TOTAL DOS ENCARGOS E BENEFÍCIOS",null,{"$f":"SUM(F41:F43)","v":2385.6600000000003}]
[]
[null,"MÓDULO 3 - PREVISÃO PARA RESCISÃO",null,null,"Percentuais","Valor"]
[null,null,"A","Aviso Prévio Indenizado (Art. 7º, inciso XXI, da CF/1988 e arts. 477, 487, §1º, e 491 da CLT)",{"$f":"'Encargos Sociais'!E35","v":8.3333333333333332E-3},{"$f":"ROUND(E48*$F$16,2)","v":29.4}]
[null,null,"B","Incidência do FGTS sobre o Aviso Prévio Indenizado (Súmula 305 TST)",{"$f":"'Encargos Sociais'!E36","v":6.6666666666666664E-4},2.35,null,"* Nota 1 - Adotou-se os parâmetros do estudo do STF (http://www.stf.jus.br/arquivo/cms/sobrestfestudosci/anexo/encargos_sociais_03102007.pdf), onde 5% do pessoal é demitido pelo empregador no decurso do contrato (para estes, considerou-se o aviso prévio indenizado). Desprezou-se as demissões por justa causa e os pedidos de demissão."]
[null,null,"C","Multa do FGTS e Contribuição Social sobre o Aviso Prévio Indenizado (Art. 18, §1º, da Lei 8.036/1990 e art. 1º da LC nº 110/2001)",{"$f":"'Encargos Sociais'!E37","v":1.274074074074074E-3},4.49,null,"* Nota 2 - No cálculo do percentual, considerou-se 36 dias, correspondendo à metade da duração média dos contratos (2 anos)"]
[null,null,"D","Aviso Prévio Trabalhado (Art. 488, parágrafo único, CLT)",{"$f":"'Encargos Sociais'!E38","v":1.2037037037037035E-2},42.47,null,"* Nota 3 - Incide sobre a Remuneração + 13º salário (1/12) + Férias (1/12) + Adicional de Férias (1/36) x 50% multa (40% para o empregado e 10% de contribuição social) x 8% FGTS"]
[null,null,"E","Incidência de GPS, FGTS e outras contribuições sobre o Aviso Prévio Trabalhado",{"$f":"'Encargos Sociais'!E39","v":4.3092592592592583E-3},15.2,null,"* Nota 4 - Os 95% restantes do cálculo, a um prazo médio de contrato de 4 anos. Assim, calcula-se 7 dias para o 1º ano de contrato e mais 3 dias para os 3 anos seguintes."]
[null,null,"F","Multa do FGTS e Contribuição Social sobre o Aviso Prévio Trabalhado",{"$f":"'Encargos Sociais'!E40","v":3.0505155555555549E-2},107.62]
[]
[null,null,null,"TOTAL DE PREVISÃO PARA RESCISÃO",null,{"$f":"SUM(F48:F53)","v":201.53000000000003}]
[]
[null,"MÓDULO 4 - CUSTO DE REPOSIÇÃO DO PROFISSIONAL AUSENTE",null,null,"Percentuais","Valor"]
[null,"Submódulo 4.1 - Ausências Legais"]
[null,null,"A","Férias (Arts. 129 e 130, inc. I, da CLT)",{"$f":"'Encargos Sociais'!E24","v":9.0909090909090912E-2},{"$f":"ROUND(E59*$F$16,2)","v":320.72000000000003},null,"* Nota 1 - As alíneas “A” a “F” referem-se somente ao custo que será pago ao repositor pelos dias \ntrabalhados quando da necessidade de substituir a mão de obra alocada na prestação do serviço."]
[null,null,"B","Ausências Legais (Arts. 131 e 473 da CLT)",{"$f":"'Encargos Sociais'!E25","v":7.9365079365079361E-3},28,null,"* Nota 2 - Adotou-se a estimativa do SINAPI de 2 dias por ano."]
[null,null,"C","Licença-Paternidade (Art. 7º, XIX, e art. 10, §1º, do ADCT, CF/1988 e Art. 1º, II, da Lei 11.770/2008)",{"$f":"'Encargos Sociais'!E26","v":8.2777777777777776E-4},2.92,null,"* Nota 3 - Utilizada a proporção de 50% para homens, 5 dias de afastamento, e a probabilidade de um trabalhador requerer a Licença Paternidade em 5,22%, conforme SINAPI (citando dados da PNAD 2015)"]
[null,null,"D","Ausência por Acidente de Trabalho (Art. 131, III, da CLT)",{"$f":"'Encargos Sociais'!E27","v":8.541666666666667E-4},3.01,null,"* Nota 4 - Utilzada a estatística de 1,96% dos contribuintes beneficiados com a emissão do auxílio, conforme Anuário Estatístico da Previdência Social. Afastamento de 15 dias a cargo da empresa."]
[null,null,"E","Afastamento Maternidade (Art. 71 da Lei nº 8.213/1991)",{"$f":"'Encargos Sociais'!E28","v":3.2925925925925922E-3},11.62,null,"* Nota 5 - Utilizada a proporção de 50% para mulheres, 180 dias de afastamento, e a probabilidade de uma trabalhadora requerer a Licença Maternidade em 4,91%, conforme SINAPI (citando dados do IBGE 2016)"]
[null,null,"F","Auxílio Enfermidade - Doença (Art. 59 da Lei nº 8.213/1991)",{"$f":"'Encargos Sociais'!E29","v":7.1222222222222225E-3},25.13,null,"* Nota 6 - Utilizada a estatística de 3,37% dos contribuintes beneficiados com o auxílio, conforme Anuário Estatístico da Previdência Social de 2015 (acrescidos de 2 dias ao ano, para os quais o trabalhador nem requer o benefício da Previdência - conforme SINAPI)"]
[]
[null,"Submódulo 4.2 - Intrajornada"]
[null,null,"A","Intervalo para repouso ou alimentação",{"$f":"'Encargos Sociais'!E32","v":0},{"$f":"ROUND(E67*$F$16,2)","v":0}]
[]
[null,null,null,"QUADRO-RESUMO DO MÓDULO 4",null,"Valor"]
[null,null,null,"4.1 - Ausências Legais",{"$f":"SUM(E59:E64)","v":0.11094235810485811},{"$f":"ROUND(E70*$F$16,2)","v":391.4}]
[null,null,null,"4.2 - Intrajornada",{"$f":"E67","v":0},{"$f":"ROUND(E71*$F$16,2)","v":0}]
[]
[null,null,null,"TOTAL DE PREVISÃO PARA RESCISÃO E INTERVALO INTRAJORNADA",null,{"$f":"SUM(F70:F71)","v":391.4}]
[]
[null,"MÓDULO 5 - INSUMOS DIVERSOS",null,null,null,"Valor"]
[null,null,"A","Uniformes - aquisição",null,{"$f":"ROUND(HLOOKUP($B$5,Uniformes!K3:DZ33,3)/12,2)","v":32.380000000000003}]
[null,null,"B","Materiais de consumo relacionados ao posto - aquisição",null,{"$f":"ROUND(HLOOKUP(B5,'Mat Cons'!I11:DX13,3)/12,2)","v":0}]
[null,null,"C","Materiais permanentes relacionados ao posto - remuneração da sua depreciação / manutenção",null,{"$f":"HLOOKUP(B5,'Mat Perm'!Q11:EF13,3)","v":0}]
[null,null,"D","Equipamentos relacionados ao posto - remuneração da sua depreciação / manutenção",null,{"$f":"HLOOKUP(B5,'Equip Rel'!Q11:EF13,3)","v":0}]
[null,null,"E","Equipamentos de Proteção Individual - EPI - aquisição",null,{"$f":"ROUND(HLOOKUP(B5,EPI!I3:DX67,3)/12,2)","v":58}]
[]
[null,null,null,"TOTAL DE INSUMOS DIVERSOS",null,{"$f":"SUM(F76:F81)","v":90.38},null,"* Nota - Valores mensais por empregado"]
[]
[null,"MÓDULO 6 - CUSTOS INDIRETOS, TRIBUTOS E LUCRO - BDI",null,null,"Percentuais","Valor"]
[null,null,"A","Custos Indiretos",{"$f":"BDI!E6","v":4.4400000000000002E-2}]
[null,null,"A.1","Administração Central",{"$f":"BDI!E7","v":3.9E-2}]
[null,null,"A.2","Seguros, Garantias e Riscos",{"$f":"BDI!E8","v":5.4000000000000003E-3}]
[null,null,"B","Lucro",{"$f":"BDI!E10","v":0.06}]
[null,null,"C","Tributos",{"$f":"SUM(E90:E91)","v":0.124}]
[null,null,"C.1","Tributos Federais (COFINS, PIS e CPRB)",{"$f":"BDI!E18","v":7.3999999999999996E-2}]
[null,null,"C.2","Tributos Distritais (ISS)",{"$f":"BDI!E23","v":0.05},null,null,"* Nota - Utilizou-se o indicado pelo Sindicato da Arquitetura e da Engenharia (Sinaenco, 2008, p. 22), que adota um percentual redutor de 20% no cálculo dos custos tributários relativos às contribuições PIS e COFINS"]
[null,null,"D","Despesas Financeiras",{"$f":"BDI!E13","v":4.4669210982628549E-3}]
[]
[null,null,null,"TOTAL DE BDI",{"$f":"BDI!E26","v":0.26939999999999997},{"$f":"E94*E102","v":1777.2030450007935}]
[]
[null,null,null,"QUADRO-RESUMO DO CUSTO MENSAL POR EMPREGADO - SEM O 13º","Valor"]
[null,null,null,"Módulo 1 - Composição da Remuneração",{"$f":"F16","v":3527.9232628091827}]
[null,null,null,"Módulo 2 - Encargos e Benefícios Anuais, Mensais e Diários",{"$f":"F45","v":2385.6600000000003}]
[null,null,null,"Módulo 3 - Provisão para Rescisão",{"$f":"F55","v":201.53000000000003}]
[null,null,null,"Módulo 4 - Custo de Reposição do Profissional Ausente",{"$f":"F73","v":391.4}]
[null,null,null,"Módulo 5 - Insumos Diversos",{"$f":"F82","v":90.38}]
[null,null,null,"SUBTOTAL (A+B+C+D+E)",{"$f":"SUM(E97:E101)","v":6596.8932628091825}]
[null,null,null,"Módulo 6 - Custos Indiretos, Tributos e Lucro",{"$f":"F94","v":1777.2030450007935}]
[]
[null,null,null,"TOTAL DO POSTO",{"$f":"SUM(E102:E103)","v":8374.0963078099758}]
[]
[null,"MÓDULO 7 - DESTAQUE DO MÓDULO 2 - 13º SALÁRIO",null,null,"Percentuais","Valor"]
[null,null,"A","13º Salário",{"$f":"'Encargos Sociais'!E31","v":8.3333333333333329E-2},{"$f":"ROUND(E108*F$16,2)","v":293.99}]
[null,null,"B","Encargos Sociais sobre o 13º Salário - Taxa calculada no SUBMÓDULO 2.2",{"$f":"SUM($E$24:$E$32)","v":0.35800000000000004},{"$f":"ROUND(E109*$F$108,2)","v":105.25},null,"* Nota 1 - Provisiona-se, mensalmente, o proporcional a 1/12 dos valores referentes a gratificação natalina e adicional de férias."]
[null,null,"C","Reincidência de férias sobre o 13º Salário",{"$f":"E59","v":9.0909090909090912E-2},{"$f":"ROUND(E110*($F$108+$F$109),2)","v":36.29}]
[null,null,"D","BDI sobre o 13º Salário - Taxa calculada no MÓDULO 6",{"$f":"E94","v":0.26939999999999997},{"$f":"ROUND(E111*($F$108+$F$109),2)","v":107.56}]
[]
[null,null,null,"TOTAL DO DESTAQUE DO 13º SALÁRIO",null,{"$f":"SUM(F108:F111)","v":543.09}]
[]
[null,null,null,"QUADRO-RESUMO DO CUSTO MENSAL POR EMPREGADO","Valor"]
[null,null,null,"Custo total - sem o 13º Salário",{"$f":"E105","v":8374.0963078099758}]
[null,null,null,"Destaque do 13º Salário (valor mensal)",{"$f":"F113","v":543.09}]
[]
[null,null,null,"TOTAL DO POSTO",{"$f":"E116+E117","v":8917.1863078099759}]

{"sheet":"3","index":6,"n_rows":119,"n_cols":8,"rows_kept":119,"cut":false,"hidden":false,"merged":[[1,1,1,5],[2,1,2,5],[4,1,4,2],[5,1,5,2],[7,1,7,3],[17,1,17,3],[106,1,106,3],[39,3,39,5],[46,1,46,3],[56,1,56,3],[68,3,68,5],[74,1,74,3],[83,1,83,3]]}
[]
[null,"PLANILHA DE ESTIMATIVA DE CUSTOS"]
[null,"Padrão IN 05/2017 e IN 07/2018 - MPDG"]
[]
[null,3,null,{"$f":"HLOOKUP($B$5,'Dados Gerais'!$D$5:$BK$20,6)","v":"TÉCNICO EM ELETRÔNICA (DETECÇÃO, ALARME E COMBATE A INCÊNCIO)"},"QUANTIDADE",{"$f":"HLOOKUP($B$5,'Dados Gerais'!$D$5:$BK$20,10)","v":1}]
[null,"CCT",null,{"$f":"HLOOKUP($B$5,'Dados Gerais'!$D$5:$BK$20,15)","v":"CCT STICOMBE/DF x SINDUSCON/DF 2021/2023"},"DATA-BASE",{"$f":"HLOOKUP($B$5,'Dados Gerais'!$D$5:$BK$20,16)","v":"2021-05-01"}]
[]
[null,"MÓDULO 1 - COMPOSIÇÃO DA REMUNERAÇÃO",null,null,null,"Valor"]
[null,null,"A","Salário-Base",null,{"$f":"HLOOKUP($B$5,'Dados Gerais'!$D$5:$BK$20,8)","v":2899.8948731090973}]
[null,null,"B","Adicional de Periculosidade",null,{"$f":"HLOOKUP($B$5,'Dados Gerais'!$D$5:$BK$37,25)","v":0}]
[null,null,"C","Adicional de Insalubridade",null,{"$f":"HLOOKUP($B$5,'Dados Gerais'!$D$5:$BK$37,31)","v":0}]
[null,null,"D","Adicional Noturno",null,{"$f":"HLOOKUP($B$5,'Dados Gerais'!$D$5:$BK$50,46)","v":0},null,"* Nota 1 - O Módulo 1 refere-se ao valor mensal devido ao empregado pela prestação do serviço no período de 12 meses."]
[null,null,"E","Adicional de Hora Extra",null,{"$f":"HLOOKUP($B$5,'Dados Gerais'!$D$5:$BK$67,63)","v":0},null,"* Nota 2 - O adicional de hora extra no feriado trabalhado foi suprimido pela Lei 13.467/17"]
[null,null,"F","Outros (especificar)",null,{"$f":"HLOOKUP($B$5,'Dados Gerais'!$D$5:$BK$59,33)","v":0},null,"* Nota 3 - ART. 7º, § 2º, DA LEI Nº 605/49.Sendo mensalista o obreiro, o adicional noturno pago de forma fixa já é considerado integrado para os efeitos do pagamento do repouso semanal remunerado, nos termos do art. 7º, § 2º, da Lei nº 605/49."]
[]
[null,null,null,"TOTAL DA REMUNERAÇÃO",null,{"$f":"SUM(F9:F14)","v":2899.8948731090973}]
[]
[null,"MÓDULO 2 - ENCARGOS E BENEFÍCIOS ANUAIS, MENSAIS E DIÁRIOS",null,null,"Percentuais","Valor"]
[null,"Submódulo 2.1 - 13º Salário, Férias e Adicional de Férias"]
[null,null,"A","13º Salário - Calculado no Módulo 7 - Destacado",0,{"$f":"ROUND(E20*F$16,2)","v":0}]
[null,null,"B","Adicional de Férias",{"$f":"'Encargos Sociais'!E30","v":3.03030303030303E-2},{"$f":"ROUND(E21*F$16,2)","v":87.88},null,"* Nota 1 - Provisiona-se, mensalmente, o proporcional a 1/12 dos valores referentes a gratificação natalina, férias e adicional de férias."]
[null,null,null,null,null,null,null,"* Nota 2 - O adicional de férias contido no Submódulo 2.1 corresponde a 1/3 da remuneração que, por sua vez, é dividida por 12 contome Nota 1."]
[null,"Submódulo 2.2 - Encargos Previdenciários (GPS), Fundo de Garantia por Tempo de Serviço (FGTS) e Outras Contribuições"]
[null,null,"A","INSS (art. 22, inciso I, Lei nº 8.212/91)",{"$f":"'Encargos Sociais'!E13","v":0.2},{"$f":"ROUND(E24*($F$16+$F$41+$F$73),2)","v":661.9}]
[null,null,"B","Salário Educação (art. 3º, inciso I, Decreto nº 87.043/82)",{"$f":"'Encargos Sociais'!E14","v":2.5000000000000001E-2},{"$f":"ROUND(E25*($F$16+$F$41+$F$73),2)","v":82.74}]
[null,null,"C","SAT/RAT (art. 22, II, Lei 8.212/91 e Anexo V, Decreto 6.042/07) - Enquadramento 8211-3/00",{"$f":"'Encargos Sociais'!E15","v":0.01},33.090000000000003]
[null,null,"D","SESC ou SESI (art. 30, Lei nº 8.036/90 e art. 1º, Lei 8.154/90)",{"$f":"'Encargos Sociais'!E16","v":1.4999999999999999E-2},49.64]
[null,null,"E","SENAI ou SENAC (Decreto nº 2.318/86)",{"$f":"'Encargos Sociais'!E17","v":0.01},33.090000000000003]
[null,null,"F","SEBRAE (§ 3º, art. 8º, Lei 8.029/90, alterada pela Lei nº 8.154/90)",{"$f":"'Encargos Sociais'!E18","v":6.0000000000000001E-3},19.86]
[null,null,"G","INCRA (art. 1º, I, Decreto Lei 1.146/70 e Lei 7.787, de 30/06/89)",{"$f":"'Encargos Sociais'!E19","v":2E-3},6.62,null,"* Nota 1 - Os percentuais dos encargos previdenciários, do FGTS e demais contribuições são estabelecidos por legislação vigente."]
[null,null,"H","FGTS (Lei Complementar nº 110/01 e art. 30, Lei nº 8.036/90)",{"$f":"'Encargos Sociais'!E20","v":0.08},264.76,null,"* Nota 2 - O SAT, a depender do grau de risco do serviço, irá variar entre 1%, para risco leve, de 2%, para risco médio, e de 3% para risco grave."]
[null,null,"I","SECONCI (Convenções Coletivas de Trabalho da construção)",{"$f":"'Encargos Sociais'!E21","v":0.01},33.090000000000003,null,"* Nota 3 - Os percentuais do Submódulo 2.2 incidem sobre o Módulo 1 e o Submódulo 2.1."]
[]
[null,"Submódulo 2.3 - Benefícios Mensais e Diários"]
[null,null,"A","Auxílio Transporte",null,{"$f":"HLOOKUP($B$5,'Dados Gerais'!$D$5:$BK$93,82)","v":302.54000000000002}]
[null,null,"B","Auxílio Alimentação",null,{"$f":"HLOOKUP($B$5,'Dados Gerais'!$D$5:$BK$93,89)","v":534.82000000000005}]
[null,null,"C","Assistência Médica e Familiar",null,{"$f":"HLOOKUP($B$5,'Dados Gerais'!$D$5:$BK$101,97)","v":0}]
[null,null,"D","Outros (Seguro de vida e auxílio funeral e auxílio odontológico)",null,{"$f":"HLOOKUP($B$5,'Dados Gerais'!$D$5:$BK$118,114)","v":0},null,"* Nota 1 - O valor informado deverá ser o custo real do benefício (descontado o valor eventualmente pago pelo empregado)."]
[null,null,null,null,null,null,null,"* Nota 2 - Observar a previsão dos benefícios contidos em Acordos, Convenções e Dissídios Coletivos de Trabalho e o disposto no art. 6º da IN 5/2017"]
[null,null,null,"QUADRO-RESUMO DO MÓDULO 2"]
[null,null,null,"2.1 - 13º Salário, Férias e Adicional de Férias - 13º Destacado - Calculado no Módulo 7 ",{"$f":"SUM(E20:E21)","v":3.03030303030303E-2},{"$f":"F20+F21","v":87.88}]
[null,null,null,"2.2 - Encargos Previdenciários (GPS), Fundo de Garantia por Tempo de Serviço (FGTS) e Contribuições",{"$f":"SUM(E24:E32)","v":0.35800000000000004},{"$f":"SUM(F24:F32)","v":1184.79}]
[null,null,null,"2.3 - Benefícios Mensais e Diários",null,{"$f":"SUM(F35:F38)","v":837.36000000000013}]
[]
[null,null,null,"TOTAL DOS ENCARGOS E BENEFÍCIOS",null,{"$f":"SUM(F41:F43)","v":2110.0300000000002}]
[]
[null,"MÓDULO 3 - PREVISÃO PARA RESCISÃO",null,null,"Percentuais","Valor"]
[null,null,"A","Aviso Prévio Indenizado (Art. 7º, inciso XXI, da CF/1988 e arts. 477, 487, §1º, e 491 da CLT)",{"$f":"'Encargos Sociais'!E35","v":8.3333333333333332E-3},{"$f":"ROUND(E48*$F$16,2)","v":24.17}]
[null,null,"B","Incidência do FGTS sobre o Aviso Prévio Indenizado (Súmula 305 TST)",{"$f":"'Encargos Sociais'!E36","v":6.6666666666666664E-4},1.93,null,"* Nota 1 - Adotou-se os parâmetros do estudo do STF (http://www.stf.jus.br/arquivo/cms/sobrestfestudosci/anexo/encargos_sociais_03102007.pdf), onde 5% do pessoal é demitido pelo empregador no decurso do contrato (para estes, considerou-se o aviso prévio indenizado). Desprezou-se as demissões por justa causa e os pedidos de demissão."]
[null,null,"C","Multa do FGTS e Contribuição Social sobre o Aviso Prévio Indenizado (Art. 18, §1º, da Lei 8.036/1990 e art. 1º da LC nº 110/2001)",{"$f":"'Encargos Sociais'!E37","v":1.274074074074074E-3},3.69,null,"* Nota 2 - No cálculo do percentual, considerou-se 36 dias, correspondendo à metade da duração média dos contratos (2 anos)"]
[null,null,"D","Aviso Prévio Trabalhado (Art. 488, parágrafo único, CLT)",{"$f":"'Encargos Sociais'!E38","v":1.2037037037037035E-2},34.909999999999997,null,"* Nota 3 - Incide sobre a Remuneração + 13º salário (1/12) + Férias (1/12) + Adicional de Férias (1/36) x 50% multa (40% para o empregado e 10% de contribuição social) x 8% FGTS"]
[null,null,"E","Incidência de GPS, FGTS e outras contribuições sobre o Aviso Prévio Trabalhado",{"$f":"'Encargos Sociais'!E39","v":4.3092592592592583E-3},12.5,null,"* Nota 4 - Os 95% restantes do cálculo, a um prazo médio de contrato de 4 anos. Assim, calcula-se 7 dias para o 1º ano de contrato e mais 3 dias para os 3 anos seguintes."]
[null,null,"F","Multa do FGTS e Contribuição Social sobre o Aviso Prévio Trabalhado",{"$f":"'Encargos Sociais'!E40","v":3.0505155555555549E-2},88.46]
[]
[null,null,null,"TOTAL DE PREVISÃO PARA RESCISÃO",null,{"$f":"SUM(F48:F53)","v":165.66}]
[]
[null,"MÓDULO 4 - CUSTO DE REPOSIÇÃO DO PROFISSIONAL AUSENTE",null,null,"Percentuais","Valor"]
[null,"Submódulo 4.1 - Ausências Legais"]
[null,null,"A","Férias (Arts. 129 e 130, inc. I, da CLT)",{"$f":"'Encargos Sociais'!E24","v":9.0909090909090912E-2},{"$f":"ROUND(E59*$F$16,2)","v":263.63},null,"* Nota 1 - As alíneas “A” a “F” referem-se somente ao custo que será pago ao repositor pelos dias \ntrabalhados quando da necessidade de substituir a mão de obra alocada na prestação do serviço."]
[null,null,"B","Ausências Legais (Arts. 131 e 473 da CLT)",{"$f":"'Encargos Sociais'!E25","v":7.9365079365079361E-3},23.02,null,"* Nota 2 - Adotou-se a estimativa do SINAPI de 2 dias por ano."]
[null,null,"C","Licença-Paternidade (Art. 7º, XIX, e art. 10, §1º, do ADCT, CF/1988 e Art. 1º, II, da Lei 11.770/2008)",{"$f":"'Encargos Sociais'!E26","v":8.2777777777777776E-4},2.4,null,"* Nota 3 - Utilizada a proporção de 50% para homens, 5 dias de afastamento, e a probabilidade de um trabalhador requerer a Licença Paternidade em 5,22%, conforme SINAPI (citando dados da PNAD 2015)"]
[null,null,"D","Ausência por Acidente de Trabalho (Art. 131, III, da CLT)",{"$f":"'Encargos Sociais'!E27","v":8.541666666666667E-4},2.48,null,"* Nota 4 - Utilzada a estatística de 1,96% dos contribuintes beneficiados com a emissão do auxílio, conforme Anuário Estatístico da Previdência Social. Afastamento de 15 dias a cargo da empresa."]
[null,null,"E","Afastamento Maternidade (Art. 71 da Lei nº 8.213/1991)",{"$f":"'Encargos Sociais'!E28","v":3.2925925925925922E-3},9.5500000000000007,null,"* Nota 5 - Utilizada a proporção de 50% para mulheres, 180 dias de afastamento, e a probabilidade de uma trabalhadora requerer a Licença Maternidade em 4,91%, conforme SINAPI (citando dados do IBGE 2016)"]
[null,null,"F","Auxílio Enfermidade - Doença (Art. 59 da Lei nº 8.213/1991)",{"$f":"'Encargos Sociais'!E29","v":7.1222222222222225E-3},20.65,null,"* Nota 6 - Utilizada a estatística de 3,37% dos contribuintes beneficiados com o auxílio, conforme Anuário Estatístico da Previdência Social de 2015 (acrescidos de 2 dias ao ano, para os quais o trabalhador nem requer o benefício da Previdência - conforme SINAPI)"]
[]
[null,"Submódulo 4.2 - Intrajornada"]
[null,null,"A","Intervalo para repouso ou alimentação",{"$f":"'Encargos Sociais'!E32","v":0},{"$f":"ROUND(E67*$F$16,2)","v":0}]
[]
[null,null,null,"QUADRO-RESUMO DO MÓDULO 4",null,"Valor"]
[null,null,null,"4.1 - Ausências Legais",{"$f":"SUM(E59:E64)","v":0.11094235810485811},{"$f":"ROUND(E70*$F$16,2)","v":321.72000000000003}]
[null,null,null,"4.2 - Intrajornada",{"$f":"E67","v":0},{"$f":"ROUND(E71*$F$16,2)","v":0}]
[]
[null,null,null,"TOTAL DE PREVISÃO PARA RESCISÃO E INTERVALO INTRAJORNADA",null,{"$f":"SUM(F70:F71)","v":321.72000000000003}]
[]
[null,"MÓDULO 5 - INSUMOS DIVERSOS",null,null,null,"Valor"]
[null,null,"A","Uniformes - aquisição",null,{"$f":"ROUND(HLOOKUP($B$5,Uniformes!K3:DZ33,3)/12,2)","v":32.380000000000003}]
[null,null,"B","Materiais de consumo relacionados ao posto - aquisição",null,{"$f":"ROUND(HLOOKUP(B5,'Mat Cons'!I11:DX204,3)/12,2)","v":0}]
[null,null,"C","Materiais permanentes relacionados ao posto - remuneração da sua depreciação / manutenção",null,{"$f":"HLOOKUP(B5,'Mat Perm'!Q11:EF13,3)","v":0}]
[null,null,"D","Equipamentos relacionados ao posto - remuneração da sua depreciação / manutenção",null,{"$f":"HLOOKUP(B5,'Equip Rel'!Q11:EF13,3)","v":0}]
[null,null,"E","Equipamentos de Proteção Individual - EPI - aquisição",null,{"$f":"ROUND(HLOOKUP(B5,EPI!I3:DX5,3)/12,2)","v":41.9}]
[]
[null,null,null,"TOTAL DE INSUMOS DIVERSOS",null,{"$f":"SUM(F76:F81)","v":74.28},null,"* Nota - Valores mensais por empregado"]
[]
[null,"MÓDULO 6 - CUSTOS INDIRETOS, TRIBUTOS E LUCRO - BDI",null,null,"Percentuais","Valor"]
[null,null,"A","Custos Indiretos",{"$f":"BDI!E6","v":4.4400000000000002E-2}]
[null,null,"A.1","Administração Central",{"$f":"BDI!E7","v":3.9E-2}]
[null,null,"A.2","Seguros, Garantias e Riscos",{"$f":"BDI!E8","v":5.4000000000000003E-3}]
[null,null,"B","Lucro",{"$f":"BDI!E10","v":0.06}]
[null,null,"C","Tributos",{"$f":"SUM(E90:E91)","v":0.124}]
[null,null,"C.1","Tributos Federais (COFINS, PIS e CPRB)",{"$f":"BDI!E18","v":7.3999999999999996E-2}]
[null,null,"C.2","Tributos Distritais (ISS)",{"$f":"BDI!E23","v":0.05},null,null,"* Nota - Utilizou-se o indicado pelo Sindicato da Arquitetura e da Engenharia (Sinaenco, 2008, p. 22), que adota um percentual redutor de 20% no cálculo dos custos tributários relativos às contribuições PIS e COFINS"]
[null,null,"D","Despesas Financeiras",{"$f":"BDI!E13","v":4.4669210982628549E-3}]
[]
[null,null,null,"TOTAL DE BDI",{"$f":"BDI!E26","v":0.26939999999999997},{"$f":"E94*E102","v":1500.9849648155907}]
[]
[null,null,null,"QUADRO-RESUMO DO CUSTO MENSAL POR EMPREGADO - SEM O 13º","Valor"]
[null,null,null,"Módulo 1 - Composição da Remuneração",{"$f":"F16","v":2899.8948731090973}]
[null,null,null,"Módulo 2 - Encargos e Benefícios Anuais, Mensais e Diários",{"$f":"F45","v":2110.0300000000002}]
[null,null,null,"Módulo 3 - Provisão para Rescisão",{"$f":"F55","v":165.66}]
[null,null,null,"Módulo 4 - Custo de Reposição do Profissional Ausente",{"$f":"F73","v":321.72000000000003}]
[null,null,null,"Módulo 5 - Insumos Diversos",{"$f":"F82","v":74.28}]
[null,null,null,"SUBTOTAL (A+B+C+D+E)",{"$f":"SUM(E97:E101)","v":5571.5848731090973}]
[null,null,null,"Módulo 6 - Custos Indiretos, Tributos e Lucro",{"$f":"F94","v":1500.9849648155907}]
[]
[null,null,null,"TOTAL DO POSTO",{"$f":"SUM(E102:E103)","v":7072.5698379246878}]
[]
[null,"MÓDULO 7 - DESTAQUE DO MÓDULO 2 - 13º SALÁRIO",null,null,"Percentuais","Valor"]
[null,null,"A","13º Salário",{"$f":"'Encargos Sociais'!E31","v":8.3333333333333329E-2},{"$f":"ROUND(E108*F$16,2)","v":241.66}]
[null,null,"B","Encargos Sociais sobre o 13º Salário - Taxa calculada no SUBMÓDULO 2.2",{"$f":"SUM($E$24:$E$32)","v":0.35800000000000004},{"$f":"ROUND(E109*$F$108,2)","v":86.51},null,"* Nota 1 - Provisiona-se, mensalmente, o proporcional a 1/12 dos valores referentes a gratificação natalina e adicional de férias."]
[null,null,"C","Reincidência de férias sobre o 13º Salário",{"$f":"E59","v":9.0909090909090912E-2},{"$f":"ROUND(E110*($F$108+$F$109),2)","v":29.83}]
[null,null,"D","BDI sobre o 13º Salário - Taxa calculada no MÓDULO 6",{"$f":"E94","v":0.26939999999999997},{"$f":"ROUND(E111*($F$108+$F$109),2)","v":88.41}]
[]
[null,null,null,"TOTAL DO DESTAQUE DO 13º SALÁRIO",null,{"$f":"SUM(F108:F111)","v":446.40999999999997}]
[]
[null,null,null,"QUADRO-RESUMO DO CUSTO MENSAL POR EMPREGADO","Valor"]
[null,null,null,"Custo total - sem o 13º Salário",{"$f":"E105","v":7072.5698379246878}]
[null,null,null,"Destaque do 13º Salário (valor mensal)",{"$f":"F113","v":446.40999999999997}]
[]
[null,null,null,"TOTAL DO POSTO",{"$f":"E116+E117","v":7518.9798379246877}]

{"sheet":"4","index":7,"n_rows":119,"n_cols":8,"rows_kept":119,"cut":false,"hidden":false,"merged":[[1,1,1,5],[2,1,2,5],[4,1,4,2],[5,1,5,2],[7,1,7,3],[17,1,17,3],[106,1,106,3],[39,3,39,5],[46,1,46,3],[56,1,56,3],[68,3,68,5],[74,1,74,3],[83,1,83,3]]}
[]
[null,"PLANILHA DE ESTIMATIVA DE CUSTOS"]
[null,"Padrão IN 05/2017 e IN 07/2018 - MPDG"]
[]
[null,4,null,{"$f":"HLOOKUP($B$5,'Dados Gerais'!$D$5:$BK$20,6)","v":"TÉCNICO EM ELETROTÉCNICA (QUADROS DE COMANDO E AUTOMAÇÃO)"},"QUANTIDADE",{"$f":"HLOOKUP($B$5,'Dados Gerais'!$D$5:$BK$20,10)","v":1}]
[null,"CCT",null,{"$f":"HLOOKUP($B$5,'Dados Gerais'!$D$5:$BK$20,15)","v":"CCT STICOMBE/DF x SINDUSCON/DF 2021/2023"},"DATA-BASE",{"$f":"HLOOKUP($B$5,'Dados Gerais'!$D$5:$BK$20,16)","v":"2021-05-01"}]
[]
[null,"MÓDULO 1 - COMPOSIÇÃO DA REMUNERAÇÃO",null,null,null,"Valor"]
[null,null,"A","Salário-Base",null,{"$f":"HLOOKUP($B$5,'Dados Gerais'!$D$5:$BK$20,8)","v":3004.8634828574245}]
[null,null,"B","Adicional de Periculosidade",null,{"$f":"HLOOKUP($B$5,'Dados Gerais'!$D$5:$BK$37,25)","v":0}]
[null,null,"C","Adicional de Insalubridade",null,{"$f":"HLOOKUP($B$5,'Dados Gerais'!$D$5:$BK$37,31)","v":0}]
[null,null,"D","Adicional Noturno",null,{"$f":"HLOOKUP($B$5,'Dados Gerais'!$D$5:$BK$50,46)","v":0},null,"* Nota 1 - O Módulo 1 refere-se ao valor mensal devido ao empregado pela prestação do serviço no período de 12 meses."]
[null,null,"E","Adicional de Hora Extra",null,{"$f":"HLOOKUP($B$5,'Dados Gerais'!$D$5:$BK$67,63)","v":0},null,"* Nota 2 - O adicional de hora extra no feriado trabalhado foi suprimido pela Lei 13.467/17"]
[null,null,"F","Outros (especificar)",null,{"$f":"HLOOKUP($B$5,'Dados Gerais'!$D$5:$BK$59,33)","v":0},null,"* Nota 3 - ART. 7º, § 2º, DA LEI Nº 605/49.Sendo mensalista o obreiro, o adicional noturno pago de forma fixa já é considerado integrado para os efeitos do pagamento do repouso semanal remunerado, nos termos do art. 7º, § 2º, da Lei nº 605/49."]
[]
[null,null,null,"TOTAL DA REMUNERAÇÃO",null,{"$f":"SUM(F9:F14)","v":3004.8634828574245}]
[]
[null,"MÓDULO 2 - ENCARGOS E BENEFÍCIOS ANUAIS, MENSAIS E DIÁRIOS",null,null,"Percentuais","Valor"]
[null,"Submódulo 2.1 - 13º Salário, Férias e Adicional de Férias"]
[null,null,"A","13º Salário - Calculado no Módulo 7 - Destacado",0,{"$f":"ROUND(E20*F$16,2)","v":0}]
[null,null,"B","Adicional de Férias",{"$f":"'Encargos Sociais'!E30","v":3.03030303030303E-2},{"$f":"ROUND(E21*F$16,2)","v":91.06},null,"* Nota 1 - Provisiona-se, mensalmente, o proporcional a 1/12 dos valores referentes a gratificação natalina, férias e adicional de férias."]
[null,null,null,null,null,null,null,"* Nota 2 - O adicional de férias contido no Submódulo 2.1 corresponde a 1/3 da remuneração que, por sua vez, é dividida por 12 contome Nota 1."]
[null,"Submódulo 2.2 - Encargos Previdenciários (GPS), Fundo de Garantia por Tempo de Serviço (FGTS) e Outras Contribuições"]
[null,null,"A","INSS (art. 22, inciso I, Lei nº 8.212/91)",{"$f":"'Encargos Sociais'!E13","v":0.2},{"$f":"ROUND(E24*($F$16+$F$41+$F$73),2)","v":685.86}]
[null,null,"B","Salário Educação (art. 3º, inciso I, Decreto nº 87.043/82)",{"$f":"'Encargos Sociais'!E14","v":2.5000000000000001E-2},{"$f":"ROUND(E25*($F$16+$F$41+$F$73),2)","v":85.73}]
[null,null,"C","SAT/RAT (art. 22, II, Lei 8.212/91 e Anexo V, Decreto 6.042/07) - Enquadramento 8211-3/00",{"$f":"'Encargos Sociais'!E15","v":0.01},34.29]
[null,null,"D","SESC ou SESI (art. 30, Lei nº 8.036/90 e art. 1º, Lei 8.154/90)",{"$f":"'Encargos Sociais'!E16","v":1.4999999999999999E-2},51.44]
[null,null,"E","SENAI ou SENAC (Decreto nº 2.318/86)",{"$f":"'Encargos Sociais'!E17","v":0.01},34.29]
[null,null,"F","SEBRAE (§ 3º, art. 8º, Lei 8.029/90, alterada pela Lei nº 8.154/90)",{"$f":"'Encargos Sociais'!E18","v":6.0000000000000001E-3},20.58]
[null,null,"G","INCRA (art. 1º, I, Decreto Lei 1.146/70 e Lei 7.787, de 30/06/89)",{"$f":"'Encargos Sociais'!E19","v":2E-3},6.86,null,"* Nota 1 - Os percentuais dos encargos previdenciários, do FGTS e demais contribuições são estabelecidos por legislação vigente."]
[null,null,"H","FGTS (Lei Complementar nº 110/01 e art. 30, Lei nº 8.036/90)",{"$f":"'Encargos Sociais'!E20","v":0.08},274.33999999999997,null,"* Nota 2 - O SAT, a depender do grau de risco do serviço, irá variar entre 1%, para risco leve, de 2%, para risco médio, e de 3% para risco grave."]
[null,null,"I","SECONCI (Convenções Coletivas de Trabalho da construção)",{"$f":"'Encargos Sociais'!E21","v":0.01},34.29,null,"* Nota 3 - Os percentuais do Submódulo 2.2 incidem sobre o Módulo 1 e o Submódulo 2.1."]
[]
[null,"Submódulo 2.3 - Benefícios Mensais e Diários"]
[null,null,"A","Auxílio Transporte",null,{"$f":"HLOOKUP($B$5,'Dados Gerais'!$D$5:$BK$93,82)","v":302.54000000000002}]
[null,null,"B","Auxílio Alimentação",null,{"$f":"HLOOKUP($B$5,'Dados Gerais'!$D$5:$BK$93,89)","v":534.82000000000005}]
[null,null,"C","Assistência Médica e Familiar",null,{"$f":"HLOOKUP($B$5,'Dados Gerais'!$D$5:$BK$101,97)","v":0}]
[null,null,"D","Outros (Seguro de vida e auxílio funeral e auxílio odontológico)",null,{"$f":"HLOOKUP($B$5,'Dados Gerais'!$D$5:$BK$118,114)","v":0},null,"* Nota 1 - O valor informado deverá ser o custo real do benefício (descontado o valor eventualmente pago pelo empregado)."]
[null,null,null,null,null,null,null,"* Nota 2 - Observar a previsão dos benefícios contidos em Acordos, Convenções e Dissídios Coletivos de Trabalho e o disposto no art. 6º da IN 5/2017"]
[null,null,null,"QUADRO-RESUMO DO MÓDULO 2"]
[null,null,null,"2.1 - 13º Salário, Férias e Adicional de Férias - 13º Destacado - Calculado no Módulo 7 ",{"$f":"SUM(E20:E21)","v":3.03030303030303E-2},{"$f":"F20+F21","v":91.06}]
[null,null,null,"2.2 - Encargos Previdenciários (GPS), Fundo de Garantia por Tempo de Serviço (FGTS) e Contribuições",{"$f":"SUM(E24:E32)","v":0.35800000000000004},{"$f":"SUM(F24:F32)","v":1227.6799999999998}]
[null,null,null,"2.3 - Benefícios Mensais e Diários",null,{"$f":"SUM(F35:F38)","v":837.36000000000013}]
[]
[null,null,null,"TOTAL DOS ENCARGOS E BENEFÍCIOS",null,{"$f":"SUM(F41:F43)","v":2156.1}]
[]
[null,"MÓDULO 3 - PREVISÃO PARA RESCISÃO",null,null,"Percentuais","Valor"]
[null,null,"A","Aviso Prévio Indenizado (Art. 7º, inciso XXI, da CF/1988 e arts. 477, 487, §1º, e 491 da CLT)",{"$f":"'Encargos Sociais'!E35","v":8.3333333333333332E-3},{"$f":"ROUND(E48*$F$16,2)","v":25.04}]
[null,null,"B","Incidência do FGTS sobre o Aviso Prévio Indenizado (Súmula 305 TST)",{"$f":"'Encargos Sociais'!E36","v":6.6666666666666664E-4},2,null,"* Nota 1 - Adotou-se os parâmetros do estudo do STF (http://www.stf.jus.br/arquivo/cms/sobrestfestudosci/anexo/encargos_sociais_03102007.pdf), onde 5% do pessoal é demitido pelo empregador no decurso do contrato (para estes, considerou-se o aviso prévio indenizado). Desprezou-se as demissões por justa causa e os pedidos de demissão."]
[null,null,"C","Multa do FGTS e Contribuição Social sobre o Aviso Prévio Indenizado (Art. 18, §1º, da Lei 8.036/1990 e art. 1º da LC nº 110/2001)",{"$f":"'Encargos Sociais'!E37","v":1.274074074074074E-3},3.83,null,"* Nota 2 - No cálculo do percentual, considerou-se 36 dias, correspondendo à metade da duração média dos contratos (2 anos)"]
[null,null,"D","Aviso Prévio Trabalhado (Art. 488, parágrafo único, CLT)",{"$f":"'Encargos Sociais'!E38","v":1.2037037037037035E-2},36.17,null,"* Nota 3 - Incide sobre a Remuneração + 13º salário (1/12) + Férias (1/12) + Adicional de Férias (1/36) x 50% multa (40% para o empregado e 10% de contribuição social) x 8% FGTS"]
[null,null,"E","Incidência de GPS, FGTS e outras contribuições sobre o Aviso Prévio Trabalhado",{"$f":"'Encargos Sociais'!E39","v":4.3092592592592583E-3},12.95,null,"* Nota 4 - Os 95% restantes do cálculo, a um prazo médio de contrato de 4 anos. Assim, calcula-se 7 dias para o 1º ano de contrato e mais 3 dias para os 3 anos seguintes."]
[null,null,"F","Multa do FGTS e Contribuição Social sobre o Aviso Prévio Trabalhado",{"$f":"'Encargos Sociais'!E40","v":3.0505155555555549E-2},91.66]
[]
[null,null,null,"TOTAL DE PREVISÃO PARA RESCISÃO",null,{"$f":"SUM(F48:F53)","v":171.64999999999998}]
[]
[null,"MÓDULO 4 - CUSTO DE REPOSIÇÃO DO PROFISSIONAL AUSENTE",null,null,"Percentuais","Valor"]
[null,"Submódulo 4.1 - Ausências Legais"]
[null,null,"A","Férias (Arts. 129 e 130, inc. I, da CLT)",{"$f":"'Encargos Sociais'!E24","v":9.0909090909090912E-2},{"$f":"ROUND(E59*$F$16,2)","v":273.17},null,"* Nota 1 - As alíneas “A” a “F” referem-se somente ao custo que será pago ao repositor pelos dias \ntrabalhados quando da necessidade de substituir a mão de obra alocada na prestação do serviço."]
[null,null,"B","Ausências Legais (Arts. 131 e 473 da CLT)",{"$f":"'Encargos Sociais'!E25","v":7.9365079365079361E-3},23.85,null,"* Nota 2 - Adotou-se a estimativa do SINAPI de 2 dias por ano."]
[null,null,"C","Licença-Paternidade (Art. 7º, XIX, e art. 10, §1º, do ADCT, CF/1988 e Art. 1º, II, da Lei 11.770/2008)",{"$f":"'Encargos Sociais'!E26","v":8.2777777777777776E-4},2.4900000000000002,null,"* Nota 3 - Utilizada a proporção de 50% para homens, 5 dias de afastamento, e a probabilidade de um trabalhador requerer a Licença Paternidade em 5,22%, conforme SINAPI (citando dados da PNAD 2015)"]
[null,null,"D","Ausência por Acidente de Trabalho (Art. 131, III, da CLT)",{"$f":"'Encargos Sociais'!E27","v":8.541666666666667E-4},2.57,null,"* Nota 4 - Utilzada a estatística de 1,96% dos contribuintes beneficiados com a emissão do auxílio, conforme Anuário Estatístico da Previdência Social. Afastamento de 15 dias a cargo da empresa."]
[null,null,"E","Afastamento Maternidade (Art. 71 da Lei nº 8.213/1991)",{"$f":"'Encargos Sociais'!E28","v":3.2925925925925922E-3},9.89,null,"* Nota 5 - Utilizada a proporção de 50% para mulheres, 180 dias de afastamento, e a probabilidade de uma trabalhadora requerer a Licença Maternidade em 4,91%, conforme SINAPI (citando dados do IBGE 2016)"]
[null,null,"F","Auxílio Enfermidade - Doença (Art. 59 da Lei nº 8.213/1991)",{"$f":"'Encargos Sociais'!E29","v":7.1222222222222225E-3},21.4,null,"* Nota 6 - Utilizada a estatística de 3,37% dos contribuintes beneficiados com o auxílio, conforme Anuário Estatístico da Previdência Social de 2015 (acrescidos de 2 dias ao ano, para os quais o trabalhador nem requer o benefício da Previdência - conforme SINAPI)"]
[]
[null,"Submódulo 4.2 - Intrajornada"]
[null,null,"A","Intervalo para repouso ou alimentação",{"$f":"'Encargos Sociais'!E32","v":0},{"$f":"ROUND(E67*$F$16,2)","v":0}]
[]
[null,null,null,"QUADRO-RESUMO DO MÓDULO 4",null,"Valor"]
[null,null,null,"4.1 - Ausências Legais",{"$f":"SUM(E59:E64)","v":0.11094235810485811},{"$f":"ROUND(E70*$F$16,2)","v":333.37}]
[null,null,null,"4.2 - Intrajornada",{"$f":"E67","v":0},{"$f":"ROUND(E71*$F$16,2)","v":0}]
[]
[null,null,null,"TOTAL DE PREVISÃO PARA RESCISÃO E INTERVALO INTRAJORNADA",null,{"$f":"SUM(F70:F71)","v":333.37}]
[]
[null,"MÓDULO 5 - INSUMOS DIVERSOS",null,null,null,"Valor"]
[null,null,"A","Uniformes - aquisição",null,{"$f":"ROUND(HLOOKUP($B$5,Uniformes!K3:DZ33,3)/12,2)","v":32.380000000000003}]
[null,null,"B","Materiais de consumo relacionados ao posto - aquisição",null,{"$f":"ROUND(HLOOKUP(B5,'Mat Cons'!I11:DX13,3)/12,2)","v":0}]
[null,null,"C","Materiais permanentes relacionados ao posto - remuneração da sua depreciação / manutenção",null,{"$f":"HLOOKUP(B5,'Mat Perm'!Q11:EF13,3)","v":0}]
[null,null,"D","Equipamentos relacionados ao posto - remuneração da sua depreciação / manutenção",null,{"$f":"HLOOKUP(B5,'Equip Rel'!Q11:EF13,3)","v":0}]
[null,null,"E","Equipamentos de Proteção Individual - EPI - aquisição",null,{"$f":"ROUND(HLOOKUP(B5,EPI!I3:DX67,3)/12,2)","v":38.06}]
[]
[null,null,null,"TOTAL DE INSUMOS DIVERSOS",null,{"$f":"SUM(F76:F81)","v":70.44},null,"* Nota - Valores mensais por empregado"]
[]
[null,"MÓDULO 6 - CUSTOS INDIRETOS, TRIBUTOS E LUCRO - BDI",null,null,"Percentuais","Valor"]
[null,null,"A","Custos Indiretos",{"$f":"BDI!E6","v":4.4400000000000002E-2}]
[null,null,"A.1","Administração Central",{"$f":"BDI!E7","v":3.9E-2}]
[null,null,"A.2","Seguros, Garantias e Riscos",{"$f":"BDI!E8","v":5.4000000000000003E-3}]
[null,null,"B","Lucro",{"$f":"BDI!E10","v":0.06}]
[null,null,"C","Tributos",{"$f":"SUM(E90:E91)","v":0.124}]
[null,null,"C.1","Tributos Federais (COFINS, PIS e CPRB)",{"$f":"BDI!E18","v":7.3999999999999996E-2}]
[null,null,"C.2","Tributos Distritais (ISS)",{"$f":"BDI!E23","v":0.05},null,null,"* Nota - Utilizou-se o indicado pelo Sindicato da Arquitetura e da Engenharia (Sinaenco, 2008, p. 22), que adota um percentual redutor de 20% no cálculo dos custos tributários relativos às contribuições PIS e COFINS"]
[null,null,"D","Despesas Financeiras",{"$f":"BDI!E13","v":4.4669210982628549E-3}]
[]
[null,null,null,"TOTAL DE BDI",{"$f":"BDI!E26","v":0.26939999999999997},{"$f":"E94*E102","v":1545.3924862817898}]
[]
[null,null,null,"QUADRO-RESUMO DO CUSTO MENSAL POR EMPREGADO - SEM O 13º","Valor"]
[null,null,null,"Módulo 1 - Composição da Remuneração",{"$f":"F16","v":3004.8634828574245}]
[null,null,null,"Módulo 2 - Encargos e Benefícios Anuais, Mensais e Diários",{"$f":"F45","v":2156.1}]
[null,null,null,"Módulo 3 - Provisão para Rescisão",{"$f":"F55","v":171.64999999999998}]
[null,null,null,"Módulo 4 - Custo de Reposição do Profissional Ausente",{"$f":"F73","v":333.37}]
[null,null,null,"Módulo 5 - Insumos Diversos",{"$f":"F82","v":70.44}]
[null,null,null,"SUBTOTAL (A+B+C+D+E)",{"$f":"SUM(E97:E101)","v":5736.4234828574236}]
[null,null,null,"Módulo 6 - Custos Indiretos, Tributos e Lucro",{"$f":"F94","v":1545.3924862817898}]
[]
[null,null,null,"TOTAL DO POSTO",{"$f":"SUM(E102:E103)","v":7281.8159691392138}]
[]
[null,"MÓDULO 7 - DESTAQUE DO MÓDULO 2 - 13º SALÁRIO",null,null,"Percentuais","Valor"]
[null,null,"A","13º Salário",{"$f":"'Encargos Sociais'!E31","v":8.3333333333333329E-2},{"$f":"ROUND(E108*F$16,2)","v":250.41}]
[null,null,"B","Encargos Sociais sobre o 13º Salário - Taxa calculada no SUBMÓDULO 2.2",{"$f":"SUM($E$24:$E$32)","v":0.35800000000000004},{"$f":"ROUND(E109*$F$108,2)","v":89.65},null,"* Nota 1 - Provisiona-se, mensalmente, o proporcional a 1/12 dos valores referentes a gratificação natalina e adicional de férias."]
[null,null,"C","Reincidência de férias sobre o 13º Salário",{"$f":"E59","v":9.0909090909090912E-2},{"$f":"ROUND(E110*($F$108+$F$109),2)","v":30.91}]
[null,null,"D","BDI sobre o 13º Salário - Taxa calculada no MÓDULO 6",{"$f":"E94","v":0.26939999999999997},{"$f":"ROUND(E111*($F$108+$F$109),2)","v":91.61}]
[]
[null,null,null,"TOTAL DO DESTAQUE DO 13º SALÁRIO",null,{"$f":"SUM(F108:F111)","v":462.58000000000004}]
[]
[null,null,null,"QUADRO-RESUMO DO CUSTO MENSAL POR EMPREGADO","Valor"]
[null,null,null,"Custo total - sem o 13º Salário",{"$f":"E105","v":7281.8159691392138}]
[null,null,null,"Destaque do 13º Salário (valor mensal)",{"$f":"F113","v":462.58000000000004}]
[]
[null,null,null,"TOTAL DO POSTO",{"$f":"E116+E117","v":7744.3959691392138}]

{"sheet":"5","index":8,"n_rows":119,"n_cols":8,"rows_kept":119,"cut":false,"hidden":false,"merged":[[1,1,1,5],[2,1,2,5],[4,1,4,2],[5,1,5,2],[7,1,7,3],[17,1,17,3],[106,1,106,3],[39,3,39,5],[46,1,46,3],[56,1,56,3],[68,3,68,5],[74,1,74,3],[83,1,83,3]]}
[]
[null,"PLANILHA DE ESTIMATIVA DE CUSTOS"]
[null,"Padrão IN 05/2017 e IN 07/2018 - MPDG"]
[]
[null,5,null,{"$f":"HLOOKUP($B$5,'Dados Gerais'!$D$5:$BK$20,6)","v":"OPERADOR DE CENTRAL DE DETECÇÃO E ALARME DE INCÊNDIO"},"QUANTIDADE",{"$f":"HLOOKUP($B$5,'Dados Gerais'!$D$5:$BK$20,10)","v":4}]
[null,"CCT",null,{"$f":"HLOOKUP($B$5,'Dados Gerais'!$D$5:$BK$20,15)","v":"CCT STICOMBE/DF x SINDUSCON/DF 2021/2023"},"DATA-BASE",{"$f":"HLOOKUP($B$5,'Dados Gerais'!$D$5:$BK$20,16)","v":"2021-05-01"}]
[]
[null,"MÓDULO 1 - COMPOSIÇÃO DA REMUNERAÇÃO",null,null,null,"Valor"]
[null,null,"A","Salário-Base",null,{"$f":"HLOOKUP($B$5,'Dados Gerais'!$D$5:$BK$20,8)","v":2333.4075053418801}]
[null,null,"B","Adicional de Periculosidade",null,{"$f":"HLOOKUP($B$5,'Dados Gerais'!$D$5:$BK$37,25)","v":0}]
[null,null,"C","Adicional de Insalubridade",null,{"$f":"HLOOKUP($B$5,'Dados Gerais'!$D$5:$BK$37,31)","v":0}]
[null,null,"D","Adicional Noturno",null,{"$f":"HLOOKUP($B$5,'Dados Gerais'!$D$5:$BK$50,46)","v":0},null,"* Nota 1 - O Módulo 1 refere-se ao valor mensal devido ao empregado pela prestação do serviço no período de 12 meses."]
[null,null,"E","Adicional de Hora Extra",null,{"$f":"HLOOKUP($B$5,'Dados Gerais'!$D$5:$BK$67,63)","v":155.56050035612535},null,"* Nota 2 - O adicional de hora extra no feriado trabalhado foi suprimido pela Lei 13.467/17"]
[null,null,"F","Outros (especificar)",null,{"$f":"HLOOKUP($B$5,'Dados Gerais'!$D$5:$BK$59,33)","v":0},null,"* Nota 3 - ART. 7º, § 2º, DA LEI Nº 605/49.Sendo mensalista o obreiro, o adicional noturno pago de forma fixa já é considerado integrado para os efeitos do pagamento do repouso semanal remunerado, nos termos do art. 7º, § 2º, da Lei nº 605/49."]
[]
[null,null,null,"TOTAL DA REMUNERAÇÃO",null,{"$f":"SUM(F9:F14)","v":2488.9680056980055}]
[]
[null,"MÓDULO 2 - ENCARGOS E BENEFÍCIOS ANUAIS, MENSAIS E DIÁRIOS",null,null,"Percentuais","Valor"]
[null,"Submódulo 2.1 - 13º Salário, Férias e Adicional de Férias"]
[null,null,"A","13º Salário - Calculado no Módulo 7 - Destacado",0,{"$f":"ROUND(E20*F$16,2)","v":0}]
[null,null,"B","Adicional de Férias",{"$f":"'Encargos Sociais'!E30","v":3.03030303030303E-2},{"$f":"ROUND(E21*F$16,2)","v":75.42},null,"* Nota 1 - Provisiona-se, mensalmente, o proporcional a 1/12 dos valores referentes a gratificação natalina, férias e adicional de férias."]
[null,null,null,null,null,null,null,"* Nota 2 - O adicional de férias contido no Submódulo 2.1 corresponde a 1/3 da remuneração que, por sua vez, é dividida por 12 contome Nota 1."]
[null,"Submódulo 2.2 - Encargos Previdenciários (GPS), Fundo de Garantia por Tempo de Serviço (FGTS) e Outras Contribuições"]
[null,null,"A","INSS (art. 22, inciso I, Lei nº 8.212/91)",{"$f":"'Encargos Sociais'!E13","v":0.2},{"$f":"ROUND(E24*($F$16+$F$41+$F$73),2)","v":568.1}]
[null,null,"B","Salário Educação (art. 3º, inciso I, Decreto nº 87.043/82)",{"$f":"'Encargos Sociais'!E14","v":2.5000000000000001E-2},{"$f":"ROUND(E25*($F$16+$F$41+$F$73),2)","v":71.010000000000005}]
[null,null,"C","SAT/RAT (art. 22, II, Lei 8.212/91 e Anexo V, Decreto 6.042/07) - Enquadramento 8211-3/00",{"$f":"'Encargos Sociais'!E15","v":0.01},28.41]
[null,null,"D","SESC ou SESI (art. 30, Lei nº 8.036/90 e art. 1º, Lei 8.154/90)",{"$f":"'Encargos Sociais'!E16","v":1.4999999999999999E-2},42.61]
[null,null,"E","SENAI ou SENAC (Decreto nº 2.318/86)",{"$f":"'Encargos Sociais'!E17","v":0.01},28.41]
[null,null,"F","SEBRAE (§ 3º, art. 8º, Lei 8.029/90, alterada pela Lei nº 8.154/90)",{"$f":"'Encargos Sociais'!E18","v":6.0000000000000001E-3},17.04]
[null,null,"G","INCRA (art. 1º, I, Decreto Lei 1.146/70 e Lei 7.787, de 30/06/89)",{"$f":"'Encargos Sociais'!E19","v":2E-3},5.68,null,"* Nota 1 - Os percentuais dos encargos previdenciários, do FGTS e demais contribuições são estabelecidos por legislação vigente."]
[null,null,"H","FGTS (Lei Complementar nº 110/01 e art. 30, Lei nº 8.036/90)",{"$f":"'Encargos Sociais'!E20","v":0.08},227.24,null,"* Nota 2 - O SAT, a depender do grau de risco do serviço, irá variar entre 1%, para risco leve, de 2%, para risco médio, e de 3% para risco grave."]
[null,null,"I","SECONCI (Convenções Coletivas de Trabalho da construção)",{"$f":"'Encargos Sociais'!E21","v":0.01},28.41,null,"* Nota 3 - Os percentuais do Submódulo 2.2 incidem sobre o Módulo 1 e o Submódulo 2.1."]
[]
[null,"Submódulo 2.3 - Benefícios Mensais e Diários"]
[null,null,"A","Auxílio Transporte",null,{"$f":"HLOOKUP($B$5,'Dados Gerais'!$D$5:$BK$93,82)","v":206.28}]
[null,null,"B","Auxílio Alimentação",null,{"$f":"HLOOKUP($B$5,'Dados Gerais'!$D$5:$BK$93,89)","v":364.65}]
[null,null,"C","Assistência Médica e Familiar",null,{"$f":"HLOOKUP($B$5,'Dados Gerais'!$D$5:$BK$101,97)","v":0}]
[null,null,"D","Outros (Seguro de vida e auxílio funeral e auxílio odontológico)",null,{"$f":"HLOOKUP($B$5,'Dados Gerais'!$D$5:$BK$118,114)","v":0},null,"* Nota 1 - O valor informado deverá ser o custo real do benefício (descontado o valor eventualmente pago pelo empregado)."]
[null,null,null,null,null,null,null,"* Nota 2 - Observar a previsão dos benefícios contidos em Acordos, Convenções e Dissídios Coletivos de Trabalho e o disposto no art. 6º da IN 5/2017"]
[null,null,null,"QUADRO-RESUMO DO MÓDULO 2"]
[null,null,null,"2.1 - 13º Salário, Férias e Adicional de Férias - 13º Destacado - Calculado no Módulo 7 ",{"$f":"SUM(E20:E21)","v":3.03030303030303E-2},{"$f":"F20+F21","v":75.42}]
[null,null,null,"2.2 - Encargos Previdenciários (GPS), Fundo de Garantia por Tempo de Serviço (FGTS) e Contribuições",{"$f":"SUM(E24:E32)","v":0.35800000000000004},{"$f":"SUM(F24:F32)","v":1016.9099999999999}]
[null,null,null,"2.3 - Benefícios Mensais e Diários",null,{"$f":"SUM(F35:F38)","v":570.92999999999995}]
[]
[null,null,null,"TOTAL DOS ENCARGOS E BENEFÍCIOS",null,{"$f":"SUM(F41:F43)","v":1663.2599999999998}]
[]
[null,"MÓDULO 3 - PREVISÃO PARA RESCISÃO",null,null,"Percentuais","Valor"]
[null,null,"A","Aviso Prévio Indenizado (Art. 7º, inciso XXI, da CF/1988 e arts. 477, 487, §1º, e 491 da CLT)",{"$f":"'Encargos Sociais'!E35","v":8.3333333333333332E-3},{"$f":"ROUND(E48*$F$16,2)","v":20.74}]
[null,null,"B","Incidência do FGTS sobre o Aviso Prévio Indenizado (Súmula 305 TST)",{"$f":"'Encargos Sociais'!E36","v":6.6666666666666664E-4},1.66,null,"* Nota 1 - Adotou-se os parâmetros do estudo do STF (http://www.stf.jus.br/arquivo/cms/sobrestfestudosci/anexo/encargos_sociais_03102007.pdf), onde 5% do pessoal é demitido pelo empregador no decurso do contrato (para estes, considerou-se o aviso prévio indenizado). Desprezou-se as demissões por justa causa e os pedidos de demissão."]
[null,null,"C","Multa do FGTS e Contribuição Social sobre o Aviso Prévio Indenizado (Art. 18, §1º, da Lei 8.036/1990 e art. 1º da LC nº 110/2001)",{"$f":"'Encargos Sociais'!E37","v":1.274074074074074E-3},3.17,null,"* Nota 2 - No cálculo do percentual, considerou-se 36 dias, correspondendo à metade da duração média dos contratos (2 anos)"]
[null,null,"D","Aviso Prévio Trabalhado (Art. 488, parágrafo único, CLT)",{"$f":"'Encargos Sociais'!E38","v":1.2037037037037035E-2},29.96,null,"* Nota 3 - Incide sobre a Remuneração + 13º salário (1/12) + Férias (1/12) + Adicional de Férias (1/36) x 50% multa (40% para o empregado e 10% de contribuição social) x 8% FGTS"]
[null,null,"E","Incidência de GPS, FGTS e outras contribuições sobre o Aviso Prévio Trabalhado",{"$f":"'Encargos Sociais'!E39","v":4.3092592592592583E-3},10.73,null,"* Nota 4 - Os 95% restantes do cálculo, a um prazo médio de contrato de 4 anos. Assim, calcula-se 7 dias para o 1º ano de contrato e mais 3 dias para os 3 anos seguintes."]
[null,null,"F","Multa do FGTS e Contribuição Social sobre o Aviso Prévio Trabalhado",{"$f":"'Encargos Sociais'!E40","v":3.0505155555555549E-2},75.930000000000007]
[]
[null,null,null,"TOTAL DE PREVISÃO PARA RESCISÃO",null,{"$f":"SUM(F48:F53)","v":142.19}]
[]
[null,"MÓDULO 4 - CUSTO DE REPOSIÇÃO DO PROFISSIONAL AUSENTE",null,null,"Percentuais","Valor"]
[null,"Submódulo 4.1 - Ausências Legais"]
[null,null,"A","Férias (Arts. 129 e 130, inc. I, da CLT)",{"$f":"'Encargos Sociais'!E24","v":9.0909090909090912E-2},{"$f":"ROUND(E59*$F$16,2)","v":226.27},null,"* Nota 1 - As alíneas “A” a “F” referem-se somente ao custo que será pago ao repositor pelos dias \ntrabalhados quando da necessidade de substituir a mão de obra alocada na prestação do serviço."]
[null,null,"B","Ausências Legais (Arts. 131 e 473 da CLT)",{"$f":"'Encargos Sociais'!E25","v":7.9365079365079361E-3},19.75,null,"* Nota 2 - Adotou-se a estimativa do SINAPI de 2 dias por ano."]
[null,null,"C","Licença-Paternidade (Art. 7º, XIX, e art. 10, §1º, do ADCT, CF/1988 e Art. 1º, II, da Lei 11.770/2008)",{"$f":"'Encargos Sociais'!E26","v":8.2777777777777776E-4},2.06,null,"* Nota 3 - Utilizada a proporção de 50% para homens, 5 dias de afastamento, e a probabilidade de um trabalhador requerer a Licença Paternidade em 5,22%, conforme SINAPI (citando dados da PNAD 2015)"]
[null,null,"D","Ausência por Acidente de Trabalho (Art. 131, III, da CLT)",{"$f":"'Encargos Sociais'!E27","v":8.541666666666667E-4},2.13,null,"* Nota 4 - Utilzada a estatística de 1,96% dos contribuintes beneficiados com a emissão do auxílio, conforme Anuário Estatístico da Previdência Social. Afastamento de 15 dias a cargo da empresa."]
[null,null,"E","Afastamento Maternidade (Art. 71 da Lei nº 8.213/1991)",{"$f":"'Encargos Sociais'!E28","v":3.2925925925925922E-3},8.1999999999999993,null,"* Nota 5 - Utilizada a proporção de 50% para mulheres, 180 dias de afastamento, e a probabilidade de uma trabalhadora requerer a Licença Maternidade em 4,91%, conforme SINAPI (citando dados do IBGE 2016)"]
[null,null,"F","Auxílio Enfermidade - Doença (Art. 59 da Lei nº 8.213/1991)",{"$f":"'Encargos Sociais'!E29","v":7.1222222222222225E-3},17.73,null,"* Nota 6 - Utilizada a estatística de 3,37% dos contribuintes beneficiados com o auxílio, conforme Anuário Estatístico da Previdência Social de 2015 (acrescidos de 2 dias ao ano, para os quais o trabalhador nem requer o benefício da Previdência - conforme SINAPI)"]
[]
[null,"Submódulo 4.2 - Intrajornada"]
[null,null,"A","Intervalo para repouso ou alimentação",{"$f":"'Encargos Sociais'!E32","v":0},{"$f":"ROUND(E67*$F$16,2)","v":0}]
[]
[null,null,null,"QUADRO-RESUMO DO MÓDULO 4",null,"Valor"]
[null,null,null,"4.1 - Ausências Legais",{"$f":"SUM(E59:E64)","v":0.11094235810485811},{"$f":"ROUND(E70*$F$16,2)","v":276.13}]
[null,null,null,"4.2 - Intrajornada",{"$f":"E67","v":0},{"$f":"ROUND(E71*$F$16,2)","v":0}]
[]
[null,null,null,"TOTAL DE PREVISÃO PARA RESCISÃO E INTERVALO INTRAJORNADA",null,{"$f":"SUM(F70:F71)","v":276.13}]
[]
[null,"MÓDULO 5 - INSUMOS DIVERSOS",null,null,null,"Valor"]
[null,null,"A","Uniformes - aquisição",null,{"$f":"ROUND(HLOOKUP($B$5,Uniformes!K3:DZ33,3)/12,2)","v":32.380000000000003}]
[null,null,"B","Materiais de consumo relacionados ao posto - aquisição",null,{"$f":"ROUND(HLOOKUP(B5,'Mat Cons'!I11:DX13,3)/12,2)","v":0}]
[null,null,"C","Materiais permanentes relacionados ao posto - remuneração da sua depreciação / manutenção",null,{"$f":"HLOOKUP(B5,'Mat Perm'!Q11:EF13,3)","v":0}]
[null,null,"D","Equipamentos relacionados ao posto - remuneração da sua depreciação / manutenção",null,{"$f":"HLOOKUP(B5,'Equip Rel'!Q11:EF13,3)","v":0}]
[null,null,"E","Equipamentos de Proteção Individual - EPI - aquisição",null,{"$f":"ROUND(HLOOKUP(B5,EPI!I3:DX67,3)/12,2)","v":117.82}]
[]
[null,null,null,"TOTAL DE INSUMOS DIVERSOS",null,{"$f":"SUM(F76:F81)","v":150.19999999999999},null,"* Nota - Valores mensais por empregado"]
[]
[null,"MÓDULO 6 - CUSTOS INDIRETOS, TRIBUTOS E LUCRO - BDI",null,null,"Percentuais","Valor"]
[null,null,"A","Custos Indiretos",{"$f":"BDI!E6","v":4.4400000000000002E-2}]
[null,null,"A.1","Administração Central",{"$f":"BDI!E7","v":3.9E-2}]
[null,null,"A.2","Seguros, Garantias e Riscos",{"$f":"BDI!E8","v":5.4000000000000003E-3}]
[null,null,"B","Lucro",{"$f":"BDI!E10","v":0.06}]
[null,null,"C","Tributos",{"$f":"SUM(E90:E91)","v":0.124}]
[null,null,"C.1","Tributos Federais (COFINS, PIS e CPRB)",{"$f":"BDI!E18","v":7.3999999999999996E-2}]
[null,null,"C.2","Tributos Distritais (ISS)",{"$f":"BDI!E23","v":0.05},null,null,"* Nota - Utilizou-se o indicado pelo Sindicato da Arquitetura e da Engenharia (Sinaenco, 2008, p. 22), que adota um percentual redutor de 20% no cálculo dos custos tributários relativos às contribuições PIS e COFINS"]
[null,null,"D","Despesas Financeiras",{"$f":"BDI!E13","v":4.4669210982628549E-3}]
[]
[null,null,null,"TOTAL DE BDI",{"$f":"BDI!E26","v":0.26939999999999997},{"$f":"E94*E102","v":1271.7695127350423}]
[]
[null,null,null,"QUADRO-RESUMO DO CUSTO MENSAL POR EMPREGADO - SEM O 13º","Valor"]
[null,null,null,"Módulo 1 - Composição da Remuneração",{"$f":"F16","v":2488.9680056980055}]
[null,null,null,"Módulo 2 - Encargos e Benefícios Anuais, Mensais e Diários",{"$f":"F45","v":1663.2599999999998}]
[null,null,null,"Módulo 3 - Provisão para Rescisão",{"$f":"F55","v":142.19}]
[null,null,null,"Módulo 4 - Custo de Reposição do Profissional Ausente",{"$f":"F73","v":276.13}]
[null,null,null,"Módulo 5 - Insumos Diversos",{"$f":"F82","v":150.19999999999999}]
[null,null,null,"SUBTOTAL (A+B+C+D+E)",{"$f":"SUM(E97:E101)","v":4720.7480056980048}]
[null,null,null,"Módulo 6 - Custos Indiretos, Tributos e Lucro",{"$f":"F94","v":1271.7695127350423}]
[]
[null,null,null,"TOTAL DO POSTO",{"$f":"SUM(E102:E103)","v":5992.5175184330474}]
[]
[null,"MÓDULO 7 - DESTAQUE DO MÓDULO 2 - 13º SALÁRIO",null,null,"Percentuais","Valor"]
[null,null,"A","13º Salário",{"$f":"'Encargos Sociais'!E31","v":8.3333333333333329E-2},{"$f":"ROUND(E108*F$16,2)","v":207.41}]
[null,null,"B","Encargos Sociais sobre o 13º Salário - Taxa calculada no SUBMÓDULO 2.2",{"$f":"SUM($E$24:$E$32)","v":0.35800000000000004},{"$f":"ROUND(E109*$F$108,2)","v":74.25},null,"* Nota 1 - Provisiona-se, mensalmente, o proporcional a 1/12 dos valores referentes a gratificação natalina e adicional de férias."]
[null,null,"C","Reincidência de férias sobre o 13º Salário",{"$f":"E59","v":9.0909090909090912E-2},{"$f":"ROUND(E110*($F$108+$F$109),2)","v":25.61}]
[null,null,"D","BDI sobre o 13º Salário - Taxa calculada no MÓDULO 6",{"$f":"E94","v":0.26939999999999997},{"$f":"ROUND(E111*($F$108+$F$109),2)","v":75.88}]
[]
[null,null,null,"TOTAL DO DESTAQUE DO 13º SALÁRIO",null,{"$f":"SUM(F108:F111)","v":383.15}]
[]
[null,null,null,"QUADRO-RESUMO DO CUSTO MENSAL POR EMPREGADO","Valor"]
[null,null,null,"Custo total - sem o 13º Salário",{"$f":"E105","v":5992.5175184330474}]
[null,null,null,"Destaque do 13º Salário (valor mensal)",{"$f":"F113","v":383.15}]
[]
[null,null,null,"TOTAL DO POSTO",{"$f":"E116+E117","v":6375.667518433047}]

{"sheet":"6","index":9,"n_rows":119,"n_cols":8,"rows_kept":119,"cut":false,"hidden":false,"merged":[[106,1,106,3],[39,3,39,5],[46,1,46,3],[56,1,56,3],[68,3,68,5],[74,1,74,3],[83,1,83,3],[17,1,17,3],[1,1,1,5],[2,1,2,5],[4,1,4,2],[5,1,5,2],[7,1,7,3]]}
[]
[null,"PLANILHA DE ESTIMATIVA DE CUSTOS"]
[null,"Padrão IN 05/2017 e IN 07/2018 - MPDG"]
[]
[null,6,null,{"$f":"HLOOKUP($B$5,'Dados Gerais'!$D$5:$BK$20,6)","v":"OPERADOR DE CENTRAL DE DETECÇÃO E ALARME DE INCÊNDIO (COM ADICIONAL NOTURNO)"},"QUANTIDADE",{"$f":"HLOOKUP($B$5,'Dados Gerais'!$D$5:$BK$20,10)","v":4}]
[null,"CCT",null,{"$f":"HLOOKUP($B$5,'Dados Gerais'!$D$5:$BK$20,15)","v":"CCT STICOMBE/DF x SINDUSCON/DF 2021/2023"},"DATA-BASE",{"$f":"HLOOKUP($B$5,'Dados Gerais'!$D$5:$BK$20,16)","v":"2021-05-01"}]
[]
[null,"MÓDULO 1 - COMPOSIÇÃO DA REMUNERAÇÃO",null,null,null,"Valor"]
[null,null,"A","Salário-Base",null,{"$f":"HLOOKUP($B$5,'Dados Gerais'!$D$5:$BK$20,8)","v":2333.4075053418801}]
[null,null,"B","Adicional de Periculosidade",null,{"$f":"HLOOKUP($B$5,'Dados Gerais'!$D$5:$BK$37,25)","v":0}]
[null,null,"C","Adicional de Insalubridade",null,{"$f":"HLOOKUP($B$5,'Dados Gerais'!$D$5:$BK$37,31)","v":0}]
[null,null,"D","Adicional Noturno",null,{"$f":"HLOOKUP($B$5,'Dados Gerais'!$D$5:$BK$50,46)","v":272.23},null,"* Nota 1 - O Módulo 1 refere-se ao valor mensal devido ao empregado pela prestação do serviço no período de 12 meses."]
[null,null,"E","Adicional de Hora Extra",null,{"$f":"HLOOKUP($B$5,'Dados Gerais'!$D$5:$BK$67,63)","v":155.56050035612535},null,"* Nota 2 - O adicional de hora extra no feriado trabalhado foi suprimido pela Lei 13.467/17"]
[null,null,"F","Outros (especificar)",null,{"$f":"HLOOKUP($B$5,'Dados Gerais'!$D$5:$BK$59,33)","v":0},null,"* Nota 3 - ART. 7º, § 2º, DA LEI Nº 605/49.Sendo mensalista o obreiro, o adicional noturno pago de forma fixa já é considerado integrado para os efeitos do pagamento do repouso semanal remunerado, nos termos do art. 7º, § 2º, da Lei nº 605/49."]
[]
[null,null,null,"TOTAL DA REMUNERAÇÃO",null,{"$f":"SUM(F9:F14)","v":2761.1980056980055}]
[]
[null,"MÓDULO 2 - ENCARGOS E BENEFÍCIOS ANUAIS, MENSAIS E DIÁRIOS",null,null,"Percentuais","Valor"]
[null,"Submódulo 2.1 - 13º Salário, Férias e Adicional de Férias"]
[null,null,"A","13º Salário - Calculado no Módulo 7 - Destacado",0,{"$f":"ROUND(E20*F$16,2)","v":0}]
[null,null,"B","Adicional de Férias",{"$f":"'Encargos Sociais'!E30","v":3.03030303030303E-2},{"$f":"ROUND(E21*F$16,2)","v":83.67},null,"* Nota 1 - Provisiona-se, mensalmente, o proporcional a 1/12 dos valores referentes a gratificação natalina, férias e adicional de férias."]
[null,null,null,null,null,null,null,"* Nota 2 - O adicional de férias contido no Submódulo 2.1 corresponde a 1/3 da remuneração que, por sua vez, é dividida por 12 contome Nota 1."]
[null,"Submódulo 2.2 - Encargos Previdenciários (GPS), Fundo de Garantia por Tempo de Serviço (FGTS) e Outras Contribuições"]
[null,null,"A","INSS (art. 22, inciso I, Lei nº 8.212/91)",{"$f":"'Encargos Sociais'!E13","v":0.2},{"$f":"ROUND(E24*($F$16+$F$41+$F$73),2)","v":630.24}]
[null,null,"B","Salário Educação (art. 3º, inciso I, Decreto nº 87.043/82)",{"$f":"'Encargos Sociais'!E14","v":2.5000000000000001E-2},{"$f":"ROUND(E25*($F$16+$F$41+$F$73),2)","v":78.78}]
[null,null,"C","SAT/RAT (art. 22, II, Lei 8.212/91 e Anexo V, Decreto 6.042/07) - Enquadramento 8211-3/00",{"$f":"'Encargos Sociais'!E15","v":0.01},31.51]
[null,null,"D","SESC ou SESI (art. 30, Lei nº 8.036/90 e art. 1º, Lei 8.154/90)",{"$f":"'Encargos Sociais'!E16","v":1.4999999999999999E-2},47.27]
[null,null,"E","SENAI ou SENAC (Decreto nº 2.318/86)",{"$f":"'Encargos Sociais'!E17","v":0.01},31.51]
[null,null,"F","SEBRAE (§ 3º, art. 8º, Lei 8.029/90, alterada pela Lei nº 8.154/90)",{"$f":"'Encargos Sociais'!E18","v":6.0000000000000001E-3},18.91]
[null,null,"G","INCRA (art. 1º, I, Decreto Lei 1.146/70 e Lei 7.787, de 30/06/89)",{"$f":"'Encargos Sociais'!E19","v":2E-3},6.3,null,"* Nota 1 - Os percentuais dos encargos previdenciários, do FGTS e demais contribuições são estabelecidos por legislação vigente."]
[null,null,"H","FGTS (Lei Complementar nº 110/01 e art. 30, Lei nº 8.036/90)",{"$f":"'Encargos Sociais'!E20","v":0.08},252.1,null,"* Nota 2 - O SAT, a depender do grau de risco do serviço, irá variar entre 1%, para risco leve, de 2%, para risco médio, e de 3% para risco grave."]
[null,null,"I","SECONCI (Convenções Coletivas de Trabalho da construção)",{"$f":"'Encargos Sociais'!E21","v":0.01},31.51,null,"* Nota 3 - Os percentuais do Submódulo 2.2 incidem sobre o Módulo 1 e o Submódulo 2.1."]
[]
[null,"Submódulo 2.3 - Benefícios Mensais e Diários"]
[null,null,"A","Auxílio Transporte",null,{"$f":"HLOOKUP($B$5,'Dados Gerais'!$D$5:$BK$93,82)","v":206.28}]
[null,null,"B","Auxílio Alimentação",null,{"$f":"HLOOKUP($B$5,'Dados Gerais'!$D$5:$BK$93,89)","v":364.65}]
[null,null,"C","Assistência Médica e Familiar",null,{"$f":"HLOOKUP($B$5,'Dados Gerais'!$D$5:$BK$101,97)","v":0}]
[null,null,"D","Outros (Seguro de vida e auxílio funeral e auxílio odontológico)",null,{"$f":"HLOOKUP($B$5,'Dados Gerais'!$D$5:$BK$118,114)","v":0},null,"* Nota 1 - O valor informado deverá ser o custo real do benefício (descontado o valor eventualmente pago pelo empregado)."]
[null,null,null,null,null,null,null,"* Nota 2 - Observar a previsão dos benefícios contidos em Acordos, Convenções e Dissídios Coletivos de Trabalho e o disposto no art. 6º da IN 5/2017"]
[null,null,null,"QUADRO-RESUMO DO MÓDULO 2"]
[null,null,null,"2.1 - 13º Salário, Férias e Adicional de Férias - 13º Destacado - Calculado no Módulo 7 ",{"$f":"SUM(E20:E21)","v":3.03030303030303E-2},{"$f":"F20+F21","v":83.67}]
[null,null,null,"2.2 - Encargos Previdenciários (GPS), Fundo de Garantia por Tempo de Serviço (FGTS) e Contribuições",{"$f":"SUM(E24:E32)","v":0.35800000000000004},{"$f":"SUM(F24:F32)","v":1128.1299999999999}]
[null,null,null,"2.3 - Benefícios Mensais e Diários",null,{"$f":"SUM(F35:F38)","v":570.92999999999995}]
[]
[null,null,null,"TOTAL DOS ENCARGOS E BENEFÍCIOS",null,{"$f":"SUM(F41:F43)","v":1782.73}]
[]
[null,"MÓDULO 3 - PREVISÃO PARA RESCISÃO",null,null,"Percentuais","Valor"]
[null,null,"A","Aviso Prévio Indenizado (Art. 7º, inciso XXI, da CF/1988 e arts. 477, 487, §1º, e 491 da CLT)",{"$f":"'Encargos Sociais'!E35","v":8.3333333333333332E-3},{"$f":"ROUND(E48*$F$16,2)","v":23.01}]
[null,null,"B","Incidência do FGTS sobre o Aviso Prévio Indenizado (Súmula 305 TST)",{"$f":"'Encargos Sociais'!E36","v":6.6666666666666664E-4},1.84,null,"* Nota 1 - Adotou-se os parâmetros do estudo do STF (http://www.stf.jus.br/arquivo/cms/sobrestfestudosci/anexo/encargos_sociais_03102007.pdf), onde 5% do pessoal é demitido pelo empregador no decurso do contrato (para estes, considerou-se o aviso prévio indenizado). Desprezou-se as demissões por justa causa e os pedidos de demissão."]
[null,null,"C","Multa do FGTS e Contribuição Social sobre o Aviso Prévio Indenizado (Art. 18, §1º, da Lei 8.036/1990 e art. 1º da LC nº 110/2001)",{"$f":"'Encargos Sociais'!E37","v":1.274074074074074E-3},3.52,null,"* Nota 2 - No cálculo do percentual, considerou-se 36 dias, correspondendo à metade da duração média dos contratos (2 anos)"]
[null,null,"D","Aviso Prévio Trabalhado (Art. 488, parágrafo único, CLT)",{"$f":"'Encargos Sociais'!E38","v":1.2037037037037035E-2},33.24,null,"* Nota 3 - Incide sobre a Remuneração + 13º salário (1/12) + Férias (1/12) + Adicional de Férias (1/36) x 50% multa (40% para o empregado e 10% de contribuição social) x 8% FGTS"]
[null,null,"E","Incidência de GPS, FGTS e outras contribuições sobre o Aviso Prévio Trabalhado",{"$f":"'Encargos Sociais'!E39","v":4.3092592592592583E-3},11.9,null,"* Nota 4 - Os 95% restantes do cálculo, a um prazo médio de contrato de 4 anos. Assim, calcula-se 7 dias para o 1º ano de contrato e mais 3 dias para os 3 anos seguintes."]
[null,null,"F","Multa do FGTS e Contribuição Social sobre o Aviso Prévio Trabalhado",{"$f":"'Encargos Sociais'!E40","v":3.0505155555555549E-2},84.23]
[]
[null,null,null,"TOTAL DE PREVISÃO PARA RESCISÃO",null,{"$f":"SUM(F48:F53)","v":157.74}]
[]
[null,"MÓDULO 4 - CUSTO DE REPOSIÇÃO DO PROFISSIONAL AUSENTE",null,null,"Percentuais","Valor"]
[null,"Submódulo 4.1 - Ausências Legais"]
[null,null,"A","Férias (Arts. 129 e 130, inc. I, da CLT)",{"$f":"'Encargos Sociais'!E24","v":9.0909090909090912E-2},{"$f":"ROUND(E59*$F$16,2)","v":251.02},null,"* Nota 1 - As alíneas “A” a “F” referem-se somente ao custo que será pago ao repositor pelos dias \ntrabalhados quando da necessidade de substituir a mão de obra alocada na prestação do serviço."]
[null,null,"B","Ausências Legais (Arts. 131 e 473 da CLT)",{"$f":"'Encargos Sociais'!E25","v":7.9365079365079361E-3},21.91,null,"* Nota 2 - Adotou-se a estimativa do SINAPI de 2 dias por ano."]
[null,null,"C","Licença-Paternidade (Art. 7º, XIX, e art. 10, §1º, do ADCT, CF/1988 e Art. 1º, II, da Lei 11.770/2008)",{"$f":"'Encargos Sociais'!E26","v":8.2777777777777776E-4},2.29,null,"* Nota 3 - Utilizada a proporção de 50% para homens, 5 dias de afastamento, e a probabilidade de um trabalhador requerer a Licença Paternidade em 5,22%, conforme SINAPI (citando dados da PNAD 2015)"]
[null,null,"D","Ausência por Acidente de Trabalho (Art. 131, III, da CLT)",{"$f":"'Encargos Sociais'!E27","v":8.541666666666667E-4},2.36,null,"* Nota 4 - Utilzada a estatística de 1,96% dos contribuintes beneficiados com a emissão do auxílio, conforme Anuário Estatístico da Previdência Social. Afastamento de 15 dias a cargo da empresa."]
[null,null,"E","Afastamento Maternidade (Art. 71 da Lei nº 8.213/1991)",{"$f":"'Encargos Sociais'!E28","v":3.2925925925925922E-3},9.09,null,"* Nota 5 - Utilizada a proporção de 50% para mulheres, 180 dias de afastamento, e a probabilidade de uma trabalhadora requerer a Licença Maternidade em 4,91%, conforme SINAPI (citando dados do IBGE 2016)"]
[null,null,"F","Auxílio Enfermidade - Doença (Art. 59 da Lei nº 8.213/1991)",{"$f":"'Encargos Sociais'!E29","v":7.1222222222222225E-3},19.670000000000002,null,"* Nota 6 - Utilizada a estatística de 3,37% dos contribuintes beneficiados com o auxílio, conforme Anuário Estatístico da Previdência Social de 2015 (acrescidos de 2 dias ao ano, para os quais o trabalhador nem requer o benefício da Previdência - conforme SINAPI)"]
[]
[null,"Submódulo 4.2 - Intrajornada"]
[null,null,"A","Intervalo para repouso ou alimentação",{"$f":"'Encargos Sociais'!E32","v":0},{"$f":"ROUND(E67*$F$16,2)","v":0}]
[]
[null,null,null,"QUADRO-RESUMO DO MÓDULO 4",null,"Valor"]
[null,null,null,"4.1 - Ausências Legais",{"$f":"SUM(E59:E64)","v":0.11094235810485811},{"$f":"ROUND(E70*$F$16,2)","v":306.33}]
[null,null,null,"4.2 - Intrajornada",{"$f":"E67","v":0},{"$f":"ROUND(E71*$F$16,2)","v":0}]
[]
[null,null,null,"TOTAL DE PREVISÃO PARA RESCISÃO E INTERVALO INTRAJORNADA",null,{"$f":"SUM(F70:F71)","v":306.33}]
[]
[null,"MÓDULO 5 - INSUMOS DIVERSOS",null,null,null,"Valor"]
[null,null,"A","Uniformes - aquisição",null,{"$f":"ROUND(HLOOKUP($B$5,Uniformes!K3:DZ33,3)/12,2)","v":32.380000000000003}]
[null,null,"B","Materiais de consumo relacionados ao posto - aquisição",null,{"$f":"ROUND(HLOOKUP(B5,'Mat Cons'!I11:DX13,3)/12,2)","v":0}]
[null,null,"C","Materiais permanentes relacionados ao posto - remuneração da sua depreciação / manutenção",null,{"$f":"HLOOKUP(B5,'Mat Perm'!Q11:EF13,3)","v":0}]
[null,null,"D","Equipamentos relacionados ao posto - remuneração da sua depreciação / manutenção",null,{"$f":"HLOOKUP(B5,'Equip Rel'!Q11:EF13,3)","v":0}]
[null,null,"E","Equipamentos de Proteção Individual - EPI - aquisição",null,{"$f":"ROUND(HLOOKUP(B5,EPI!I3:DX67,3)/12,2)","v":117.82}]
[]
[null,null,null,"TOTAL DE INSUMOS DIVERSOS",null,{"$f":"SUM(F76:F81)","v":150.19999999999999},null,"* Nota - Valores mensais por empregado"]
[]
[null,"MÓDULO 6 - CUSTOS INDIRETOS, TRIBUTOS E LUCRO - BDI",null,null,"Percentuais","Valor"]
[null,null,"A","Custos Indiretos",{"$f":"BDI!E6","v":4.4400000000000002E-2}]
[null,null,"A.1","Administração Central",{"$f":"BDI!E7","v":3.9E-2}]
[null,null,"A.2","Seguros, Garantias e Riscos",{"$f":"BDI!E8","v":5.4000000000000003E-3}]
[null,null,"B","Lucro",{"$f":"BDI!E10","v":0.06}]
[null,null,"C","Tributos",{"$f":"SUM(E90:E91)","v":0.124}]
[null,null,"C.1","Tributos Federais (COFINS, PIS e CPRB)",{"$f":"BDI!E18","v":7.3999999999999996E-2}]
[null,null,"C.2","Tributos Distritais (ISS)",{"$f":"BDI!E23","v":0.05},null,null,"* Nota - Utilizou-se o indicado pelo Sindicato da Arquitetura e da Engenharia (Sinaenco, 2008, p. 22), que adota um percentual redutor de 20% no cálculo dos custos tributários relativos às contribuições PIS e COFINS"]
[null,null,"D","Despesas Financeiras",{"$f":"BDI!E13","v":4.4669210982628549E-3}]
[]
[null,null,null,"TOTAL DE BDI",{"$f":"BDI!E26","v":0.26939999999999997},{"$f":"E94*E102","v":1389.6185427350426}]
[]
[null,null,null,"QUADRO-RESUMO DO CUSTO MENSAL POR EMPREGADO - SEM O 13º","Valor"]
[null,null,null,"Módulo 1 - Composição da Remuneração",{"$f":"F16","v":2761.1980056980055}]
[null,null,null,"Módulo 2 - Encargos e Benefícios Anuais, Mensais e Diários",{"$f":"F45","v":1782.73}]
[null,null,null,"Módulo 3 - Provisão para Rescisão",{"$f":"F55","v":157.74}]
[null,null,null,"Módulo 4 - Custo de Reposição do Profissional Ausente",{"$f":"F73","v":306.33}]
[null,null,null,"Módulo 5 - Insumos Diversos",{"$f":"F82","v":150.19999999999999}]
[null,null,null,"SUBTOTAL (A+B+C+D+E)",{"$f":"SUM(E97:E101)","v":5158.1980056980055}]
[null,null,null,"Módulo 6 - Custos Indiretos, Tributos e Lucro",{"$f":"F94","v":1389.6185427350426}]
[]
[null,null,null,"TOTAL DO POSTO",{"$f":"SUM(E102:E103)","v":6547.8165484330484}]
[]
[null,"MÓDULO 7 - DESTAQUE DO MÓDULO 2 - 13º SALÁRIO",null,null,"Percentuais","Valor"]
[null,null,"A","13º Salário",{"$f":"'Encargos Sociais'!E31","v":8.3333333333333329E-2},{"$f":"ROUND(E108*F$16,2)","v":230.1}]
[null,null,"B","Encargos Sociais sobre o 13º Salário - Taxa calculada no SUBMÓDULO 2.2",{"$f":"SUM($E$24:$E$32)","v":0.35800000000000004},{"$f":"ROUND(E109*$F$108,2)","v":82.38},null,"* Nota 1 - Provisiona-se, mensalmente, o proporcional a 1/12 dos valores referentes a gratificação natalina e adicional de férias."]
[null,null,"C","Reincidência de férias sobre o 13º Salário",{"$f":"E59","v":9.0909090909090912E-2},{"$f":"ROUND(E110*($F$108+$F$109),2)","v":28.41}]
[null,null,"D","BDI sobre o 13º Salário - Taxa calculada no MÓDULO 6",{"$f":"E94","v":0.26939999999999997},{"$f":"ROUND(E111*($F$108+$F$109),2)","v":84.18}]
[]
[null,null,null,"TOTAL DO DESTAQUE DO 13º SALÁRIO",null,{"$f":"SUM(F108:F111)","v":425.07000000000005}]
[]
[null,null,null,"QUADRO-RESUMO DO CUSTO MENSAL POR EMPREGADO","Valor"]
[null,null,null,"Custo total - sem o 13º Salário",{"$f":"E105","v":6547.8165484330484}]
[null,null,null,"Destaque do 13º Salário (valor mensal)",{"$f":"F113","v":425.07000000000005}]
[]
[null,null,null,"TOTAL DO POSTO",{"$f":"E116+E117","v":6972.8865484330481}]

{"sheet":"7","index":10,"n_rows":125,"n_cols":8,"rows_kept":125,"cut":false,"hidden":true,"merged":[[90,1,90,3],[113,1,113,3],[24,1,24,3],[46,3,46,5],[53,1,53,3],[63,1,63,3],[75,3,75,5],[81,1,81,3],[14,1,14,3],[6,3,6,5],[8,1,8,5],[9,1,9,5],[11,1,11,2],[12,1,12,2]]}
[null,null,"CÂMARA DOS DEPUTADOS"]
[null,null,"DEPARTAMENTO TÉCNICO"]
[null,null,"Coordenação de Planejamento e Gestão"]
[]
[null,null,"Data:",{"$f":"'Dados Gerais'!#REF!","v":{"$error":"#REF!"}}]
[null,null,"Processo:",{"$f":"'Dados Gerais'!#REF!","v":{"$error":"#REF!"}}]
[null,null,"Objeto:",{"$f":"'Dados Gerais'!#REF!","v":{"$error":"#REF!"}}]
[]
[null,"PLANILHA DE ESTIMATIVA DE CUSTOS"]
[null,"Padrão IN 05/2017 e IN 07/2018 - MPDG"]
[]
[null,7,null,{"$f":"HLOOKUP($B$12,'Dados Gerais'!$D$5:$BK$20,6)","v":0},"QUANTIDADE",{"$f":"HLOOKUP($B$12,'Dados Gerais'!$D$5:$BK$20,10)","v":0}]
[null,"CCT",null,{"$f":"HLOOKUP($B$12,'Dados Gerais'!$D$5:$BK$20,15)","v":0},"DATA-BASE",{"$f":"HLOOKUP($B$12,'Dados Gerais'!$D$5:$BK$20,16)","v":"00:00:00"}]
[]
[null,"MÓDULO 1 - COMPOSIÇÃO DA REMUNERAÇÃO",null,null,null,"Valor"]
[null,null,"A","Salário-Base",null,{"$f":"HLOOKUP($B$12,'Dados Gerais'!$D$5:$BK$20,8)","v":0}]
[null,null,"B","Adicional de Periculosidade",null,{"$f":"HLOOKUP($B$12,'Dados Gerais'!$D$5:$BK$37,25)","v":0}]
[null,null,"C","Adicional de Insalubridade",null,{"$f":"HLOOKUP($B$12,'Dados Gerais'!$D$5:$BK$37,31)","v":0}]
[null,null,"D","Adicional Noturno",null,{"$f":"HLOOKUP($B$12,'Dados Gerais'!$D$5:$BK$50,46)","v":{"$error":"#DIV/0!"}},null,"* Nota 1 - O Módulo 1 refere-se ao valor mensal devido ao empregado pela prestação do serviço no período de 12 meses."]
[null,null,"E","Adicional de Hora Extra",null,{"$f":"HLOOKUP($B$12,'Dados Gerais'!$D$5:$BK$67,63)","v":{"$error":"#DIV/0!"}},null,"* Nota 2 - O adicional de hora extra no feriado trabalhado foi suprimido pela Lei 13.467/17"]
[null,null,"F","Outros (especificar)",null,{"$f":"HLOOKUP($B$12,'Dados Gerais'!$D$5:$BK$59,33)","v":0},null,"* Nota 3 - ART. 7º, § 2º, DA LEI Nº 605/49.Sendo mensalista o obreiro, o adicional noturno pago de forma fixa já é considerado integrado para os efeitos do pagamento do repouso semanal remunerado, nos termos do art. 7º, § 2º, da Lei nº 605/49."]
[]
[null,null,null,"TOTAL DA REMUNERAÇÃO",null,{"$f":"SUM(F16:F21)","v":{"$error":"#DIV/0!"}}]
[]
[null,"MÓDULO 2 - ENCARGOS E BENEFÍCIOS ANUAIS, MENSAIS E DIÁRIOS",null,null,"Percentuais","Valor"]
[null,"Submódulo 2.1 - 13º Salário, Férias e Adicional de Férias"]
[null,null,"A","13º Salário - Calculado no Módulo 7 - Destacado",0,{"$f":"ROUND(E27*F$23,2)","v":{"$error":"#DIV/0!"}}]
[null,null,"B","Férias e Adicional de Férias",{"$f":"'Encargos Sociais'!E24+'Encargos Sociais'!E30","v":0.12121212121212122},{"$f":"ROUND(E28*F$23,2)","v":{"$error":"#DIV/0!"}},null,"* Nota 1 - Provisiona-se, mensalmente, o proporcional a 1/12 dos valores referentes a gratificação natalina, férias e adicional de férias."]
[null,null,null,null,null,null,null,"* Nota 2 - O adicional de férias contido no Submódulo 2.1 corresponde a 1/3 da remuneração que, por sua vez, é dividida por 12 contome Nota 1."]
[null,"Submódulo 2.2 - Encargos Previdenciários (GPS), Fundo de Garantia por Tempo de Serviço (FGTS) e Outras Contribuições"]
[null,null,"A","INSS (art. 22, inciso I, Lei nº 8.212/91)",{"$f":"'Encargos Sociais'!E13","v":0.2},{"$f":"ROUND(E31*($F$23+$F$48+$F$80),2)","v":{"$error":"#DIV/0!"}}]
[null,null,"B","Salário Educação (art. 3º, inciso I, Decreto nº 87.043/82)",{"$f":"'Encargos Sociais'!E14","v":2.5000000000000001E-2},{"$f":"ROUND(E32*($F$23+$F$48+$F$80),2)","v":{"$error":"#DIV/0!"}}]
[null,null,"C","SAT/RAT (art. 22, II, Lei 8.212/91 e Anexo V, Decreto 6.042/07) - Enquadramento 8211-3/00",{"$f":"'Encargos Sociais'!E15","v":0.01},{"$error":"#DIV/0!"}]
[null,null,"D","SESC ou SESI (art. 30, Lei nº 8.036/90 e art. 1º, Lei 8.154/90)",{"$f":"'Encargos Sociais'!E16","v":1.4999999999999999E-2},{"$error":"#DIV/0!"}]
[null,null,"E","SENAI ou SENAC (Decreto nº 2.318/86)",{"$f":"'Encargos Sociais'!E17","v":0.01},{"$error":"#DIV/0!"}]
[null,null,"F","SEBRAE (§ 3º, art. 8º, Lei 8.029/90, alterada pela Lei nº 8.154/90)",{"$f":"'Encargos Sociais'!E18","v":6.0000000000000001E-3},{"$error":"#DIV/0!"}]
[null,null,"G","INCRA (art. 1º, I, Decreto Lei 1.146/70 e Lei 7.787, de 30/06/89)",{"$f":"'Encargos Sociais'!E19","v":2E-3},{"$error":"#DIV/0!"},null,"* Nota 1 - Os percentuais dos encargos previdenciários, do FGTS e demais contribuições são estabelecidos por legislação vigente."]
[null,null,"H","FGTS (Lei Complementar nº 110/01 e art. 30, Lei nº 8.036/90)",{"$f":"'Encargos Sociais'!E20","v":0.08},{"$error":"#DIV/0!"},null,"* Nota 2 - O SAT, a depender do grau de risco do serviço, irá variar entre 1%, para risco leve, de 2%, para risco médio, e de 3% para risco grave."]
[null,null,"I","SECONCI (Convenções Coletivas de Trabalho da construção)",{"$f":"'Encargos Sociais'!E21","v":0.01},{"$error":"#DIV/0!"},null,"* Nota 3 - Os percentuais do Submódulo 2.2 incidem sobre o Módulo 1 e o Submódulo 2.1."]
[]
[null,"Submódulo 2.3 - Benefícios Mensais e Diários"]
[null,null,"A","Auxílio Transporte",null,{"$f":"HLOOKUP($B$12,'Dados Gerais'!$D$5:$BK$93,82)","v":0}]
[null,null,"B","Auxílio Alimentação",null,{"$f":"HLOOKUP($B$12,'Dados Gerais'!$D$5:$BK$93,89)","v":{"$error":"#NUM!"}}]
[null,null,"C","Assistência Médica e Familiar",null,{"$f":"HLOOKUP($B$12,'Dados Gerais'!$D$5:$BK$101,97)","v":0}]
[null,null,"D","Outros (Seguro de vida e auxílio funeral e auxílio odontológico)",null,{"$f":"HLOOKUP($B$12,'Dados Gerais'!$D$5:$BK$118,114)","v":0},null,"* Nota 1 - O valor informado deverá ser o custo real do benefício (descontado o valor eventualmente pago pelo empregado)."]
[null,null,null,null,null,null,null,"* Nota 2 - Observar a previsão dos benefícios contidos em Acordos, Convenções e Dissídios Coletivos de Trabalho e o disposto no art. 6º da IN 5/2017"]
[null,null,null,"QUADRO-RESUMO DO MÓDULO 2"]
[null,null,null,"2.1 - 13º Salário, Férias e Adicional de Férias - 13º Destacado - Calculado no Módulo 7 ",{"$f":"SUM(E27:E28)","v":0.12121212121212122},{"$f":"F27+F28","v":{"$error":"#DIV/0!"}}]
[null,null,null,"2.2 - Encargos Previdenciários (GPS), Fundo de Garantia por Tempo de Serviço (FGTS) e Contribuições",{"$f":"SUM(E31:E39)","v":0.35800000000000004},{"$f":"SUM(F31:F39)","v":{"$error":"#DIV/0!"}}]
[null,null,null,"2.3 - Benefícios Mensais e Diários",null,{"$f":"SUM(F42:F45)","v":{"$error":"#NUM!"}}]
[]
[null,null,null,"TOTAL DOS ENCARGOS E BENEFÍCIOS",null,{"$f":"SUM(F48:F50)","v":{"$error":"#DIV/0!"}}]
[]
[null,"MÓDULO 3 - PREVISÃO PARA RESCISÃO",null,null,"Percentuais","Valor"]
[null,null,"A","Aviso Prévio Indenizado (Art. 7º, inciso XXI, da CF/1988 e arts. 477, 487, §1º, e 491 da CLT)",{"$f":"'Encargos Sociais'!E35","v":8.3333333333333332E-3},{"$f":"ROUND(E55*$F$23,2)","v":{"$error":"#DIV/0!"}}]
[null,null,"B","Incidência do FGTS sobre o Aviso Prévio Indenizado (Súmula 305 TST)",{"$f":"'Encargos Sociais'!E36","v":6.6666666666666664E-4},{"$error":"#DIV/0!"},null,"* Nota 1 - Adotou-se os parâmetros do estudo do STF (http://www.stf.jus.br/arquivo/cms/sobrestfestudosci/anexo/encargos_sociais_03102007.pdf), onde 5% do pessoal é demitido pelo empregador no decurso do contrato (para estes, considerou-se o aviso prévio indenizado). Desprezou-se as demissões por justa causa e os pedidos de demissão."]
[null,null,"C","Multa do FGTS e Contribuição Social sobre o Aviso Prévio Indenizado (Art. 18, §1º, da Lei 8.036/1990 e art. 1º da LC nº 110/2001)",{"$f":"'Encargos Sociais'!E37","v":1.274074074074074E-3},{"$error":"#DIV/0!"},null,"* Nota 2 - No cálculo do percentual, considerou-se 36 dias, correspondendo à metade da duração média dos contratos (2 anos)"]
[null,null,"D","Aviso Prévio Trabalhado (Art. 488, parágrafo único, CLT)",{"$f":"'Encargos Sociais'!E38","v":1.2037037037037035E-2},{"$error":"#DIV/0!"},null,"* Nota 3 - Incide sobre a Remuneração + 13º salário (1/12) + Férias (1/12) + Adicional de Férias (1/36) x 50% multa (40% para o empregado e 10% de contribuição social) x 8% FGTS"]
[null,null,"E","Incidência de GPS, FGTS e outras contribuições sobre o Aviso Prévio Trabalhado",{"$f":"'Encargos Sociais'!E39","v":4.3092592592592583E-3},{"$error":"#DIV/0!"},null,"* Nota 4 - Os 95% restantes do cálculo, a um prazo médio de contrato de 4 anos. Assim, calcula-se 7 dias para o 1º ano de contrato e mais 3 dias para os 3 anos seguintes."]
[null,null,"F","Multa do FGTS e Contribuição Social sobre o Aviso Prévio Trabalhado",{"$f":"'Encargos Sociais'!E40","v":3.0505155555555549E-2},{"$error":"#DIV/0!"}]
[]
[null,null,null,"TOTAL DE PREVISÃO PARA RESCISÃO",null,{"$f":"SUM(F55:F60)","v":{"$error":"#DIV/0!"}}]
[]
[null,"MÓDULO 4 - CUSTO DE REPOSIÇÃO DO PROFISSIONAL AUSENTE",null,null,"Percentuais","Valor"]
[null,"Submódulo 4.1 - Ausências Legais"]
[null,null,"A","Férias (Arts. 129 e 130, inc. I, da CLT) - Calculado no Submódulo 2.1",0,{"$f":"ROUND(E66*$F$23,2)","v":{"$error":"#DIV/0!"}},null,"* Nota 1 - As alíneas “A” a “F” referem-se somente ao custo que será pago ao repositor pelos dias \ntrabalhados quando da necessidade de substituir a mão de obra alocada na prestação do serviço."]
[null,null,"B","Ausências Legais (Arts. 131 e 473 da CLT)",{"$f":"'Encargos Sociais'!E25","v":7.9365079365079361E-3},{"$error":"#DIV/0!"},null,"* Nota 2 - Adotou-se a estimativa do SINAPI de 2 dias por ano."]
[null,null,"C","Licença-Paternidade (Art. 7º, XIX, e art. 10, §1º, do ADCT, CF/1988 e Art. 1º, II, da Lei 11.770/2008)",{"$f":"'Encargos Sociais'!E26","v":8.2777777777777776E-4},{"$error":"#DIV/0!"},null,"* Nota 3 - Utilizada a proporção de 50% para homens, 5 dias de afastamento, e a probabilidade de um trabalhador requerer a Licença Paternidade em 5,22%, conforme SINAPI (citando dados da PNAD 2015)"]
[null,null,"D","Ausência por Acidente de Trabalho (Art. 131, III, da CLT)",{"$f":"'Encargos Sociais'!E27","v":8.541666666666667E-4},{"$error":"#DIV/0!"},null,"* Nota 4 - Utilzada a estatística de 1,96% dos contribuintes beneficiados com a emissão do auxílio, conforme Anuário Estatístico da Previdência Social. Afastamento de 15 dias a cargo da empresa."]
[null,null,"E","Afastamento Maternidade (Art. 71 da Lei nº 8.213/1991)",{"$f":"'Encargos Sociais'!E28","v":3.2925925925925922E-3},{"$error":"#DIV/0!"},null,"* Nota 5 - Utilizada a proporção de 50% para mulheres, 180 dias de afastamento, e a probabilidade de uma trabalhadora requerer a Licença Maternidade em 4,91%, conforme SINAPI (citando dados do IBGE 2016)"]
[null,null,"F","Auxílio Enfermidade - Doença (Art. 59 da Lei nº 8.213/1991)",{"$f":"'Encargos Sociais'!E29","v":7.1222222222222225E-3},{"$error":"#DIV/0!"},null,"* Nota 6 - Utilizada a estatística de 3,37% dos contribuintes beneficiados com o auxílio, conforme Anuário Estatístico da Previdência Social de 2015 (acrescidos de 2 dias ao ano, para os quais o trabalhador nem requer o benefício da Previdência - conforme SINAPI)"]
[]
[null,"Submódulo 4.2 - Intrajornada"]
[null,null,"A","Intervalo para repouso ou alimentação",{"$f":"'Encargos Sociais'!E32","v":0},{"$f":"ROUND(E74*$F$23,2)","v":{"$error":"#DIV/0!"}}]
[]
[null,null,null,"QUADRO-RESUMO DO MÓDULO 4",null,"Valor"]
[null,null,null,"4.1 - Ausências Legais",{"$f":"SUM(E66:E71)","v":2.0033267195767195E-2},{"$f":"ROUND(E77*$F$23,2)","v":{"$error":"#DIV/0!"}}]
[null,null,null,"4.2 - Intrajornada",{"$f":"E74","v":0},{"$f":"ROUND(E78*$F$23,2)","v":{"$error":"#DIV/0!"}}]
[]
[null,null,null,"TOTAL DE PREVISÃO PARA RESCISÃO E INTERVALO INTRAJORNADA",null,{"$f":"SUM(F77:F78)","v":{"$error":"#DIV/0!"}}]
[]
[null,"MÓDULO 5 - INSUMOS DIVERSOS",null,null,null,"Valor"]
[null,null,"A","Uniformes - aquisição",null,{"$f":"ROUND(HLOOKUP($B$12,Uniformes!K3:DZ33,3)/12,2)","v":0}]
[null,null,"B","Materiais de consumo relacionados ao posto - aquisição",null,{"$f":"ROUND(HLOOKUP(B12,'Mat Cons'!I11:DX13,3)/12,2)","v":0}]
[null,null,"C","Materiais permanentes relacionados ao posto - remuneração da sua depreciação / manutenção",null,{"$f":"HLOOKUP(B12,'Mat Perm'!Q11:EF13,3)","v":0}]
[null,null,"D","Equipamentos relacionados ao posto - remuneração da sua depreciação / manutenção",null,{"$f":"HLOOKUP(B12,'Equip Rel'!Q11:EF13,3)","v":0}]
[null,null,"E","Equipamentos de Proteção Individual - EPI - aquisição",null,{"$f":"ROUND(HLOOKUP(B12,EPI!I3:DX67,3)/12,2)","v":0}]
[]
[null,null,null,"TOTAL DE INSUMOS DIVERSOS",null,{"$f":"SUM(F83:F88)","v":0},null,"* Nota - Valores mensais por empregado"]
[]
[null,"MÓDULO 6 - CUSTOS INDIRETOS, TRIBUTOS E LUCRO - BDI",null,null,"Percentuais","Valor"]
[null,null,"A","Custos Indiretos",{"$f":"BDI!E6","v":4.4400000000000002E-2}]
[null,null,"A.1","Administração Central",{"$f":"BDI!E7","v":3.9E-2}]
[null,null,"A.2","Seguros, Garantias e Riscos",{"$f":"BDI!E8","v":5.4000000000000003E-3}]
[null,null,"B","Lucro",{"$f":"BDI!E10","v":0.06}]
[null,null,"C","Tributos",{"$f":"SUM(E97:E98)","v":0.124}]
[null,null,"C.1","Tributos Federais (COFINS, PIS e CPRB)",{"$f":"BDI!E18","v":7.3999999999999996E-2}]
[null,null,"C.2","Tributos Distritais (ISS)",{"$f":"BDI!E23","v":0.05},null,null,"* Nota - Utilizou-se o indicado pelo Sindicato da Arquitetura e da Engenharia (Sinaenco, 2008, p. 22), que adota um percentual redutor de 20% no cálculo dos custos tributários relativos às contribuições PIS e COFINS"]
[null,null,"D","Despesas Financeiras",{"$f":"BDI!E13","v":4.4669210982628549E-3}]
[]
[null,null,null,"TOTAL DE BDI",{"$f":"BDI!E26","v":0.26939999999999997},{"$f":"E101*E109","v":{"$error":"#DIV/0!"}}]
[]
[null,null,null,"QUADRO-RESUMO DO CUSTO MENSAL POR EMPREGADO - SEM O 13º","Valor"]
[null,null,null,"Módulo 1 - Composição da Remuneração",{"$f":"F23","v":{"$error":"#DIV/0!"}}]
[null,null,null,"Módulo 2 - Encargos e Benefícios Anuais, Mensais e Diários",{"$f":"F52","v":{"$error":"#DIV/0!"}}]
[null,null,null,"Módulo 3 - Provisão para Rescisão",{"$f":"F62","v":{"$error":"#DIV/0!"}}]
[null,null,null,"Módulo 4 - Custo de Reposição do Profissional Ausente",{"$f":"F80","v":{"$error":"#DIV/0!"}}]
[null,null,null,"Módulo 5 - Insumos Diversos",{"$f":"F89","v":0}]
[null,null,null,"SUBTOTAL (A+B+C+D+E)",{"$f":"SUM(E104:E108)","v":{"$error":"#DIV/0!"}}]
[null,null,null,"Módulo 6 - Custos Indiretos, Tributos e Lucro",{"$f":"F101","v":{"$error":"#DIV/0!"}}]
[]
[null,null,null,"TOTAL DO POSTO",{"$f":"SUM(E109:E110)","v":{"$error":"#DIV/0!"}}]
[]
[null,"MÓDULO 7 - DESTAQUE DO MÓDULO 2 - 13º SALÁRIO",null,null,"Percentuais","Valor"]
[null,null,"A","13º Salário",{"$f":"'Encargos Sociais'!E31","v":8.3333333333333329E-2},{"$f":"ROUND(E115*F$23,2)","v":{"$error":"#DIV/0!"}}]
[null,null,"B","Encargos Sociais sobre o 13º Salário - Taxa calculada no SUBMÓDULO 2.2",{"$f":"SUM($E$31:$E$39)","v":0.35800000000000004},{"$f":"ROUND(E116*$F$115,2)","v":{"$error":"#DIV/0!"}},null,"* Nota 1 - Provisiona-se, mensalmente, o proporcional a 1/12 dos valores referentes a gratificação natalina e adicional de férias."]
[null,null,"C","BDI sobre o 13º Salário - Taxa calculada no MÓDULO 6",{"$f":"E101","v":0.26939999999999997},{"$f":"ROUND(E117*($F$115+$F$116),2)","v":{"$error":"#DIV/0!"}}]
[]
[null,null,null,"TOTAL DO DESTAQUE DO 13º SALÁRIO",null,{"$f":"SUM(F115:F117)","v":{"$error":"#DIV/0!"}}]
[]
[null,null,null,"QUADRO-RESUMO DO CUSTO MENSAL POR EMPREGADO","Valor"]
[null,null,null,"Custo total - sem o 13º Salário",{"$f":"E112","v":{"$error":"#DIV/0!"}}]
[null,null,null,"Destaque do 13º Salário (valor mensal)",{"$f":"F119","v":{"$error":"#DIV/0!"}}]
[]
[null,null,null,"TOTAL DO POSTO",{"$f":"E122+E123","v":{"$error":"#DIV/0!"}}]

{"sheet":"8","index":11,"n_rows":125,"n_cols":8,"rows_kept":125,"cut":false,"hidden":true,"merged":[[90,1,90,3],[113,1,113,3],[24,1,24,3],[46,3,46,5],[53,1,53,3],[63,1,63,3],[75,3,75,5],[81,1,81,3],[14,1,14,3],[6,3,6,5],[8,1,8,5],[9,1,9,5],[11,1,11,2],[12,1,12,2]]}
[null,null,"CÂMARA DOS DEPUTADOS"]
[null,null,"DEPARTAMENTO TÉCNICO"]
[null,null,"Coordenação de Planejamento e Gestão"]
[]
[null,null,"Data:",{"$f":"'Dados Gerais'!#REF!","v":{"$error":"#REF!"}}]
[null,null,"Processo:",{"$f":"'Dados Gerais'!#REF!","v":{"$error":"#REF!"}}]
[null,null,"Objeto:",{"$f":"'Dados Gerais'!#REF!","v":{"$error":"#REF!"}}]
[]
[null,"PLANILHA DE ESTIMATIVA DE CUSTOS"]
[null,"Padrão IN 05/2017 e IN 07/2018 - MPDG"]
[]
[null,8,null,{"$f":"HLOOKUP($B$12,'Dados Gerais'!$D$5:$BK$20,6)","v":0},"QUANTIDADE",{"$f":"HLOOKUP($B$12,'Dados Gerais'!$D$5:$BK$20,10)","v":0}]
[null,"CCT",null,{"$f":"HLOOKUP($B$12,'Dados Gerais'!$D$5:$BK$20,15)","v":0},"DATA-BASE",{"$f":"HLOOKUP($B$12,'Dados Gerais'!$D$5:$BK$20,16)","v":"00:00:00"}]
[]
[null,"MÓDULO 1 - COMPOSIÇÃO DA REMUNERAÇÃO",null,null,null,"Valor"]
[null,null,"A","Salário-Base",null,{"$f":"HLOOKUP($B$12,'Dados Gerais'!$D$5:$BK$20,8)","v":0}]
[null,null,"B","Adicional de Periculosidade",null,{"$f":"HLOOKUP($B$12,'Dados Gerais'!$D$5:$BK$37,25)","v":0}]
[null,null,"C","Adicional de Insalubridade",null,{"$f":"HLOOKUP($B$12,'Dados Gerais'!$D$5:$BK$37,31)","v":0}]
[null,null,"D","Adicional Noturno",null,{"$f":"HLOOKUP($B$12,'Dados Gerais'!$D$5:$BK$50,46)","v":{"$error":"#DIV/0!"}},null,"* Nota 1 - O Módulo 1 refere-se ao valor mensal devido ao empregado pela prestação do serviço no período de 12 meses."]
[null,null,"E","Adicional de Hora Extra",null,{"$f":"HLOOKUP($B$12,'Dados Gerais'!$D$5:$BK$67,63)","v":{"$error":"#DIV/0!"}},null,"* Nota 2 - O adicional de hora extra no feriado trabalhado foi suprimido pela Lei 13.467/17"]
[null,null,"F","Outros (especificar)",null,{"$f":"HLOOKUP($B$12,'Dados Gerais'!$D$5:$BK$59,33)","v":0},null,"* Nota 3 - ART. 7º, § 2º, DA LEI Nº 605/49.Sendo mensalista o obreiro, o adicional noturno pago de forma fixa já é considerado integrado para os efeitos do pagamento do repouso semanal remunerado, nos termos do art. 7º, § 2º, da Lei nº 605/49."]
[]
[null,null,null,"TOTAL DA REMUNERAÇÃO",null,{"$f":"SUM(F16:F21)","v":{"$error":"#DIV/0!"}}]
[]
[null,"MÓDULO 2 - ENCARGOS E BENEFÍCIOS ANUAIS, MENSAIS E DIÁRIOS",null,null,"Percentuais","Valor"]
[null,"Submódulo 2.1 - 13º Salário, Férias e Adicional de Férias"]
[null,null,"A","13º Salário - Calculado no Módulo 7 - Destacado",0,{"$f":"ROUND(E27*F$23,2)","v":{"$error":"#DIV/0!"}}]
[null,null,"B","Férias e Adicional de Férias",{"$f":"'Encargos Sociais'!E24+'Encargos Sociais'!E30","v":0.12121212121212122},{"$f":"ROUND(E28*F$23,2)","v":{"$error":"#DIV/0!"}},null,"* Nota 1 - Provisiona-se, mensalmente, o proporcional a 1/12 dos valores referentes a gratificação natalina, férias e adicional de férias."]
[null,null,null,null,null,null,null,"* Nota 2 - O adicional de férias contido no Submódulo 2.1 corresponde a 1/3 da remuneração que, por sua vez, é dividida por 12 contome Nota 1."]
[null,"Submódulo 2.2 - Encargos Previdenciários (GPS), Fundo de Garantia por Tempo de Serviço (FGTS) e Outras Contribuições"]
[null,null,"A","INSS (art. 22, inciso I, Lei nº 8.212/91)",{"$f":"'Encargos Sociais'!E13","v":0.2},{"$f":"ROUND(E31*($F$23+$F$48+$F$80),2)","v":{"$error":"#DIV/0!"}}]
[null,null,"B","Salário Educação (art. 3º, inciso I, Decreto nº 87.043/82)",{"$f":"'Encargos Sociais'!E14","v":2.5000000000000001E-2},{"$f":"ROUND(E32*($F$23+$F$48+$F$80),2)","v":{"$error":"#DIV/0!"}}]
[null,null,"C","SAT/RAT (art. 22, II, Lei 8.212/91 e Anexo V, Decreto 6.042/07) - Enquadramento 8211-3/00",{"$f":"'Encargos Sociais'!E15","v":0.01},{"$error":"#DIV/0!"}]
[null,null,"D","SESC ou SESI (art. 30, Lei nº 8.036/90 e art. 1º, Lei 8.154/90)",{"$f":"'Encargos Sociais'!E16","v":1.4999999999999999E-2},{"$error":"#DIV/0!"}]
[null,null,"E","SENAI ou SENAC (Decreto nº 2.318/86)",{"$f":"'Encargos Sociais'!E17","v":0.01},{"$error":"#DIV/0!"}]
[null,null,"F","SEBRAE (§ 3º, art. 8º, Lei 8.029/90, alterada pela Lei nº 8.154/90)",{"$f":"'Encargos Sociais'!E18","v":6.0000000000000001E-3},{"$error":"#DIV/0!"}]
[null,null,"G","INCRA (art. 1º, I, Decreto Lei 1.146/70 e Lei 7.787, de 30/06/89)",{"$f":"'Encargos Sociais'!E19","v":2E-3},{"$error":"#DIV/0!"},null,"* Nota 1 - Os percentuais dos encargos previdenciários, do FGTS e demais contribuições são estabelecidos por legislação vigente."]
[null,null,"H","FGTS (Lei Complementar nº 110/01 e art. 30, Lei nº 8.036/90)",{"$f":"'Encargos Sociais'!E20","v":0.08},{"$error":"#DIV/0!"},null,"* Nota 2 - O SAT, a depender do grau de risco do serviço, irá variar entre 1%, para risco leve, de 2%, para risco médio, e de 3% para risco grave."]
[null,null,"I","SECONCI (Convenções Coletivas de Trabalho da construção)",{"$f":"'Encargos Sociais'!E21","v":0.01},{"$error":"#DIV/0!"},null,"* Nota 3 - Os percentuais do Submódulo 2.2 incidem sobre o Módulo 1 e o Submódulo 2.1."]
[]
[null,"Submódulo 2.3 - Benefícios Mensais e Diários"]
[null,null,"A","Auxílio Transporte",null,{"$f":"HLOOKUP($B$12,'Dados Gerais'!$D$5:$BK$93,82)","v":0}]
[null,null,"B","Auxílio Alimentação",null,{"$f":"HLOOKUP($B$12,'Dados Gerais'!$D$5:$BK$93,89)","v":{"$error":"#NUM!"}}]
[null,null,"C","Assistência Médica e Familiar",null,{"$f":"HLOOKUP($B$12,'Dados Gerais'!$D$5:$BK$101,97)","v":223}]
[null,null,"D","Outros (Seguro de vida e auxílio funeral e auxílio odontológico)",null,{"$f":"HLOOKUP($B$12,'Dados Gerais'!$D$5:$BK$118,114)","v":0},null,"* Nota 1 - O valor informado deverá ser o custo real do benefício (descontado o valor eventualmente pago pelo empregado)."]
[null,null,null,null,null,null,null,"* Nota 2 - Observar a previsão dos benefícios contidos em Acordos, Convenções e Dissídios Coletivos de Trabalho e o disposto no art. 6º da IN 5/2017"]
[null,null,null,"QUADRO-RESUMO DO MÓDULO 2"]
[null,null,null,"2.1 - 13º Salário, Férias e Adicional de Férias - 13º Destacado - Calculado no Módulo 7 ",{"$f":"SUM(E27:E28)","v":0.12121212121212122},{"$f":"F27+F28","v":{"$error":"#DIV/0!"}}]
[null,null,null,"2.2 - Encargos Previdenciários (GPS), Fundo de Garantia por Tempo de Serviço (FGTS) e Contribuições",{"$f":"SUM(E31:E39)","v":0.35800000000000004},{"$f":"SUM(F31:F39)","v":{"$error":"#DIV/0!"}}]
[null,null,null,"2.3 - Benefícios Mensais e Diários",null,{"$f":"SUM(F42:F45)","v":{"$error":"#NUM!"}}]
[]
[null,null,null,"TOTAL DOS ENCARGOS E BENEFÍCIOS",null,{"$f":"SUM(F48:F50)","v":{"$error":"#DIV/0!"}}]
[]
[null,"MÓDULO 3 - PREVISÃO PARA RESCISÃO",null,null,"Percentuais","Valor"]
[null,null,"A","Aviso Prévio Indenizado (Art. 7º, inciso XXI, da CF/1988 e arts. 477, 487, §1º, e 491 da CLT)",{"$f":"'Encargos Sociais'!E35","v":8.3333333333333332E-3},{"$f":"ROUND(E55*$F$23,2)","v":{"$error":"#DIV/0!"}}]
[null,null,"B","Incidência do FGTS sobre o Aviso Prévio Indenizado (Súmula 305 TST)",{"$f":"'Encargos Sociais'!E36","v":6.6666666666666664E-4},{"$error":"#DIV/0!"},null,"* Nota 1 - Adotou-se os parâmetros do estudo do STF (http://www.stf.jus.br/arquivo/cms/sobrestfestudosci/anexo/encargos_sociais_03102007.pdf), onde 5% do pessoal é demitido pelo empregador no decurso do contrato (para estes, considerou-se o aviso prévio indenizado). Desprezou-se as demissões por justa causa e os pedidos de demissão."]
[null,null,"C","Multa do FGTS e Contribuição Social sobre o Aviso Prévio Indenizado (Art. 18, §1º, da Lei 8.036/1990 e art. 1º da LC nº 110/2001)",{"$f":"'Encargos Sociais'!E37","v":1.274074074074074E-3},{"$error":"#DIV/0!"},null,"* Nota 2 - No cálculo do percentual, considerou-se 36 dias, correspondendo à metade da duração média dos contratos (2 anos)"]
[null,null,"D","Aviso Prévio Trabalhado (Art. 488, parágrafo único, CLT)",{"$f":"'Encargos Sociais'!E38","v":1.2037037037037035E-2},{"$error":"#DIV/0!"},null,"* Nota 3 - Incide sobre a Remuneração + 13º salário (1/12) + Férias (1/12) + Adicional de Férias (1/36) x 50% multa (40% para o empregado e 10% de contribuição social) x 8% FGTS"]
[null,null,"E","Incidência de GPS, FGTS e outras contribuições sobre o Aviso Prévio Trabalhado",{"$f":"'Encargos Sociais'!E39","v":4.3092592592592583E-3},{"$error":"#DIV/0!"},null,"* Nota 4 - Os 95% restantes do cálculo, a um prazo médio de contrato de 4 anos. Assim, calcula-se 7 dias para o 1º ano de contrato e mais 3 dias para os 3 anos seguintes."]
[null,null,"F","Multa do FGTS e Contribuição Social sobre o Aviso Prévio Trabalhado",{"$f":"'Encargos Sociais'!E40","v":3.0505155555555549E-2},{"$error":"#DIV/0!"}]
[]
[null,null,null,"TOTAL DE PREVISÃO PARA RESCISÃO",null,{"$f":"SUM(F55:F60)","v":{"$error":"#DIV/0!"}}]
[]
[null,"MÓDULO 4 - CUSTO DE REPOSIÇÃO DO PROFISSIONAL AUSENTE",null,null,"Percentuais","Valor"]
[null,"Submódulo 4.1 - Ausências Legais"]
[null,null,"A","Férias (Arts. 129 e 130, inc. I, da CLT) - Calculado no Submódulo 2.1",0,{"$f":"ROUND(E66*$F$23,2)","v":{"$error":"#DIV/0!"}},null,"* Nota 1 - As alíneas “A” a “F” referem-se somente ao custo que será pago ao repositor pelos dias \ntrabalhados quando da necessidade de substituir a mão de obra alocada na prestação do serviço."]
[null,null,"B","Ausências Legais (Arts. 131 e 473 da CLT)",{"$f":"'Encargos Sociais'!E25","v":7.9365079365079361E-3},{"$error":"#DIV/0!"},null,"* Nota 2 - Adotou-se a estimativa do SINAPI de 2 dias por ano."]
[null,null,"C","Licença-Paternidade (Art. 7º, XIX, e art. 10, §1º, do ADCT, CF/1988 e Art. 1º, II, da Lei 11.770/2008)",{"$f":"'Encargos Sociais'!E26","v":8.2777777777777776E-4},{"$error":"#DIV/0!"},null,"* Nota 3 - Utilizada a proporção de 50% para homens, 5 dias de afastamento, e a probabilidade de um trabalhador requerer a Licença Paternidade em 5,22%, conforme SINAPI (citando dados da PNAD 2015)"]
[null,null,"D","Ausência por Acidente de Trabalho (Art. 131, III, da CLT)",{"$f":"'Encargos Sociais'!E27","v":8.541666666666667E-4},{"$error":"#DIV/0!"},null,"* Nota 4 - Utilzada a estatística de 1,96% dos contribuintes beneficiados com a emissão do auxílio, conforme Anuário Estatístico da Previdência Social. Afastamento de 15 dias a cargo da empresa."]
[null,null,"E","Afastamento Maternidade (Art. 71 da Lei nº 8.213/1991)",{"$f":"'Encargos Sociais'!E28","v":3.2925925925925922E-3},{"$error":"#DIV/0!"},null,"* Nota 5 - Utilizada a proporção de 50% para mulheres, 180 dias de afastamento, e a probabilidade de uma trabalhadora requerer a Licença Maternidade em 4,91%, conforme SINAPI (citando dados do IBGE 2016)"]
[null,null,"F","Auxílio Enfermidade - Doença (Art. 59 da Lei nº 8.213/1991)",{"$f":"'Encargos Sociais'!E29","v":7.1222222222222225E-3},{"$error":"#DIV/0!"},null,"* Nota 6 - Utilizada a estatística de 3,37% dos contribuintes beneficiados com o auxílio, conforme Anuário Estatístico da Previdência Social de 2015 (acrescidos de 2 dias ao ano, para os quais o trabalhador nem requer o benefício da Previdência - conforme SINAPI)"]
[]
[null,"Submódulo 4.2 - Intrajornada"]
[null,null,"A","Intervalo para repouso ou alimentação",{"$f":"'Encargos Sociais'!E32","v":0},{"$f":"ROUND(E74*$F$23,2)","v":{"$error":"#DIV/0!"}}]
[]
[null,null,null,"QUADRO-RESUMO DO MÓDULO 4",null,"Valor"]
[null,null,null,"4.1 - Ausências Legais",{"$f":"SUM(E66:E71)","v":2.0033267195767195E-2},{"$f":"ROUND(E77*$F$23,2)","v":{"$error":"#DIV/0!"}}]
[null,null,null,"4.2 - Intrajornada",{"$f":"E74","v":0},{"$f":"ROUND(E78*$F$23,2)","v":{"$error":"#DIV/0!"}}]
[]
[null,null,null,"TOTAL DE PREVISÃO PARA RESCISÃO E INTERVALO INTRAJORNADA",null,{"$f":"SUM(F77:F78)","v":{"$error":"#DIV/0!"}}]
[]
[null,"MÓDULO 5 - INSUMOS DIVERSOS",null,null,null,"Valor"]
[null,null,"A","Uniformes - aquisição",null,{"$f":"ROUND(HLOOKUP($B$12,Uniformes!K3:DZ33,3)/12,2)","v":0}]
[null,null,"B","Materiais de consumo relacionados ao posto - aquisição",null,{"$f":"ROUND(HLOOKUP(B12,'Mat Cons'!I11:DX13,3)/12,2)","v":0}]
[null,null,"C","Materiais permanentes relacionados ao posto - remuneração da sua depreciação / manutenção",null,{"$f":"HLOOKUP(B12,'Mat Perm'!Q11:EF13,3)","v":0}]
[null,null,"D","Equipamentos relacionados ao posto - remuneração da sua depreciação / manutenção",null,{"$f":"HLOOKUP(B12,'Equip Rel'!Q11:EF13,3)","v":0}]
[null,null,"E","Equipamentos de Proteção Individual - EPI - aquisição",null,{"$f":"ROUND(HLOOKUP(B12,EPI!I3:DX67,3)/12,2)","v":0}]
[]
[null,null,null,"TOTAL DE INSUMOS DIVERSOS",null,{"$f":"SUM(F83:F88)","v":0},null,"* Nota - Valores mensais por empregado"]
[]
[null,"MÓDULO 6 - CUSTOS INDIRETOS, TRIBUTOS E LUCRO - BDI",null,null,"Percentuais","Valor"]
[null,null,"A","Custos Indiretos",{"$f":"BDI!E6","v":4.4400000000000002E-2}]
[null,null,"A.1","Administração Central",{"$f":"BDI!E7","v":3.9E-2}]
[null,null,"A.2","Seguros, Garantias e Riscos",{"$f":"BDI!E8","v":5.4000000000000003E-3}]
[null,null,"B","Lucro",{"$f":"BDI!E10","v":0.06}]
[null,null,"C","Tributos",{"$f":"SUM(E97:E98)","v":0.124}]
[null,null,"C.1","Tributos Federais (COFINS, PIS e CPRB)",{"$f":"BDI!E18","v":7.3999999999999996E-2}]
[null,null,"C.2","Tributos Distritais (ISS)",{"$f":"BDI!E23","v":0.05},null,null,"* Nota - Utilizou-se o indicado pelo Sindicato da Arquitetura e da Engenharia (Sinaenco, 2008, p. 22), que adota um percentual redutor de 20% no cálculo dos custos tributários relativos às contribuições PIS e COFINS"]
[null,null,"D","Despesas Financeiras",{"$f":"BDI!E13","v":4.4669210982628549E-3}]
[]
[null,null,null,"TOTAL DE BDI",{"$f":"BDI!E26","v":0.26939999999999997},{"$f":"E101*E109","v":{"$error":"#DIV/0!"}}]
[]
[null,null,null,"QUADRO-RESUMO DO CUSTO MENSAL POR EMPREGADO - SEM O 13º","Valor"]
[null,null,null,"Módulo 1 - Composição da Remuneração",{"$f":"F23","v":{"$error":"#DIV/0!"}}]
[null,null,null,"Módulo 2 - Encargos e Benefícios Anuais, Mensais e Diários",{"$f":"F52","v":{"$error":"#DIV/0!"}}]
[null,null,null,"Módulo 3 - Provisão para Rescisão",{"$f":"F62","v":{"$error":"#DIV/0!"}}]
[null,null,null,"Módulo 4 - Custo de Reposição do Profissional Ausente",{"$f":"F80","v":{"$error":"#DIV/0!"}}]
[null,null,null,"Módulo 5 - Insumos Diversos",{"$f":"F89","v":0}]
[null,null,null,"SUBTOTAL (A+B+C+D+E)",{"$f":"SUM(E104:E108)","v":{"$error":"#DIV/0!"}}]
[null,null,null,"Módulo 6 - Custos Indiretos, Tributos e Lucro",{"$f":"F101","v":{"$error":"#DIV/0!"}}]
[]
[null,null,null,"TOTAL DO POSTO",{"$f":"SUM(E109:E110)","v":{"$error":"#DIV/0!"}}]
[]
[null,"MÓDULO 7 - DESTAQUE DO MÓDULO 2 - 13º SALÁRIO",null,null,"Percentuais","Valor"]
[null,null,"A","13º Salário",{"$f":"'Encargos Sociais'!E31","v":8.3333333333333329E-2},{"$f":"ROUND(E115*F$23,2)","v":{"$error":"#DIV/0!"}}]
[null,null,"B","Encargos Sociais sobre o 13º Salário - Taxa calculada no SUBMÓDULO 2.2",{"$f":"SUM($E$31:$E$39)","v":0.35800000000000004},{"$f":"ROUND(E116*$F$115,2)","v":{"$error":"#DIV/0!"}},null,"* Nota 1 - Provisiona-se, mensalmente, o proporcional a 1/12 dos valores referentes a gratificação natalina e adicional de férias."]
[null,null,"C","BDI sobre o 13º Salário - Taxa calculada no MÓDULO 6",{"$f":"E101","v":0.26939999999999997},{"$f":"ROUND(E117*($F$115+$F$116),2)","v":{"$error":"#DIV/0!"}}]
[]
[null,null,null,"TOTAL DO DESTAQUE DO 13º SALÁRIO",null,{"$f":"SUM(F115:F117)","v":{"$error":"#DIV/0!"}}]
[]
[null,null,null,"QUADRO-RESUMO DO CUSTO MENSAL POR EMPREGADO","Valor"]
[null,null,null,"Custo total - sem o 13º Salário",{"$f":"E112","v":{"$error":"#DIV/0!"}}]
[null,null,null,"Destaque do 13º Salário (valor mensal)",{"$f":"F119","v":{"$error":"#DIV/0!"}}]
[]
[null,null,null,"TOTAL DO POSTO",{"$f":"E122+E123","v":{"$error":"#DIV/0!"}}]

{"sheet":"9","index":12,"n_rows":125,"n_cols":8,"rows_kept":125,"cut":false,"hidden":true,"merged":[[14,1,14,3],[6,3,6,5],[8,1,8,5],[9,1,9,5],[11,1,11,2],[12,1,12,2],[90,1,90,3],[113,1,113,3],[24,1,24,3],[46,3,46,5],[53,1,53,3],[63,1,63,3],[75,3,75,5],[81,1,81,3]]}
[null,null,"CÂMARA DOS DEPUTADOS"]
[null,null,"DEPARTAMENTO TÉCNICO"]
[null,null,"Coordenação de Planejamento e Gestão"]
[]
[null,null,"Data:",{"$f":"'Dados Gerais'!#REF!","v":{"$error":"#REF!"}}]
[null,null,"Processo:",{"$f":"'Dados Gerais'!#REF!","v":{"$error":"#REF!"}}]
[null,null,"Objeto:",{"$f":"'Dados Gerais'!#REF!","v":{"$error":"#REF!"}}]
[]
[null,"PLANILHA DE ESTIMATIVA DE CUSTOS"]
[null,"Padrão IN 05/2017 e IN 07/2018 - MPDG"]
[]
[null,9,null,{"$f":"HLOOKUP($B$12,'Dados Gerais'!$D$5:$BK$20,6)","v":0},"QUANTIDADE",{"$f":"HLOOKUP($B$12,'Dados Gerais'!$D$5:$BK$20,10)","v":0}]
[null,"CCT",null,{"$f":"HLOOKUP($B$12,'Dados Gerais'!$D$5:$BK$20,15)","v":0},"DATA-BASE",{"$f":"HLOOKUP($B$12,'Dados Gerais'!$D$5:$BK$20,16)","v":"00:00:00"}]
[]
[null,"MÓDULO 1 - COMPOSIÇÃO DA REMUNERAÇÃO",null,null,null,"Valor"]
[null,null,"A","Salário-Base",null,{"$f":"HLOOKUP($B$12,'Dados Gerais'!$D$5:$BK$20,8)","v":0}]
[null,null,"B","Adicional de Periculosidade",null,{"$f":"HLOOKUP($B$12,'Dados Gerais'!$D$5:$BK$37,25)","v":0}]
[null,null,"C","Adicional de Insalubridade",null,{"$f":"HLOOKUP($B$12,'Dados Gerais'!$D$5:$BK$37,31)","v":0}]
[null,null,"D","Adicional Noturno",null,{"$f":"HLOOKUP($B$12,'Dados Gerais'!$D$5:$BK$50,46)","v":{"$error":"#DIV/0!"}},null,"* Nota 1 - O Módulo 1 refere-se ao valor mensal devido ao empregado pela prestação do serviço no período de 12 meses."]
[null,null,"E","Adicional de Hora Extra",null,{"$f":"HLOOKUP($B$12,'Dados Gerais'!$D$5:$BK$67,63)","v":{"$error":"#DIV/0!"}},null,"* Nota 2 - O adicional de hora extra no feriado trabalhado foi suprimido pela Lei 13.467/17"]
[null,null,"F","Outros (especificar)",null,{"$f":"HLOOKUP($B$12,'Dados Gerais'!$D$5:$BK$59,33)","v":0},null,"* Nota 3 - ART. 7º, § 2º, DA LEI Nº 605/49.Sendo mensalista o obreiro, o adicional noturno pago de forma fixa já é considerado integrado para os efeitos do pagamento do repouso semanal remunerado, nos termos do art. 7º, § 2º, da Lei nº 605/49."]
[]
[null,null,null,"TOTAL DA REMUNERAÇÃO",null,{"$f":"SUM(F16:F21)","v":{"$error":"#DIV/0!"}}]
[]
[null,"MÓDULO 2 - ENCARGOS E BENEFÍCIOS ANUAIS, MENSAIS E DIÁRIOS",null,null,"Percentuais","Valor"]
[null,"Submódulo 2.1 - 13º Salário, Férias e Adicional de Férias"]
[null,null,"A","13º Salário - Calculado no Módulo 7 - Destacado",0,{"$f":"ROUND(E27*F$23,2)","v":{"$error":"#DIV/0!"}}]
[null,null,"B","Férias e Adicional de Férias",{"$f":"'Encargos Sociais'!E24+'Encargos Sociais'!E30","v":0.12121212121212122},{"$f":"ROUND(E28*F$23,2)","v":{"$error":"#DIV/0!"}},null,"* Nota 1 - Provisiona-se, mensalmente, o proporcional a 1/12 dos valores referentes a gratificação natalina, férias e adicional de férias."]
[null,null,null,null,null,null,null,"* Nota 2 - O adicional de férias contido no Submódulo 2.1 corresponde a 1/3 da remuneração que, por sua vez, é dividida por 12 contome Nota 1."]
[null,"Submódulo 2.2 - Encargos Previdenciários (GPS), Fundo de Garantia por Tempo de Serviço (FGTS) e Outras Contribuições"]
[null,null,"A","INSS (art. 22, inciso I, Lei nº 8.212/91)",{"$f":"'Encargos Sociais'!E13","v":0.2},{"$f":"ROUND(E31*($F$23+$F$48+$F$80),2)","v":{"$error":"#DIV/0!"}}]
[null,null,"B","Salário Educação (art. 3º, inciso I, Decreto nº 87.043/82)",{"$f":"'Encargos Sociais'!E14","v":2.5000000000000001E-2},{"$f":"ROUND(E32*($F$23+$F$48+$F$80),2)","v":{"$error":"#DIV/0!"}}]
[null,null,"C","SAT/RAT (art. 22, II, Lei 8.212/91 e Anexo V, Decreto 6.042/07) - Enquadramento 8211-3/00",{"$f":"'Encargos Sociais'!E15","v":0.01},{"$error":"#DIV/0!"}]
[null,null,"D","SESC ou SESI (art. 30, Lei nº 8.036/90 e art. 1º, Lei 8.154/90)",{"$f":"'Encargos Sociais'!E16","v":1.4999999999999999E-2},{"$error":"#DIV/0!"}]
[null,null,"E","SENAI ou SENAC (Decreto nº 2.318/86)",{"$f":"'Encargos Sociais'!E17","v":0.01},{"$error":"#DIV/0!"}]
[null,null,"F","SEBRAE (§ 3º, art. 8º, Lei 8.029/90, alterada pela Lei nº 8.154/90)",{"$f":"'Encargos Sociais'!E18","v":6.0000000000000001E-3},{"$error":"#DIV/0!"}]
[null,null,"G","INCRA (art. 1º, I, Decreto Lei 1.146/70 e Lei 7.787, de 30/06/89)",{"$f":"'Encargos Sociais'!E19","v":2E-3},{"$error":"#DIV/0!"},null,"* Nota 1 - Os percentuais dos encargos previdenciários, do FGTS e demais contribuições são estabelecidos por legislação vigente."]
[null,null,"H","FGTS (Lei Complementar nº 110/01 e art. 30, Lei nº 8.036/90)",{"$f":"'Encargos Sociais'!E20","v":0.08},{"$error":"#DIV/0!"},null,"* Nota 2 - O SAT, a depender do grau de risco do serviço, irá variar entre 1%, para risco leve, de 2%, para risco médio, e de 3% para risco grave."]
[null,null,"I","SECONCI (Convenções Coletivas de Trabalho da construção)",{"$f":"'Encargos Sociais'!E21","v":0.01},{"$error":"#DIV/0!"},null,"* Nota 3 - Os percentuais do Submódulo 2.2 incidem sobre o Módulo 1 e o Submódulo 2.1."]
[]
[null,"Submódulo 2.3 - Benefícios Mensais e Diários"]
[null,null,"A","Auxílio Transporte",null,{"$f":"HLOOKUP($B$12,'Dados Gerais'!$D$5:$BK$93,82)","v":0}]
[null,null,"B","Auxílio Alimentação",null,{"$f":"HLOOKUP($B$12,'Dados Gerais'!$D$5:$BK$93,89)","v":{"$error":"#NUM!"}}]
[null,null,"C","Assistência Médica e Familiar",null,{"$f":"HLOOKUP($B$12,'Dados Gerais'!$D$5:$BK$101,97)","v":185.84}]
[null,null,"D","Outros (Seguro de vida e auxílio funeral e auxílio odontológico)",null,{"$f":"HLOOKUP($B$12,'Dados Gerais'!$D$5:$BK$118,114)","v":0},null,"* Nota 1 - O valor informado deverá ser o custo real do benefício (descontado o valor eventualmente pago pelo empregado)."]
[null,null,null,null,null,null,null,"* Nota 2 - Observar a previsão dos benefícios contidos em Acordos, Convenções e Dissídios Coletivos de Trabalho e o disposto no art. 6º da IN 5/2017"]
[null,null,null,"QUADRO-RESUMO DO MÓDULO 2"]
[null,null,null,"2.1 - 13º Salário, Férias e Adicional de Férias - 13º Destacado - Calculado no Módulo 7 ",{"$f":"SUM(E27:E28)","v":0.12121212121212122},{"$f":"F27+F28","v":{"$error":"#DIV/0!"}}]
[null,null,null,"2.2 - Encargos Previdenciários (GPS), Fundo de Garantia por Tempo de Serviço (FGTS) e Contribuições",{"$f":"SUM(E31:E39)","v":0.35800000000000004},{"$f":"SUM(F31:F39)","v":{"$error":"#DIV/0!"}}]
[null,null,null,"2.3 - Benefícios Mensais e Diários",null,{"$f":"SUM(F42:F45)","v":{"$error":"#NUM!"}}]
[]
[null,null,null,"TOTAL DOS ENCARGOS E BENEFÍCIOS",null,{"$f":"SUM(F48:F50)","v":{"$error":"#DIV/0!"}}]
[]
[null,"MÓDULO 3 - PREVISÃO PARA RESCISÃO",null,null,"Percentuais","Valor"]
[null,null,"A","Aviso Prévio Indenizado (Art. 7º, inciso XXI, da CF/1988 e arts. 477, 487, §1º, e 491 da CLT)",{"$f":"'Encargos Sociais'!E35","v":8.3333333333333332E-3},{"$f":"ROUND(E55*$F$23,2)","v":{"$error":"#DIV/0!"}}]
[null,null,"B","Incidência do FGTS sobre o Aviso Prévio Indenizado (Súmula 305 TST)",{"$f":"'Encargos Sociais'!E36","v":6.6666666666666664E-4},{"$error":"#DIV/0!"},null,"* Nota 1 - Adotou-se os parâmetros do estudo do STF (http://www.stf.jus.br/arquivo/cms/sobrestfestudosci/anexo/encargos_sociais_03102007.pdf), onde 5% do pessoal é demitido pelo empregador no decurso do contrato (para estes, considerou-se o aviso prévio indenizado). Desprezou-se as demissões por justa causa e os pedidos de demissão."]
[null,null,"C","Multa do FGTS e Contribuição Social sobre o Aviso Prévio Indenizado (Art. 18, §1º, da Lei 8.036/1990 e art. 1º da LC nº 110/2001)",{"$f":"'Encargos Sociais'!E37","v":1.274074074074074E-3},{"$error":"#DIV/0!"},null,"* Nota 2 - No cálculo do percentual, considerou-se 36 dias, correspondendo à metade da duração média dos contratos (2 anos)"]
[null,null,"D","Aviso Prévio Trabalhado (Art. 488, parágrafo único, CLT)",{"$f":"'Encargos Sociais'!E38","v":1.2037037037037035E-2},{"$error":"#DIV/0!"},null,"* Nota 3 - Incide sobre a Remuneração + 13º salário (1/12) + Férias (1/12) + Adicional de Férias (1/36) x 50% multa (40% para o empregado e 10% de contribuição social) x 8% FGTS"]
[null,null,"E","Incidência de GPS, FGTS e outras contribuições sobre o Aviso Prévio Trabalhado",{"$f":"'Encargos Sociais'!E39","v":4.3092592592592583E-3},{"$error":"#DIV/0!"},null,"* Nota 4 - Os 95% restantes do cálculo, a um prazo médio de contrato de 4 anos. Assim, calcula-se 7 dias para o 1º ano de contrato e mais 3 dias para os 3 anos seguintes."]
[null,null,"F","Multa do FGTS e Contribuição Social sobre o Aviso Prévio Trabalhado",{"$f":"'Encargos Sociais'!E40","v":3.0505155555555549E-2},{"$error":"#DIV/0!"}]
[]
[null,null,null,"TOTAL DE PREVISÃO PARA RESCISÃO",null,{"$f":"SUM(F55:F60)","v":{"$error":"#DIV/0!"}}]
[]
[null,"MÓDULO 4 - CUSTO DE REPOSIÇÃO DO PROFISSIONAL AUSENTE",null,null,"Percentuais","Valor"]
[null,"Submódulo 4.1 - Ausências Legais"]
[null,null,"A","Férias (Arts. 129 e 130, inc. I, da CLT) - Calculado no Submódulo 2.1",0,{"$f":"ROUND(E66*$F$23,2)","v":{"$error":"#DIV/0!"}},null,"* Nota 1 - As alíneas “A” a “F” referem-se somente ao custo que será pago ao repositor pelos dias \ntrabalhados quando da necessidade de substituir a mão de obra alocada na prestação do serviço."]
[null,null,"B","Ausências Legais (Arts. 131 e 473 da CLT)",{"$f":"'Encargos Sociais'!E25","v":7.9365079365079361E-3},{"$error":"#DIV/0!"},null,"* Nota 2 - Adotou-se a estimativa do SINAPI de 2 dias por ano."]
[null,null,"C","Licença-Paternidade (Art. 7º, XIX, e art. 10, §1º, do ADCT, CF/1988 e Art. 1º, II, da Lei 11.770/2008)",{"$f":"'Encargos Sociais'!E26","v":8.2777777777777776E-4},{"$error":"#DIV/0!"},null,"* Nota 3 - Utilizada a proporção de 50% para homens, 5 dias de afastamento, e a probabilidade de um trabalhador requerer a Licença Paternidade em 5,22%, conforme SINAPI (citando dados da PNAD 2015)"]
[null,null,"D","Ausência por Acidente de Trabalho (Art. 131, III, da CLT)",{"$f":"'Encargos Sociais'!E27","v":8.541666666666667E-4},{"$error":"#DIV/0!"},null,"* Nota 4 - Utilzada a estatística de 1,96% dos contribuintes beneficiados com a emissão do auxílio, conforme Anuário Estatístico da Previdência Social. Afastamento de 15 dias a cargo da empresa."]
[null,null,"E","Afastamento Maternidade (Art. 71 da Lei nº 8.213/1991)",{"$f":"'Encargos Sociais'!E28","v":3.2925925925925922E-3},{"$error":"#DIV/0!"},null,"* Nota 5 - Utilizada a proporção de 50% para mulheres, 180 dias de afastamento, e a probabilidade de uma trabalhadora requerer a Licença Maternidade em 4,91%, conforme SINAPI (citando dados do IBGE 2016)"]
[null,null,"F","Auxílio Enfermidade - Doença (Art. 59 da Lei nº 8.213/1991)",{"$f":"'Encargos Sociais'!E29","v":7.1222222222222225E-3},{"$error":"#DIV/0!"},null,"* Nota 6 - Utilizada a estatística de 3,37% dos contribuintes beneficiados com o auxílio, conforme Anuário Estatístico da Previdência Social de 2015 (acrescidos de 2 dias ao ano, para os quais o trabalhador nem requer o benefício da Previdência - conforme SINAPI)"]
[]
[null,"Submódulo 4.2 - Intrajornada"]
[null,null,"A","Intervalo para repouso ou alimentação",{"$f":"'Encargos Sociais'!E32","v":0},{"$f":"ROUND(E74*$F$23,2)","v":{"$error":"#DIV/0!"}}]
[]
[null,null,null,"QUADRO-RESUMO DO MÓDULO 4",null,"Valor"]
[null,null,null,"4.1 - Ausências Legais",{"$f":"SUM(E66:E71)","v":2.0033267195767195E-2},{"$f":"ROUND(E77*$F$23,2)","v":{"$error":"#DIV/0!"}}]
[null,null,null,"4.2 - Intrajornada",{"$f":"E74","v":0},{"$f":"ROUND(E78*$F$23,2)","v":{"$error":"#DIV/0!"}}]
[]
[null,null,null,"TOTAL DE PREVISÃO PARA RESCISÃO E INTERVALO INTRAJORNADA",null,{"$f":"SUM(F77:F78)","v":{"$error":"#DIV/0!"}}]
[]
[null,"MÓDULO 5 - INSUMOS DIVERSOS",null,null,null,"Valor"]
[null,null,"A","Uniformes - aquisição",null,{"$f":"ROUND(HLOOKUP($B$12,Uniformes!K3:DZ33,3)/12,2)","v":0}]
[null,null,"B","Materiais de consumo relacionados ao posto - aquisição",null,{"$f":"ROUND(HLOOKUP(B12,'Mat Cons'!I11:DX13,3)/12,2)","v":0}]
[null,null,"C","Materiais permanentes relacionados ao posto - remuneração da sua depreciação / manutenção",null,{"$f":"HLOOKUP(B12,'Mat Perm'!Q11:EF13,3)","v":0}]
[null,null,"D","Equipamentos relacionados ao posto - remuneração da sua depreciação / manutenção",null,{"$f":"HLOOKUP(B12,'Equip Rel'!Q11:EF13,3)","v":0}]
[null,null,"E","Equipamentos de Proteção Individual - EPI - aquisição",null,{"$f":"ROUND(HLOOKUP(B12,EPI!I3:DX67,3)/12,2)","v":0}]
[]
[null,null,null,"TOTAL DE INSUMOS DIVERSOS",null,{"$f":"SUM(F83:F88)","v":0},null,"* Nota - Valores mensais por empregado"]
[]
[null,"MÓDULO 6 - CUSTOS INDIRETOS, TRIBUTOS E LUCRO - BDI",null,null,"Percentuais","Valor"]
[null,null,"A","Custos Indiretos",{"$f":"BDI!E6","v":4.4400000000000002E-2}]
[null,null,"A.1","Administração Central",{"$f":"BDI!E7","v":3.9E-2}]
[null,null,"A.2","Seguros, Garantias e Riscos",{"$f":"BDI!E8","v":5.4000000000000003E-3}]
[null,null,"B","Lucro",{"$f":"BDI!E10","v":0.06}]
[null,null,"C","Tributos",{"$f":"SUM(E97:E98)","v":0.124}]
[null,null,"C.1","Tributos Federais (COFINS, PIS e CPRB)",{"$f":"BDI!E18","v":7.3999999999999996E-2}]
[null,null,"C.2","Tributos Distritais (ISS)",{"$f":"BDI!E23","v":0.05},null,null,"* Nota - Utilizou-se o indicado pelo Sindicato da Arquitetura e da Engenharia (Sinaenco, 2008, p. 22), que adota um percentual redutor de 20% no cálculo dos custos tributários relativos às contribuições PIS e COFINS"]
[null,null,"D","Despesas Financeiras",{"$f":"BDI!E13","v":4.4669210982628549E-3}]
[]
[null,null,null,"TOTAL DE BDI",{"$f":"BDI!E26","v":0.26939999999999997},{"$f":"E101*E109","v":{"$error":"#DIV/0!"}}]
[]
[null,null,null,"QUADRO-RESUMO DO CUSTO MENSAL POR EMPREGADO - SEM O 13º","Valor"]
[null,null,null,"Módulo 1 - Composição da Remuneração",{"$f":"F23","v":{"$error":"#DIV/0!"}}]
[null,null,null,"Módulo 2 - Encargos e Benefícios Anuais, Mensais e Diários",{"$f":"F52","v":{"$error":"#DIV/0!"}}]
[null,null,null,"Módulo 3 - Provisão para Rescisão",{"$f":"F62","v":{"$error":"#DIV/0!"}}]
[null,null,null,"Módulo 4 - Custo de Reposição do Profissional Ausente",{"$f":"F80","v":{"$error":"#DIV/0!"}}]
[null,null,null,"Módulo 5 - Insumos Diversos",{"$f":"F89","v":0}]
[null,null,null,"SUBTOTAL (A+B+C+D+E)",{"$f":"SUM(E104:E108)","v":{"$error":"#DIV/0!"}}]
[null,null,null,"Módulo 6 - Custos Indiretos, Tributos e Lucro",{"$f":"F101","v":{"$error":"#DIV/0!"}}]
[]
[null,null,null,"TOTAL DO POSTO",{"$f":"SUM(E109:E110)","v":{"$error":"#DIV/0!"}}]
[]
[null,"MÓDULO 7 - DESTAQUE DO MÓDULO 2 - 13º SALÁRIO",null,null,"Percentuais","Valor"]
[null,null,"A","13º Salário",{"$f":"'Encargos Sociais'!E31","v":8.3333333333333329E-2},{"$f":"ROUND(E115*F$23,2)","v":{"$error":"#DIV/0!"}}]
[null,null,"B","Encargos Sociais sobre o 13º Salário - Taxa calculada no SUBMÓDULO 2.2",{"$f":"SUM($E$31:$E$39)","v":0.35800000000000004},{"$f":"ROUND(E116*$F$115,2)","v":{"$error":"#DIV/0!"}},null,"* Nota 1 - Provisiona-se, mensalmente, o proporcional a 1/12 dos valores referentes a gratificação natalina e adicional de férias."]
[null,null,"C","BDI sobre o 13º Salário - Taxa calculada no MÓDULO 6",{"$f":"E101","v":0.26939999999999997},{"$f":"ROUND(E117*($F$115+$F$116),2)","v":{"$error":"#DIV/0!"}}]
[]
[null,null,null,"TOTAL DO DESTAQUE DO 13º SALÁRIO",null,{"$f":"SUM(F115:F117)","v":{"$error":"#DIV/0!"}}]
[]
[null,null,null,"QUADRO-RESUMO DO CUSTO MENSAL POR EMPREGADO","Valor"]
[null,null,null,"Custo total - sem o 13º Salário",{"$f":"E112","v":{"$error":"#DIV/0!"}}]
[null,null,null,"Destaque do 13º Salário (valor mensal)",{"$f":"F119","v":{"$error":"#DIV/0!"}}]
[]
[null,null,null,"TOTAL DO POSTO",{"$f":"E122+E123","v":{"$error":"#DIV/0!"}}]

{"sheet":"10","index":13,"n_rows":125,"n_cols":8,"rows_kept":125,"cut":false,"hidden":true,"merged":[[14,1,14,3],[6,3,6,5],[8,1,8,5],[9,1,9,5],[11,1,11,2],[12,1,12,2],[90,1,90,3],[113,1,113,3],[24,1,24,3],[46,3,46,5],[53,1,53,3],[63,1,63,3],[75,3,75,5],[81,1,81,3]]}
[null,null,"CÂMARA DOS DEPUTADOS"]
[null,null,"DEPARTAMENTO TÉCNICO"]
[null,null,"Coordenação de Planejamento e Gestão"]
[]
[null,null,"Data:",{"$f":"'Dados Gerais'!#REF!","v":{"$error":"#REF!"}}]
[null,null,"Processo:",{"$f":"'Dados Gerais'!#REF!","v":{"$error":"#REF!"}}]
[null,null,"Objeto:",{"$f":"'Dados Gerais'!#REF!","v":{"$error":"#REF!"}}]
[]
[null,"PLANILHA DE ESTIMATIVA DE CUSTOS"]
[null,"Padrão IN 05/2017 e IN 07/2018 - MPDG"]
[]
[null,10,null,{"$f":"HLOOKUP($B$12,'Dados Gerais'!$D$5:$BK$20,6)","v":0},"QUANTIDADE",{"$f":"HLOOKUP($B$12,'Dados Gerais'!$D$5:$BK$20,10)","v":0}]
[null,"CCT",null,{"$f":"HLOOKUP($B$12,'Dados Gerais'!$D$5:$BK$20,15)","v":0},"DATA-BASE",{"$f":"HLOOKUP($B$12,'Dados Gerais'!$D$5:$BK$20,16)","v":"00:00:00"}]
[]
[null,"MÓDULO 1 - COMPOSIÇÃO DA REMUNERAÇÃO",null,null,null,"Valor"]
[null,null,"A","Salário-Base",null,{"$f":"HLOOKUP($B$12,'Dados Gerais'!$D$5:$BK$20,8)","v":0}]
[null,null,"B","Adicional de Periculosidade",null,{"$f":"HLOOKUP($B$12,'Dados Gerais'!$D$5:$BK$37,25)","v":0}]
[null,null,"C","Adicional de Insalubridade",null,{"$f":"HLOOKUP($B$12,'Dados Gerais'!$D$5:$BK$37,31)","v":0}]
[null,null,"D","Adicional Noturno",null,{"$f":"HLOOKUP($B$12,'Dados Gerais'!$D$5:$BK$50,46)","v":{"$error":"#DIV/0!"}},null,"* Nota 1 - O Módulo 1 refere-se ao valor mensal devido ao empregado pela prestação do serviço no período de 12 meses."]
[null,null,"E","Adicional de Hora Extra",null,{"$f":"HLOOKUP($B$12,'Dados Gerais'!$D$5:$BK$67,63)","v":{"$error":"#DIV/0!"}},null,"* Nota 2 - O adicional de hora extra no feriado trabalhado foi suprimido pela Lei 13.467/17"]
[null,null,"F","Outros (especificar)",null,{"$f":"HLOOKUP($B$12,'Dados Gerais'!$D$5:$BK$59,33)","v":0},null,"* Nota 3 - ART. 7º, § 2º, DA LEI Nº 605/49.Sendo mensalista o obreiro, o adicional noturno pago de forma fixa já é considerado integrado para os efeitos do pagamento do repouso semanal remunerado, nos termos do art. 7º, § 2º, da Lei nº 605/49."]
[]
[null,null,null,"TOTAL DA REMUNERAÇÃO",null,{"$f":"SUM(F16:F21)","v":{"$error":"#DIV/0!"}}]
[]
[null,"MÓDULO 2 - ENCARGOS E BENEFÍCIOS ANUAIS, MENSAIS E DIÁRIOS",null,null,"Percentuais","Valor"]
[null,"Submódulo 2.1 - 13º Salário, Férias e Adicional de Férias"]
[null,null,"A","13º Salário - Calculado no Módulo 7 - Destacado",0,{"$f":"ROUND(E27*F$23,2)","v":{"$error":"#DIV/0!"}}]
[null,null,"B","Férias e Adicional de Férias",{"$f":"'Encargos Sociais'!E24+'Encargos Sociais'!E30","v":0.12121212121212122},{"$f":"ROUND(E28*F$23,2)","v":{"$error":"#DIV/0!"}},null,"* Nota 1 - Provisiona-se, mensalmente, o proporcional a 1/12 dos valores referentes a gratificação natalina, férias e adicional de férias."]
[null,null,null,null,null,null,null,"* Nota 2 - O adicional de férias contido no Submódulo 2.1 corresponde a 1/3 da remuneração que, por sua vez, é dividida por 12 contome Nota 1."]
[null,"Submódulo 2.2 - Encargos Previdenciários (GPS), Fundo de Garantia por Tempo de Serviço (FGTS) e Outras Contribuições"]
[null,null,"A","INSS (art. 22, inciso I, Lei nº 8.212/91)",{"$f":"'Encargos Sociais'!E13","v":0.2},{"$f":"ROUND(E31*($F$23+$F$48+$F$80),2)","v":{"$error":"#DIV/0!"}}]
[null,null,"B","Salário Educação (art. 3º, inciso I, Decreto nº 87.043/82)",{"$f":"'Encargos Sociais'!E14","v":2.5000000000000001E-2},{"$f":"ROUND(E32*($F$23+$F$48+$F$80),2)","v":{"$error":"#DIV/0!"}}]
[null,null,"C","SAT/RAT (art. 22, II, Lei 8.212/91 e Anexo V, Decreto 6.042/07) - Enquadramento 8211-3/00",{"$f":"'Encargos Sociais'!E15","v":0.01},{"$error":"#DIV/0!"}]
[null,null,"D","SESC ou SESI (art. 30, Lei nº 8.036/90 e art. 1º, Lei 8.154/90)",{"$f":"'Encargos Sociais'!E16","v":1.4999999999999999E-2},{"$error":"#DIV/0!"}]
[null,null,"E","SENAI ou SENAC (Decreto nº 2.318/86)",{"$f":"'Encargos Sociais'!E17","v":0.01},{"$error":"#DIV/0!"}]
[null,null,"F","SEBRAE (§ 3º, art. 8º, Lei 8.029/90, alterada pela Lei nº 8.154/90)",{"$f":"'Encargos Sociais'!E18","v":6.0000000000000001E-3},{"$error":"#DIV/0!"}]
[null,null,"G","INCRA (art. 1º, I, Decreto Lei 1.146/70 e Lei 7.787, de 30/06/89)",{"$f":"'Encargos Sociais'!E19","v":2E-3},{"$error":"#DIV/0!"},null,"* Nota 1 - Os percentuais dos encargos previdenciários, do FGTS e demais contribuições são estabelecidos por legislação vigente."]
[null,null,"H","FGTS (Lei Complementar nº 110/01 e art. 30, Lei nº 8.036/90)",{"$f":"'Encargos Sociais'!E20","v":0.08},{"$error":"#DIV/0!"},null,"* Nota 2 - O SAT, a depender do grau de risco do serviço, irá variar entre 1%, para risco leve, de 2%, para risco médio, e de 3% para risco grave."]
[null,null,"I","SECONCI (Convenções Coletivas de Trabalho da construção)",{"$f":"'Encargos Sociais'!E21","v":0.01},{"$error":"#DIV/0!"},null,"* Nota 3 - Os percentuais do Submódulo 2.2 incidem sobre o Módulo 1 e o Submódulo 2.1."]
[]
[null,"Submódulo 2.3 - Benefícios Mensais e Diários"]
[null,null,"A","Auxílio Transporte",null,{"$f":"HLOOKUP($B$12,'Dados Gerais'!$D$5:$BK$93,82)","v":0}]
[null,null,"B","Auxílio Alimentação",null,{"$f":"HLOOKUP($B$12,'Dados Gerais'!$D$5:$BK$93,89)","v":{"$error":"#NUM!"}}]
[null,null,"C","Assistência Médica e Familiar",null,{"$f":"HLOOKUP($B$12,'Dados Gerais'!$D$5:$BK$101,97)","v":185.84}]
[null,null,"D","Outros (Seguro de vida e auxílio funeral e auxílio odontológico)",null,{"$f":"HLOOKUP($B$12,'Dados Gerais'!$D$5:$BK$118,114)","v":0},null,"* Nota 1 - O valor informado deverá ser o custo real do benefício (descontado o valor eventualmente pago pelo empregado)."]
[null,null,null,null,null,null,null,"* Nota 2 - Observar a previsão dos benefícios contidos em Acordos, Convenções e Dissídios Coletivos de Trabalho e o disposto no art. 6º da IN 5/2017"]
[null,null,null,"QUADRO-RESUMO DO MÓDULO 2"]
[null,null,null,"2.1 - 13º Salário, Férias e Adicional de Férias - 13º Destacado - Calculado no Módulo 7 ",{"$f":"SUM(E27:E28)","v":0.12121212121212122},{"$f":"F27+F28","v":{"$error":"#DIV/0!"}}]
[null,null,null,"2.2 - Encargos Previdenciários (GPS), Fundo de Garantia por Tempo de Serviço (FGTS) e Contribuições",{"$f":"SUM(E31:E39)","v":0.35800000000000004},{"$f":"SUM(F31:F39)","v":{"$error":"#DIV/0!"}}]
[null,null,null,"2.3 - Benefícios Mensais e Diários",null,{"$f":"SUM(F42:F45)","v":{"$error":"#NUM!"}}]
[]
[null,null,null,"TOTAL DOS ENCARGOS E BENEFÍCIOS",null,{"$f":"SUM(F48:F50)","v":{"$error":"#DIV/0!"}}]
[]
[null,"MÓDULO 3 - PREVISÃO PARA RESCISÃO",null,null,"Percentuais","Valor"]
[null,null,"A","Aviso Prévio Indenizado (Art. 7º, inciso XXI, da CF/1988 e arts. 477, 487, §1º, e 491 da CLT)",{"$f":"'Encargos Sociais'!E35","v":8.3333333333333332E-3},{"$f":"ROUND(E55*$F$23,2)","v":{"$error":"#DIV/0!"}}]
[null,null,"B","Incidência do FGTS sobre o Aviso Prévio Indenizado (Súmula 305 TST)",{"$f":"'Encargos Sociais'!E36","v":6.6666666666666664E-4},{"$error":"#DIV/0!"},null,"* Nota 1 - Adotou-se os parâmetros do estudo do STF (http://www.stf.jus.br/arquivo/cms/sobrestfestudosci/anexo/encargos_sociais_03102007.pdf), onde 5% do pessoal é demitido pelo empregador no decurso do contrato (para estes, considerou-se o aviso prévio indenizado). Desprezou-se as demissões por justa causa e os pedidos de demissão."]
[null,null,"C","Multa do FGTS e Contribuição Social sobre o Aviso Prévio Indenizado (Art. 18, §1º, da Lei 8.036/1990 e art. 1º da LC nº 110/2001)",{"$f":"'Encargos Sociais'!E37","v":1.274074074074074E-3},{"$error":"#DIV/0!"},null,"* Nota 2 - No cálculo do percentual, considerou-se 36 dias, correspondendo à metade da duração média dos contratos (2 anos)"]
[null,null,"D","Aviso Prévio Trabalhado (Art. 488, parágrafo único, CLT)",{"$f":"'Encargos Sociais'!E38","v":1.2037037037037035E-2},{"$error":"#DIV/0!"},null,"* Nota 3 - Incide sobre a Remuneração + 13º salário (1/12) + Férias (1/12) + Adicional de Férias (1/36) x 50% multa (40% para o empregado e 10% de contribuição social) x 8% FGTS"]
[null,null,"E","Incidência de GPS, FGTS e outras contribuições sobre o Aviso Prévio Trabalhado",{"$f":"'Encargos Sociais'!E39","v":4.3092592592592583E-3},{"$error":"#DIV/0!"},null,"* Nota 4 - Os 95% restantes do cálculo, a um prazo médio de contrato de 4 anos. Assim, calcula-se 7 dias para o 1º ano de contrato e mais 3 dias para os 3 anos seguintes."]
[null,null,"F","Multa do FGTS e Contribuição Social sobre o Aviso Prévio Trabalhado",{"$f":"'Encargos Sociais'!E40","v":3.0505155555555549E-2},{"$error":"#DIV/0!"}]
[]
[null,null,null,"TOTAL DE PREVISÃO PARA RESCISÃO",null,{"$f":"SUM(F55:F60)","v":{"$error":"#DIV/0!"}}]
[]
[null,"MÓDULO 4 - CUSTO DE REPOSIÇÃO DO PROFISSIONAL AUSENTE",null,null,"Percentuais","Valor"]
[null,"Submódulo 4.1 - Ausências Legais"]
[null,null,"A","Férias (Arts. 129 e 130, inc. I, da CLT) - Calculado no Submódulo 2.1",0,{"$f":"ROUND(E66*$F$23,2)","v":{"$error":"#DIV/0!"}},null,"* Nota 1 - As alíneas “A” a “F” referem-se somente ao custo que será pago ao repositor pelos dias \ntrabalhados quando da necessidade de substituir a mão de obra alocada na prestação do serviço."]
[null,null,"B","Ausências Legais (Arts. 131 e 473 da CLT)",{"$f":"'Encargos Sociais'!E25","v":7.9365079365079361E-3},{"$error":"#DIV/0!"},null,"* Nota 2 - Adotou-se a estimativa do SINAPI de 2 dias por ano."]
[null,null,"C","Licença-Paternidade (Art. 7º, XIX, e art. 10, §1º, do ADCT, CF/1988 e Art. 1º, II, da Lei 11.770/2008)",{"$f":"'Encargos Sociais'!E26","v":8.2777777777777776E-4},{"$error":"#DIV/0!"},null,"* Nota 3 - Utilizada a proporção de 50% para homens, 5 dias de afastamento, e a probabilidade de um trabalhador requerer a Licença Paternidade em 5,22%, conforme SINAPI (citando dados da PNAD 2015)"]
[null,null,"D","Ausência por Acidente de Trabalho (Art. 131, III, da CLT)",{"$f":"'Encargos Sociais'!E27","v":8.541666666666667E-4},{"$error":"#DIV/0!"},null,"* Nota 4 - Utilzada a estatística de 1,96% dos contribuintes beneficiados com a emissão do auxílio, conforme Anuário Estatístico da Previdência Social. Afastamento de 15 dias a cargo da empresa."]
[null,null,"E","Afastamento Maternidade (Art. 71 da Lei nº 8.213/1991)",{"$f":"'Encargos Sociais'!E28","v":3.2925925925925922E-3},{"$error":"#DIV/0!"},null,"* Nota 5 - Utilizada a proporção de 50% para mulheres, 180 dias de afastamento, e a probabilidade de uma trabalhadora requerer a Licença Maternidade em 4,91%, conforme SINAPI (citando dados do IBGE 2016)"]
[null,null,"F","Auxílio Enfermidade - Doença (Art. 59 da Lei nº 8.213/1991)",{"$f":"'Encargos Sociais'!E29","v":7.1222222222222225E-3},{"$error":"#DIV/0!"},null,"* Nota 6 - Utilizada a estatística de 3,37% dos contribuintes beneficiados com o auxílio, conforme Anuário Estatístico da Previdência Social de 2015 (acrescidos de 2 dias ao ano, para os quais o trabalhador nem requer o benefício da Previdência - conforme SINAPI)"]
[]
[null,"Submódulo 4.2 - Intrajornada"]
[null,null,"A","Intervalo para repouso ou alimentação",{"$f":"'Encargos Sociais'!E32","v":0},{"$f":"ROUND(E74*$F$23,2)","v":{"$error":"#DIV/0!"}}]
[]
[null,null,null,"QUADRO-RESUMO DO MÓDULO 4",null,"Valor"]
[null,null,null,"4.1 - Ausências Legais",{"$f":"SUM(E66:E71)","v":2.0033267195767195E-2},{"$f":"ROUND(E77*$F$23,2)","v":{"$error":"#DIV/0!"}}]
[null,null,null,"4.2 - Intrajornada",{"$f":"E74","v":0},{"$f":"ROUND(E78*$F$23,2)","v":{"$error":"#DIV/0!"}}]
[]
[null,null,null,"TOTAL DE PREVISÃO PARA RESCISÃO E INTERVALO INTRAJORNADA",null,{"$f":"SUM(F77:F78)","v":{"$error":"#DIV/0!"}}]
[]
[null,"MÓDULO 5 - INSUMOS DIVERSOS",null,null,null,"Valor"]
[null,null,"A","Uniformes - aquisição",null,{"$f":"ROUND(HLOOKUP($B$12,Uniformes!K3:DZ33,3)/12,2)","v":0}]
[null,null,"B","Materiais de consumo relacionados ao posto - aquisição",null,{"$f":"ROUND(HLOOKUP(B12,'Mat Cons'!I11:DX13,3)/12,2)","v":0}]
[null,null,"C","Materiais permanentes relacionados ao posto - remuneração da sua depreciação / manutenção",null,{"$f":"HLOOKUP(B12,'Mat Perm'!Q11:EF13,3)","v":0}]
[null,null,"D","Equipamentos relacionados ao posto - remuneração da sua depreciação / manutenção",null,{"$f":"HLOOKUP(B12,'Equip Rel'!Q11:EF13,3)","v":0}]
[null,null,"E","Equipamentos de Proteção Individual - EPI - aquisição",null,{"$f":"ROUND(HLOOKUP(B12,EPI!I3:DX67,3)/12,2)","v":0}]
[]
[null,null,null,"TOTAL DE INSUMOS DIVERSOS",null,{"$f":"SUM(F83:F88)","v":0},null,"* Nota - Valores mensais por empregado"]
[]
[null,"MÓDULO 6 - CUSTOS INDIRETOS, TRIBUTOS E LUCRO - BDI",null,null,"Percentuais","Valor"]
[null,null,"A","Custos Indiretos",{"$f":"BDI!E6","v":4.4400000000000002E-2}]
[null,null,"A.1","Administração Central",{"$f":"BDI!E7","v":3.9E-2}]
[null,null,"A.2","Seguros, Garantias e Riscos",{"$f":"BDI!E8","v":5.4000000000000003E-3}]
[null,null,"B","Lucro",{"$f":"BDI!E10","v":0.06}]
[null,null,"C","Tributos",{"$f":"SUM(E97:E98)","v":0.124}]
[null,null,"C.1","Tributos Federais (COFINS, PIS e CPRB)",{"$f":"BDI!E18","v":7.3999999999999996E-2}]
[null,null,"C.2","Tributos Distritais (ISS)",{"$f":"BDI!E23","v":0.05},null,null,"* Nota - Utilizou-se o indicado pelo Sindicato da Arquitetura e da Engenharia (Sinaenco, 2008, p. 22), que adota um percentual redutor de 20% no cálculo dos custos tributários relativos às contribuições PIS e COFINS"]
[null,null,"D","Despesas Financeiras",{"$f":"BDI!E13","v":4.4669210982628549E-3}]
[]
[null,null,null,"TOTAL DE BDI",{"$f":"BDI!E26","v":0.26939999999999997},{"$f":"E101*E109","v":{"$error":"#DIV/0!"}}]
[]
[null,null,null,"QUADRO-RESUMO DO CUSTO MENSAL POR EMPREGADO - SEM O 13º","Valor"]
[null,null,null,"Módulo 1 - Composição da Remuneração",{"$f":"F23","v":{"$error":"#DIV/0!"}}]
[null,null,null,"Módulo 2 - Encargos e Benefícios Anuais, Mensais e Diários",{"$f":"F52","v":{"$error":"#DIV/0!"}}]
[null,null,null,"Módulo 3 - Provisão para Rescisão",{"$f":"F62","v":{"$error":"#DIV/0!"}}]
[null,null,null,"Módulo 4 - Custo de Reposição do Profissional Ausente",{"$f":"F80","v":{"$error":"#DIV/0!"}}]
[null,null,null,"Módulo 5 - Insumos Diversos",{"$f":"F89","v":0}]
[null,null,null,"SUBTOTAL (A+B+C+D+E)",{"$f":"SUM(E104:E108)","v":{"$error":"#DIV/0!"}}]
[null,null,null,"Módulo 6 - Custos Indiretos, Tributos e Lucro",{"$f":"F101","v":{"$error":"#DIV/0!"}}]
[]
[null,null,null,"TOTAL DO POSTO",{"$f":"SUM(E109:E110)","v":{"$error":"#DIV/0!"}}]
[]
[null,"MÓDULO 7 - DESTAQUE DO MÓDULO 2 - 13º SALÁRIO",null,null,"Percentuais","Valor"]
[null,null,"A","13º Salário",{"$f":"'Encargos Sociais'!E31","v":8.3333333333333329E-2},{"$f":"ROUND(E115*F$23,2)","v":{"$error":"#DIV/0!"}}]
[null,null,"B","Encargos Sociais sobre o 13º Salário - Taxa calculada no SUBMÓDULO 2.2",{"$f":"SUM($E$31:$E$39)","v":0.35800000000000004},{"$f":"ROUND(E116*$F$115,2)","v":{"$error":"#DIV/0!"}},null,"* Nota 1 - Provisiona-se, mensalmente, o proporcional a 1/12 dos valores referentes a gratificação natalina e adicional de férias."]
[null,null,"C","BDI sobre o 13º Salário - Taxa calculada no MÓDULO 6",{"$f":"E101","v":0.26939999999999997},{"$f":"ROUND(E117*($F$115+$F$116),2)","v":{"$error":"#DIV/0!"}}]
[]
[null,null,null,"TOTAL DO DESTAQUE DO 13º SALÁRIO",null,{"$f":"SUM(F115:F117)","v":{"$error":"#DIV/0!"}}]
[]
[null,null,null,"QUADRO-RESUMO DO CUSTO MENSAL POR EMPREGADO","Valor"]
[null,null,null,"Custo total - sem o 13º Salário",{"$f":"E112","v":{"$error":"#DIV/0!"}}]
[null,null,null,"Destaque do 13º Salário (valor mensal)",{"$f":"F119","v":{"$error":"#DIV/0!"}}]
[]
[null,null,null,"TOTAL DO POSTO",{"$f":"E122+E123","v":{"$error":"#DIV/0!"}}]

{"sheet":"11","index":14,"n_rows":125,"n_cols":8,"rows_kept":125,"cut":false,"hidden":true,"merged":[[14,1,14,3],[6,3,6,5],[8,1,8,5],[9,1,9,5],[11,1,11,2],[12,1,12,2],[90,1,90,3],[113,1,113,3],[24,1,24,3],[46,3,46,5],[53,1,53,3],[63,1,63,3],[75,3,75,5],[81,1,81,3]]}
[null,null,"CÂMARA DOS DEPUTADOS"]
[null,null,"DEPARTAMENTO TÉCNICO"]
[null,null,"Coordenação de Planejamento e Gestão"]
[]
[null,null,"Data:",{"$f":"'Dados Gerais'!#REF!","v":{"$error":"#REF!"}}]
[null,null,"Processo:",{"$f":"'Dados Gerais'!#REF!","v":{"$error":"#REF!"}}]
[null,null,"Objeto:",{"$f":"'Dados Gerais'!#REF!","v":{"$error":"#REF!"}}]
[]
[null,"PLANILHA DE ESTIMATIVA DE CUSTOS"]
[null,"Padrão IN 05/2017 e IN 07/2018 - MPDG"]
[]
[null,11,null,{"$f":"HLOOKUP($B$12,'Dados Gerais'!$D$5:$BK$20,6)","v":0},"QUANTIDADE",{"$f":"HLOOKUP($B$12,'Dados Gerais'!$D$5:$BK$20,10)","v":0}]
[null,"CCT",null,{"$f":"HLOOKUP($B$12,'Dados Gerais'!$D$5:$BK$20,15)","v":0},"DATA-BASE",{"$f":"HLOOKUP($B$12,'Dados Gerais'!$D$5:$BK$20,16)","v":"00:00:00"}]
[]
[null,"MÓDULO 1 - COMPOSIÇÃO DA REMUNERAÇÃO",null,null,null,"Valor"]
[null,null,"A","Salário-Base",null,{"$f":"HLOOKUP($B$12,'Dados Gerais'!$D$5:$BK$20,8)","v":0}]
[null,null,"B","Adicional de Periculosidade",null,{"$f":"HLOOKUP($B$12,'Dados Gerais'!$D$5:$BK$37,25)","v":0}]
[null,null,"C","Adicional de Insalubridade",null,{"$f":"HLOOKUP($B$12,'Dados Gerais'!$D$5:$BK$37,31)","v":0}]
[null,null,"D","Adicional Noturno",null,{"$f":"HLOOKUP($B$12,'Dados Gerais'!$D$5:$BK$50,46)","v":{"$error":"#DIV/0!"}},null,"* Nota 1 - O Módulo 1 refere-se ao valor mensal devido ao empregado pela prestação do serviço no período de 12 meses."]
[null,null,"E","Adicional de Hora Extra",null,{"$f":"HLOOKUP($B$12,'Dados Gerais'!$D$5:$BK$67,63)","v":{"$error":"#DIV/0!"}},null,"* Nota 2 - O adicional de hora extra no feriado trabalhado foi suprimido pela Lei 13.467/17"]
[null,null,"F","Outros (especificar)",null,{"$f":"HLOOKUP($B$12,'Dados Gerais'!$D$5:$BK$59,33)","v":0},null,"* Nota 3 - ART. 7º, § 2º, DA LEI Nº 605/49.Sendo mensalista o obreiro, o adicional noturno pago de forma fixa já é considerado integrado para os efeitos do pagamento do repouso semanal remunerado, nos termos do art. 7º, § 2º, da Lei nº 605/49."]
[]
[null,null,null,"TOTAL DA REMUNERAÇÃO",null,{"$f":"SUM(F16:F21)","v":{"$error":"#DIV/0!"}}]
[]
[null,"MÓDULO 2 - ENCARGOS E BENEFÍCIOS ANUAIS, MENSAIS E DIÁRIOS",null,null,"Percentuais","Valor"]
[null,"Submódulo 2.1 - 13º Salário, Férias e Adicional de Férias"]
[null,null,"A","13º Salário - Calculado no Módulo 7 - Destacado",0,{"$f":"ROUND(E27*F$23,2)","v":{"$error":"#DIV/0!"}}]
[null,null,"B","Férias e Adicional de Férias",{"$f":"'Encargos Sociais'!E24+'Encargos Sociais'!E30","v":0.12121212121212122},{"$f":"ROUND(E28*F$23,2)","v":{"$error":"#DIV/0!"}},null,"* Nota 1 - Provisiona-se, mensalmente, o proporcional a 1/12 dos valores referentes a gratificação natalina, férias e adicional de férias."]
[null,null,null,null,null,null,null,"* Nota 2 - O adicional de férias contido no Submódulo 2.1 corresponde a 1/3 da remuneração que, por sua vez, é dividida por 12 contome Nota 1."]
[null,"Submódulo 2.2 - Encargos Previdenciários (GPS), Fundo de Garantia por Tempo de Serviço (FGTS) e Outras Contribuições"]
[null,null,"A","INSS (art. 22, inciso I, Lei nº 8.212/91)",{"$f":"'Encargos Sociais'!E13","v":0.2},{"$f":"ROUND(E31*($F$23+$F$48+$F$80),2)","v":{"$error":"#DIV/0!"}}]
[null,null,"B","Salário Educação (art. 3º, inciso I, Decreto nº 87.043/82)",{"$f":"'Encargos Sociais'!E14","v":2.5000000000000001E-2},{"$f":"ROUND(E32*($F$23+$F$48+$F$80),2)","v":{"$error":"#DIV/0!"}}]
[null,null,"C","SAT/RAT (art. 22, II, Lei 8.212/91 e Anexo V, Decreto 6.042/07) - Enquadramento 8211-3/00",{"$f":"'Encargos Sociais'!E15","v":0.01},{"$error":"#DIV/0!"}]
[null,null,"D","SESC ou SESI (art. 30, Lei nº 8.036/90 e art. 1º, Lei 8.154/90)",{"$f":"'Encargos Sociais'!E16","v":1.4999999999999999E-2},{"$error":"#DIV/0!"}]
[null,null,"E","SENAI ou SENAC (Decreto nº 2.318/86)",{"$f":"'Encargos Sociais'!E17","v":0.01},{"$error":"#DIV/0!"}]
[null,null,"F","SEBRAE (§ 3º, art. 8º, Lei 8.029/90, alterada pela Lei nº 8.154/90)",{"$f":"'Encargos Sociais'!E18","v":6.0000000000000001E-3},{"$error":"#DIV/0!"}]
[null,null,"G","INCRA (art. 1º, I, Decreto Lei 1.146/70 e Lei 7.787, de 30/06/89)",{"$f":"'Encargos Sociais'!E19","v":2E-3},{"$error":"#DIV/0!"},null,"* Nota 1 - Os percentuais dos encargos previdenciários, do FGTS e demais contribuições são estabelecidos por legislação vigente."]
[null,null,"H","FGTS (Lei Complementar nº 110/01 e art. 30, Lei nº 8.036/90)",{"$f":"'Encargos Sociais'!E20","v":0.08},{"$error":"#DIV/0!"},null,"* Nota 2 - O SAT, a depender do grau de risco do serviço, irá variar entre 1%, para risco leve, de 2%, para risco médio, e de 3% para risco grave."]
[null,null,"I","SECONCI (Convenções Coletivas de Trabalho da construção)",{"$f":"'Encargos Sociais'!E21","v":0.01},{"$error":"#DIV/0!"},null,"* Nota 3 - Os percentuais do Submódulo 2.2 incidem sobre o Módulo 1 e o Submódulo 2.1."]
[]
[null,"Submódulo 2.3 - Benefícios Mensais e Diários"]
[null,null,"A","Auxílio Transporte",null,{"$f":"HLOOKUP($B$12,'Dados Gerais'!$D$5:$BK$93,82)","v":0}]
[null,null,"B","Auxílio Alimentação",null,{"$f":"HLOOKUP($B$12,'Dados Gerais'!$D$5:$BK$93,89)","v":{"$error":"#NUM!"}}]
[null,null,"C","Assistência Médica e Familiar",null,{"$f":"HLOOKUP($B$12,'Dados Gerais'!$D$5:$BK$101,97)","v":185.84}]
[null,null,"D","Outros (Seguro de vida e auxílio funeral e auxílio odontológico)",null,{"$f":"HLOOKUP($B$12,'Dados Gerais'!$D$5:$BK$118,114)","v":0},null,"* Nota 1 - O valor informado deverá ser o custo real do benefício (descontado o valor eventualmente pago pelo empregado)."]
[null,null,null,null,null,null,null,"* Nota 2 - Observar a previsão dos benefícios contidos em Acordos, Convenções e Dissídios Coletivos de Trabalho e o disposto no art. 6º da IN 5/2017"]
[null,null,null,"QUADRO-RESUMO DO MÓDULO 2"]
[null,null,null,"2.1 - 13º Salário, Férias e Adicional de Férias - 13º Destacado - Calculado no Módulo 7 ",{"$f":"SUM(E27:E28)","v":0.12121212121212122},{"$f":"F27+F28","v":{"$error":"#DIV/0!"}}]
[null,null,null,"2.2 - Encargos Previdenciários (GPS), Fundo de Garantia por Tempo de Serviço (FGTS) e Contribuições",{"$f":"SUM(E31:E39)","v":0.35800000000000004},{"$f":"SUM(F31:F39)","v":{"$error":"#DIV/0!"}}]
[null,null,null,"2.3 - Benefícios Mensais e Diários",null,{"$f":"SUM(F42:F45)","v":{"$error":"#NUM!"}}]
[]
[null,null,null,"TOTAL DOS ENCARGOS E BENEFÍCIOS",null,{"$f":"SUM(F48:F50)","v":{"$error":"#DIV/0!"}}]
[]
[null,"MÓDULO 3 - PREVISÃO PARA RESCISÃO",null,null,"Percentuais","Valor"]
[null,null,"A","Aviso Prévio Indenizado (Art. 7º, inciso XXI, da CF/1988 e arts. 477, 487, §1º, e 491 da CLT)",{"$f":"'Encargos Sociais'!E35","v":8.3333333333333332E-3},{"$f":"ROUND(E55*$F$23,2)","v":{"$error":"#DIV/0!"}}]
[null,null,"B","Incidência do FGTS sobre o Aviso Prévio Indenizado (Súmula 305 TST)",{"$f":"'Encargos Sociais'!E36","v":6.6666666666666664E-4},{"$error":"#DIV/0!"},null,"* Nota 1 - Adotou-se os parâmetros do estudo do STF (http://www.stf.jus.br/arquivo/cms/sobrestfestudosci/anexo/encargos_sociais_03102007.pdf), onde 5% do pessoal é demitido pelo empregador no decurso do contrato (para estes, considerou-se o aviso prévio indenizado). Desprezou-se as demissões por justa causa e os pedidos de demissão."]
[null,null,"C","Multa do FGTS e Contribuição Social sobre o Aviso Prévio Indenizado (Art. 18, §1º, da Lei 8.036/1990 e art. 1º da LC nº 110/2001)",{"$f":"'Encargos Sociais'!E37","v":1.274074074074074E-3},{"$error":"#DIV/0!"},null,"* Nota 2 - No cálculo do percentual, considerou-se 36 dias, correspondendo à metade da duração média dos contratos (2 anos)"]
[null,null,"D","Aviso Prévio Trabalhado (Art. 488, parágrafo único, CLT)",{"$f":"'Encargos Sociais'!E38","v":1.2037037037037035E-2},{"$error":"#DIV/0!"},null,"* Nota 3 - Incide sobre a Remuneração + 13º salário (1/12) + Férias (1/12) + Adicional de Férias (1/36) x 50% multa (40% para o empregado e 10% de contribuição social) x 8% FGTS"]
[null,null,"E","Incidência de GPS, FGTS e outras contribuições sobre o Aviso Prévio Trabalhado",{"$f":"'Encargos Sociais'!E39","v":4.3092592592592583E-3},{"$error":"#DIV/0!"},null,"* Nota 4 - Os 95% restantes do cálculo, a um prazo médio de contrato de 4 anos. Assim, calcula-se 7 dias para o 1º ano de contrato e mais 3 dias para os 3 anos seguintes."]
[null,null,"F","Multa do FGTS e Contribuição Social sobre o Aviso Prévio Trabalhado",{"$f":"'Encargos Sociais'!E40","v":3.0505155555555549E-2},{"$error":"#DIV/0!"}]
[]
[null,null,null,"TOTAL DE PREVISÃO PARA RESCISÃO",null,{"$f":"SUM(F55:F60)","v":{"$error":"#DIV/0!"}}]
[]
[null,"MÓDULO 4 - CUSTO DE REPOSIÇÃO DO PROFISSIONAL AUSENTE",null,null,"Percentuais","Valor"]
[null,"Submódulo 4.1 - Ausências Legais"]
[null,null,"A","Férias (Arts. 129 e 130, inc. I, da CLT) - Calculado no Submódulo 2.1",0,{"$f":"ROUND(E66*$F$23,2)","v":{"$error":"#DIV/0!"}},null,"* Nota 1 - As alíneas “A” a “F” referem-se somente ao custo que será pago ao repositor pelos dias \ntrabalhados quando da necessidade de substituir a mão de obra alocada na prestação do serviço."]
[null,null,"B","Ausências Legais (Arts. 131 e 473 da CLT)",{"$f":"'Encargos Sociais'!E25","v":7.9365079365079361E-3},{"$error":"#DIV/0!"},null,"* Nota 2 - Adotou-se a estimativa do SINAPI de 2 dias por ano."]
[null,null,"C","Licença-Paternidade (Art. 7º, XIX, e art. 10, §1º, do ADCT, CF/1988 e Art. 1º, II, da Lei 11.770/2008)",{"$f":"'Encargos Sociais'!E26","v":8.2777777777777776E-4},{"$error":"#DIV/0!"},null,"* Nota 3 - Utilizada a proporção de 50% para homens, 5 dias de afastamento, e a probabilidade de um trabalhador requerer a Licença Paternidade em 5,22%, conforme SINAPI (citando dados da PNAD 2015)"]
[null,null,"D","Ausência por Acidente de Trabalho (Art. 131, III, da CLT)",{"$f":"'Encargos Sociais'!E27","v":8.541666666666667E-4},{"$error":"#DIV/0!"},null,"* Nota 4 - Utilzada a estatística de 1,96% dos contribuintes beneficiados com a emissão do auxílio, conforme Anuário Estatístico da Previdência Social. Afastamento de 15 dias a cargo da empresa."]
[null,null,"E","Afastamento Maternidade (Art. 71 da Lei nº 8.213/1991)",{"$f":"'Encargos Sociais'!E28","v":3.2925925925925922E-3},{"$error":"#DIV/0!"},null,"* Nota 5 - Utilizada a proporção de 50% para mulheres, 180 dias de afastamento, e a probabilidade de uma trabalhadora requerer a Licença Maternidade em 4,91%, conforme SINAPI (citando dados do IBGE 2016)"]
[null,null,"F","Auxílio Enfermidade - Doença (Art. 59 da Lei nº 8.213/1991)",{"$f":"'Encargos Sociais'!E29","v":7.1222222222222225E-3},{"$error":"#DIV/0!"},null,"* Nota 6 - Utilizada a estatística de 3,37% dos contribuintes beneficiados com o auxílio, conforme Anuário Estatístico da Previdência Social de 2015 (acrescidos de 2 dias ao ano, para os quais o trabalhador nem requer o benefício da Previdência - conforme SINAPI)"]
[]
[null,"Submódulo 4.2 - Intrajornada"]
[null,null,"A","Intervalo para repouso ou alimentação",{"$f":"'Encargos Sociais'!E32","v":0},{"$f":"ROUND(E74*$F$23,2)","v":{"$error":"#DIV/0!"}}]
[]
[null,null,null,"QUADRO-RESUMO DO MÓDULO 4",null,"Valor"]
[null,null,null,"4.1 - Ausências Legais",{"$f":"SUM(E66:E71)","v":2.0033267195767195E-2},{"$f":"ROUND(E77*$F$23,2)","v":{"$error":"#DIV/0!"}}]
[null,null,null,"4.2 - Intrajornada",{"$f":"E74","v":0},{"$f":"ROUND(E78*$F$23,2)","v":{"$error":"#DIV/0!"}}]
[]
[null,null,null,"TOTAL DE PREVISÃO PARA RESCISÃO E INTERVALO INTRAJORNADA",null,{"$f":"SUM(F77:F78)","v":{"$error":"#DIV/0!"}}]
[]
[null,"MÓDULO 5 - INSUMOS DIVERSOS",null,null,null,"Valor"]
[null,null,"A","Uniformes - aquisição",null,{"$f":"ROUND(HLOOKUP($B$12,Uniformes!K3:DZ33,3)/12,2)","v":0}]
[null,null,"B","Materiais de consumo relacionados ao posto - aquisição",null,{"$f":"ROUND(HLOOKUP(B12,'Mat Cons'!I11:DX13,3)/12,2)","v":0}]
[null,null,"C","Materiais permanentes relacionados ao posto - remuneração da sua depreciação / manutenção",null,{"$f":"HLOOKUP(B12,'Mat Perm'!Q11:EF13,3)","v":0}]
[null,null,"D","Equipamentos relacionados ao posto - remuneração da sua depreciação / manutenção",null,{"$f":"HLOOKUP(B12,'Equip Rel'!Q11:EF13,3)","v":0}]
[null,null,"E","Equipamentos de Proteção Individual - EPI - aquisição",null,{"$f":"ROUND(HLOOKUP(B12,EPI!I3:DX67,3)/12,2)","v":0}]
[]
[null,null,null,"TOTAL DE INSUMOS DIVERSOS",null,{"$f":"SUM(F83:F88)","v":0},null,"* Nota - Valores mensais por empregado"]
[]
[null,"MÓDULO 6 - CUSTOS INDIRETOS, TRIBUTOS E LUCRO - BDI",null,null,"Percentuais","Valor"]
[null,null,"A","Custos Indiretos",{"$f":"BDI!E6","v":4.4400000000000002E-2}]
[null,null,"A.1","Administração Central",{"$f":"BDI!E7","v":3.9E-2}]
[null,null,"A.2","Seguros, Garantias e Riscos",{"$f":"BDI!E8","v":5.4000000000000003E-3}]
[null,null,"B","Lucro",{"$f":"BDI!E10","v":0.06}]
[null,null,"C","Tributos",{"$f":"SUM(E97:E98)","v":0.124}]
[null,null,"C.1","Tributos Federais (COFINS, PIS e CPRB)",{"$f":"BDI!E18","v":7.3999999999999996E-2}]
[null,null,"C.2","Tributos Distritais (ISS)",{"$f":"BDI!E23","v":0.05},null,null,"* Nota - Utilizou-se o indicado pelo Sindicato da Arquitetura e da Engenharia (Sinaenco, 2008, p. 22), que adota um percentual redutor de 20% no cálculo dos custos tributários relativos às contribuições PIS e COFINS"]
[null,null,"D","Despesas Financeiras",{"$f":"BDI!E13","v":4.4669210982628549E-3}]
[]
[null,null,null,"TOTAL DE BDI",{"$f":"BDI!E26","v":0.26939999999999997},{"$f":"E101*E109","v":{"$error":"#DIV/0!"}}]
[]
[null,null,null,"QUADRO-RESUMO DO CUSTO MENSAL POR EMPREGADO - SEM O 13º","Valor"]
[null,null,null,"Módulo 1 - Composição da Remuneração",{"$f":"F23","v":{"$error":"#DIV/0!"}}]
[null,null,null,"Módulo 2 - Encargos e Benefícios Anuais, Mensais e Diários",{"$f":"F52","v":{"$error":"#DIV/0!"}}]
[null,null,null,"Módulo 3 - Provisão para Rescisão",{"$f":"F62","v":{"$error":"#DIV/0!"}}]
[null,null,null,"Módulo 4 - Custo de Reposição do Profissional Ausente",{"$f":"F80","v":{"$error":"#DIV/0!"}}]
[null,null,null,"Módulo 5 - Insumos Diversos",{"$f":"F89","v":0}]
[null,null,null,"SUBTOTAL (A+B+C+D+E)",{"$f":"SUM(E104:E108)","v":{"$error":"#DIV/0!"}}]
[null,null,null,"Módulo 6 - Custos Indiretos, Tributos e Lucro",{"$f":"F101","v":{"$error":"#DIV/0!"}}]
[]
[null,null,null,"TOTAL DO POSTO",{"$f":"SUM(E109:E110)","v":{"$error":"#DIV/0!"}}]
[]
[null,"MÓDULO 7 - DESTAQUE DO MÓDULO 2 - 13º SALÁRIO",null,null,"Percentuais","Valor"]
[null,null,"A","13º Salário",{"$f":"'Encargos Sociais'!E31","v":8.3333333333333329E-2},{"$f":"ROUND(E115*F$23,2)","v":{"$error":"#DIV/0!"}}]
[null,null,"B","Encargos Sociais sobre o 13º Salário - Taxa calculada no SUBMÓDULO 2.2",{"$f":"SUM($E$31:$E$39)","v":0.35800000000000004},{"$f":"ROUND(E116*$F$115,2)","v":{"$error":"#DIV/0!"}},null,"* Nota 1 - Provisiona-se, mensalmente, o proporcional a 1/12 dos valores referentes a gratificação natalina e adicional de férias."]
[null,null,"C","BDI sobre o 13º Salário - Taxa calculada no MÓDULO 6",{"$f":"E101","v":0.26939999999999997},{"$f":"ROUND(E117*($F$115+$F$116),2)","v":{"$error":"#DIV/0!"}}]
[]
[null,null,null,"TOTAL DO DESTAQUE DO 13º SALÁRIO",null,{"$f":"SUM(F115:F117)","v":{"$error":"#DIV/0!"}}]
[]
[null,null,null,"QUADRO-RESUMO DO CUSTO MENSAL POR EMPREGADO","Valor"]
[null,null,null,"Custo total - sem o 13º Salário",{"$f":"E112","v":{"$error":"#DIV/0!"}}]
[null,null,null,"Destaque do 13º Salário (valor mensal)",{"$f":"F119","v":{"$error":"#DIV/0!"}}]
[]
[null,null,null,"TOTAL DO POSTO",{"$f":"E122+E123","v":{"$error":"#DIV/0!"}}]

{"sheet":"12","index":15,"n_rows":125,"n_cols":8,"rows_kept":125,"cut":false,"hidden":true,"merged":[[14,1,14,3],[6,3,6,5],[8,1,8,5],[9,1,9,5],[11,1,11,2],[12,1,12,2],[90,1,90,3],[113,1,113,3],[24,1,24,3],[46,3,46,5],[53,1,53,3],[63,1,63,3],[75,3,75,5],[81,1,81,3]]}
[null,null,"CÂMARA DOS DEPUTADOS"]
[null,null,"DEPARTAMENTO TÉCNICO"]
[null,null,"Coordenação de Planejamento e Gestão"]
[]
[null,null,"Data:",{"$f":"'Dados Gerais'!#REF!","v":{"$error":"#REF!"}}]
[null,null,"Processo:",{"$f":"'Dados Gerais'!#REF!","v":{"$error":"#REF!"}}]
[null,null,"Objeto:",{"$f":"'Dados Gerais'!#REF!","v":{"$error":"#REF!"}}]
[]
[null,"PLANILHA DE ESTIMATIVA DE CUSTOS"]
[null,"Padrão IN 05/2017 e IN 07/2018 - MPDG"]
[]
[null,12,null,{"$f":"HLOOKUP($B$12,'Dados Gerais'!$D$5:$BK$20,6)","v":0},"QUANTIDADE",{"$f":"HLOOKUP($B$12,'Dados Gerais'!$D$5:$BK$20,10)","v":0}]
[null,"CCT",null,{"$f":"HLOOKUP($B$12,'Dados Gerais'!$D$5:$BK$20,15)","v":0},"DATA-BASE",{"$f":"HLOOKUP($B$12,'Dados Gerais'!$D$5:$BK$20,16)","v":"00:00:00"}]
[]
[null,"MÓDULO 1 - COMPOSIÇÃO DA REMUNERAÇÃO",null,null,null,"Valor"]
[null,null,"A","Salário-Base",null,{"$f":"HLOOKUP($B$12,'Dados Gerais'!$D$5:$BK$20,8)","v":0}]
[null,null,"B","Adicional de Periculosidade",null,{"$f":"HLOOKUP($B$12,'Dados Gerais'!$D$5:$BK$37,25)","v":0}]
[null,null,"C","Adicional de Insalubridade",null,{"$f":"HLOOKUP($B$12,'Dados Gerais'!$D$5:$BK$37,31)","v":0}]
[null,null,"D","Adicional Noturno",null,{"$f":"HLOOKUP($B$12,'Dados Gerais'!$D$5:$BK$50,46)","v":{"$error":"#DIV/0!"}},null,"* Nota 1 - O Módulo 1 refere-se ao valor mensal devido ao empregado pela prestação do serviço no período de 12 meses."]
[null,null,"E","Adicional de Hora Extra",null,{"$f":"HLOOKUP($B$12,'Dados Gerais'!$D$5:$BK$67,63)","v":{"$error":"#DIV/0!"}},null,"* Nota 2 - O adicional de hora extra no feriado trabalhado foi suprimido pela Lei 13.467/17"]
[null,null,"F","Outros (especificar)",null,{"$f":"HLOOKUP($B$12,'Dados Gerais'!$D$5:$BK$59,33)","v":0},null,"* Nota 3 - ART. 7º, § 2º, DA LEI Nº 605/49.Sendo mensalista o obreiro, o adicional noturno pago de forma fixa já é considerado integrado para os efeitos do pagamento do repouso semanal remunerado, nos termos do art. 7º, § 2º, da Lei nº 605/49."]
[]
[null,null,null,"TOTAL DA REMUNERAÇÃO",null,{"$f":"SUM(F16:F21)","v":{"$error":"#DIV/0!"}}]
[]
[null,"MÓDULO 2 - ENCARGOS E BENEFÍCIOS ANUAIS, MENSAIS E DIÁRIOS",null,null,"Percentuais","Valor"]
[null,"Submódulo 2.1 - 13º Salário, Férias e Adicional de Férias"]
[null,null,"A","13º Salário - Calculado no Módulo 7 - Destacado",0,{"$f":"ROUND(E27*F$23,2)","v":{"$error":"#DIV/0!"}}]
[null,null,"B","Férias e Adicional de Férias",{"$f":"'Encargos Sociais'!E24+'Encargos Sociais'!E30","v":0.12121212121212122},{"$f":"ROUND(E28*F$23,2)","v":{"$error":"#DIV/0!"}},null,"* Nota 1 - Provisiona-se, mensalmente, o proporcional a 1/12 dos valores referentes a gratificação natalina, férias e adicional de férias."]
[null,null,null,null,null,null,null,"* Nota 2 - O adicional de férias contido no Submódulo 2.1 corresponde a 1/3 da remuneração que, por sua vez, é dividida por 12 contome Nota 1."]
[null,"Submódulo 2.2 - Encargos Previdenciários (GPS), Fundo de Garantia por Tempo de Serviço (FGTS) e Outras Contribuições"]
[null,null,"A","INSS (art. 22, inciso I, Lei nº 8.212/91)",{"$f":"'Encargos Sociais'!E13","v":0.2},{"$f":"ROUND(E31*($F$23+$F$48+$F$80),2)","v":{"$error":"#DIV/0!"}}]
[null,null,"B","Salário Educação (art. 3º, inciso I, Decreto nº 87.043/82)",{"$f":"'Encargos Sociais'!E14","v":2.5000000000000001E-2},{"$f":"ROUND(E32*($F$23+$F$48+$F$80),2)","v":{"$error":"#DIV/0!"}}]
[null,null,"C","SAT/RAT (art. 22, II, Lei 8.212/91 e Anexo V, Decreto 6.042/07) - Enquadramento 8211-3/00",{"$f":"'Encargos Sociais'!E15","v":0.01},{"$error":"#DIV/0!"}]
[null,null,"D","SESC ou SESI (art. 30, Lei nº 8.036/90 e art. 1º, Lei 8.154/90)",{"$f":"'Encargos Sociais'!E16","v":1.4999999999999999E-2},{"$error":"#DIV/0!"}]
[null,null,"E","SENAI ou SENAC (Decreto nº 2.318/86)",{"$f":"'Encargos Sociais'!E17","v":0.01},{"$error":"#DIV/0!"}]
[null,null,"F","SEBRAE (§ 3º, art. 8º, Lei 8.029/90, alterada pela Lei nº 8.154/90)",{"$f":"'Encargos Sociais'!E18","v":6.0000000000000001E-3},{"$error":"#DIV/0!"}]
[null,null,"G","INCRA (art. 1º, I, Decreto Lei 1.146/70 e Lei 7.787, de 30/06/89)",{"$f":"'Encargos Sociais'!E19","v":2E-3},{"$error":"#DIV/0!"},null,"* Nota 1 - Os percentuais dos encargos previdenciários, do FGTS e demais contribuições são estabelecidos por legislação vigente."]
[null,null,"H","FGTS (Lei Complementar nº 110/01 e art. 30, Lei nº 8.036/90)",{"$f":"'Encargos Sociais'!E20","v":0.08},{"$error":"#DIV/0!"},null,"* Nota 2 - O SAT, a depender do grau de risco do serviço, irá variar entre 1%, para risco leve, de 2%, para risco médio, e de 3% para risco grave."]
[null,null,"I","SECONCI (Convenções Coletivas de Trabalho da construção)",{"$f":"'Encargos Sociais'!E21","v":0.01},{"$error":"#DIV/0!"},null,"* Nota 3 - Os percentuais do Submódulo 2.2 incidem sobre o Módulo 1 e o Submódulo 2.1."]
[]
[null,"Submódulo 2.3 - Benefícios Mensais e Diários"]
[null,null,"A","Auxílio Transporte",null,{"$f":"HLOOKUP($B$12,'Dados Gerais'!$D$5:$BK$93,82)","v":0}]
[null,null,"B","Auxílio Alimentação",null,{"$f":"HLOOKUP($B$12,'Dados Gerais'!$D$5:$BK$93,89)","v":{"$error":"#NUM!"}}]
[null,null,"C","Assistência Médica e Familiar",null,{"$f":"HLOOKUP($B$12,'Dados Gerais'!$D$5:$BK$101,97)","v":185.84}]
[null,null,"D","Outros (Seguro de vida e auxílio funeral e auxílio odontológico)",null,{"$f":"HLOOKUP($B$12,'Dados Gerais'!$D$5:$BK$118,114)","v":0},null,"* Nota 1 - O valor informado deverá ser o custo real do benefício (descontado o valor eventualmente pago pelo empregado)."]
[null,null,null,null,null,null,null,"* Nota 2 - Observar a previsão dos benefícios contidos em Acordos, Convenções e Dissídios Coletivos de Trabalho e o disposto no art. 6º da IN 5/2017"]
[null,null,null,"QUADRO-RESUMO DO MÓDULO 2"]
[null,null,null,"2.1 - 13º Salário, Férias e Adicional de Férias - 13º Destacado - Calculado no Módulo 7 ",{"$f":"SUM(E27:E28)","v":0.12121212121212122},{"$f":"F27+F28","v":{"$error":"#DIV/0!"}}]
[null,null,null,"2.2 - Encargos Previdenciários (GPS), Fundo de Garantia por Tempo de Serviço (FGTS) e Contribuições",{"$f":"SUM(E31:E39)","v":0.35800000000000004},{"$f":"SUM(F31:F39)","v":{"$error":"#DIV/0!"}}]
[null,null,null,"2.3 - Benefícios Mensais e Diários",null,{"$f":"SUM(F42:F45)","v":{"$error":"#NUM!"}}]
[]
[null,null,null,"TOTAL DOS ENCARGOS E BENEFÍCIOS",null,{"$f":"SUM(F48:F50)","v":{"$error":"#DIV/0!"}}]
[]
[null,"MÓDULO 3 - PREVISÃO PARA RESCISÃO",null,null,"Percentuais","Valor"]
[null,null,"A","Aviso Prévio Indenizado (Art. 7º, inciso XXI, da CF/1988 e arts. 477, 487, §1º, e 491 da CLT)",{"$f":"'Encargos Sociais'!E35","v":8.3333333333333332E-3},{"$f":"ROUND(E55*$F$23,2)","v":{"$error":"#DIV/0!"}}]
[null,null,"B","Incidência do FGTS sobre o Aviso Prévio Indenizado (Súmula 305 TST)",{"$f":"'Encargos Sociais'!E36","v":6.6666666666666664E-4},{"$error":"#DIV/0!"},null,"* Nota 1 - Adotou-se os parâmetros do estudo do STF (http://www.stf.jus.br/arquivo/cms/sobrestfestudosci/anexo/encargos_sociais_03102007.pdf), onde 5% do pessoal é demitido pelo empregador no decurso do contrato (para estes, considerou-se o aviso prévio indenizado). Desprezou-se as demissões por justa causa e os pedidos de demissão."]
[null,null,"C","Multa do FGTS e Contribuição Social sobre o Aviso Prévio Indenizado (Art. 18, §1º, da Lei 8.036/1990 e art. 1º da LC nº 110/2001)",{"$f":"'Encargos Sociais'!E37","v":1.274074074074074E-3},{"$error":"#DIV/0!"},null,"* Nota 2 - No cálculo do percentual, considerou-se 36 dias, correspondendo à metade da duração média dos contratos (2 anos)"]
[null,null,"D","Aviso Prévio Trabalhado (Art. 488, parágrafo único, CLT)",{"$f":"'Encargos Sociais'!E38","v":1.2037037037037035E-2},{"$error":"#DIV/0!"},null,"* Nota 3 - Incide sobre a Remuneração + 13º salário (1/12) + Férias (1/12) + Adicional de Férias (1/36) x 50% multa (40% para o empregado e 10% de contribuição social) x 8% FGTS"]
[null,null,"E","Incidência de GPS, FGTS e outras contribuições sobre o Aviso Prévio Trabalhado",{"$f":"'Encargos Sociais'!E39","v":4.3092592592592583E-3},{"$error":"#DIV/0!"},null,"* Nota 4 - Os 95% restantes do cálculo, a um prazo médio de contrato de 4 anos. Assim, calcula-se 7 dias para o 1º ano de contrato e mais 3 dias para os 3 anos seguintes."]
[null,null,"F","Multa do FGTS e Contribuição Social sobre o Aviso Prévio Trabalhado",{"$f":"'Encargos Sociais'!E40","v":3.0505155555555549E-2},{"$error":"#DIV/0!"}]
[]
[null,null,null,"TOTAL DE PREVISÃO PARA RESCISÃO",null,{"$f":"SUM(F55:F60)","v":{"$error":"#DIV/0!"}}]
[]
[null,"MÓDULO 4 - CUSTO DE REPOSIÇÃO DO PROFISSIONAL AUSENTE",null,null,"Percentuais","Valor"]
[null,"Submódulo 4.1 - Ausências Legais"]
[null,null,"A","Férias (Arts. 129 e 130, inc. I, da CLT) - Calculado no Submódulo 2.1",0,{"$f":"ROUND(E66*$F$23,2)","v":{"$error":"#DIV/0!"}},null,"* Nota 1 - As alíneas “A” a “F” referem-se somente ao custo que será pago ao repositor pelos dias \ntrabalhados quando da necessidade de substituir a mão de obra alocada na prestação do serviço."]
[null,null,"B","Ausências Legais (Arts. 131 e 473 da CLT)",{"$f":"'Encargos Sociais'!E25","v":7.9365079365079361E-3},{"$error":"#DIV/0!"},null,"* Nota 2 - Adotou-se a estimativa do SINAPI de 2 dias por ano."]
[null,null,"C","Licença-Paternidade (Art. 7º, XIX, e art. 10, §1º, do ADCT, CF/1988 e Art. 1º, II, da Lei 11.770/2008)",{"$f":"'Encargos Sociais'!E26","v":8.2777777777777776E-4},{"$error":"#DIV/0!"},null,"* Nota 3 - Utilizada a proporção de 50% para homens, 5 dias de afastamento, e a probabilidade de um trabalhador requerer a Licença Paternidade em 5,22%, conforme SINAPI (citando dados da PNAD 2015)"]
[null,null,"D","Ausência por Acidente de Trabalho (Art. 131, III, da CLT)",{"$f":"'Encargos Sociais'!E27","v":8.541666666666667E-4},{"$error":"#DIV/0!"},null,"* Nota 4 - Utilzada a estatística de 1,96% dos contribuintes beneficiados com a emissão do auxílio, conforme Anuário Estatístico da Previdência Social. Afastamento de 15 dias a cargo da empresa."]
[null,null,"E","Afastamento Maternidade (Art. 71 da Lei nº 8.213/1991)",{"$f":"'Encargos Sociais'!E28","v":3.2925925925925922E-3},{"$error":"#DIV/0!"},null,"* Nota 5 - Utilizada a proporção de 50% para mulheres, 180 dias de afastamento, e a probabilidade de uma trabalhadora requerer a Licença Maternidade em 4,91%, conforme SINAPI (citando dados do IBGE 2016)"]
[null,null,"F","Auxílio Enfermidade - Doença (Art. 59 da Lei nº 8.213/1991)",{"$f":"'Encargos Sociais'!E29","v":7.1222222222222225E-3},{"$error":"#DIV/0!"},null,"* Nota 6 - Utilizada a estatística de 3,37% dos contribuintes beneficiados com o auxílio, conforme Anuário Estatístico da Previdência Social de 2015 (acrescidos de 2 dias ao ano, para os quais o trabalhador nem requer o benefício da Previdência - conforme SINAPI)"]
[]
[null,"Submódulo 4.2 - Intrajornada"]
[null,null,"A","Intervalo para repouso ou alimentação",{"$f":"'Encargos Sociais'!E32","v":0},{"$f":"ROUND(E74*$F$23,2)","v":{"$error":"#DIV/0!"}}]
[]
[null,null,null,"QUADRO-RESUMO DO MÓDULO 4",null,"Valor"]
[null,null,null,"4.1 - Ausências Legais",{"$f":"SUM(E66:E71)","v":2.0033267195767195E-2},{"$f":"ROUND(E77*$F$23,2)","v":{"$error":"#DIV/0!"}}]
[null,null,null,"4.2 - Intrajornada",{"$f":"E74","v":0},{"$f":"ROUND(E78*$F$23,2)","v":{"$error":"#DIV/0!"}}]
[]
[null,null,null,"TOTAL DE PREVISÃO PARA RESCISÃO E INTERVALO INTRAJORNADA",null,{"$f":"SUM(F77:F78)","v":{"$error":"#DIV/0!"}}]
[]
[null,"MÓDULO 5 - INSUMOS DIVERSOS",null,null,null,"Valor"]
[null,null,"A","Uniformes - aquisição",null,{"$f":"ROUND(HLOOKUP($B$12,Uniformes!K3:DZ33,3)/12,2)","v":0}]
[null,null,"B","Materiais de consumo relacionados ao posto - aquisição",null,{"$f":"ROUND(HLOOKUP(B12,'Mat Cons'!I11:DX13,3)/12,2)","v":0}]
[null,null,"C","Materiais permanentes relacionados ao posto - remuneração da sua depreciação / manutenção",null,{"$f":"HLOOKUP(B12,'Mat Perm'!Q11:EF13,3)","v":0}]
[null,null,"D","Equipamentos relacionados ao posto - remuneração da sua depreciação / manutenção",null,{"$f":"HLOOKUP(B12,'Equip Rel'!Q11:EF13,3)","v":0}]
[null,null,"E","Equipamentos de Proteção Individual - EPI - aquisição",null,{"$f":"ROUND(HLOOKUP(B12,EPI!I3:DX67,3)/12,2)","v":0}]
[]
[null,null,null,"TOTAL DE INSUMOS DIVERSOS",null,{"$f":"SUM(F83:F88)","v":0},null,"* Nota - Valores mensais por empregado"]
[]
[null,"MÓDULO 6 - CUSTOS INDIRETOS, TRIBUTOS E LUCRO - BDI",null,null,"Percentuais","Valor"]
[null,null,"A","Custos Indiretos",{"$f":"BDI!E6","v":4.4400000000000002E-2}]
[null,null,"A.1","Administração Central",{"$f":"BDI!E7","v":3.9E-2}]
[null,null,"A.2","Seguros, Garantias e Riscos",{"$f":"BDI!E8","v":5.4000000000000003E-3}]
[null,null,"B","Lucro",{"$f":"BDI!E10","v":0.06}]
[null,null,"C","Tributos",{"$f":"SUM(E97:E98)","v":0.124}]
[null,null,"C.1","Tributos Federais (COFINS, PIS e CPRB)",{"$f":"BDI!E18","v":7.3999999999999996E-2}]
[null,null,"C.2","Tributos Distritais (ISS)",{"$f":"BDI!E23","v":0.05},null,null,"* Nota - Utilizou-se o indicado pelo Sindicato da Arquitetura e da Engenharia (Sinaenco, 2008, p. 22), que adota um percentual redutor de 20% no cálculo dos custos tributários relativos às contribuições PIS e COFINS"]
[null,null,"D","Despesas Financeiras",{"$f":"BDI!E13","v":4.4669210982628549E-3}]
[]
[null,null,null,"TOTAL DE BDI",{"$f":"BDI!E26","v":0.26939999999999997},{"$f":"E101*E109","v":{"$error":"#DIV/0!"}}]
[]
[null,null,null,"QUADRO-RESUMO DO CUSTO MENSAL POR EMPREGADO - SEM O 13º","Valor"]
[null,null,null,"Módulo 1 - Composição da Remuneração",{"$f":"F23","v":{"$error":"#DIV/0!"}}]
[null,null,null,"Módulo 2 - Encargos e Benefícios Anuais, Mensais e Diários",{"$f":"F52","v":{"$error":"#DIV/0!"}}]
[null,null,null,"Módulo 3 - Provisão para Rescisão",{"$f":"F62","v":{"$error":"#DIV/0!"}}]
[null,null,null,"Módulo 4 - Custo de Reposição do Profissional Ausente",{"$f":"F80","v":{"$error":"#DIV/0!"}}]
[null,null,null,"Módulo 5 - Insumos Diversos",{"$f":"F89","v":0}]
[null,null,null,"SUBTOTAL (A+B+C+D+E)",{"$f":"SUM(E104:E108)","v":{"$error":"#DIV/0!"}}]
[null,null,null,"Módulo 6 - Custos Indiretos, Tributos e Lucro",{"$f":"F101","v":{"$error":"#DIV/0!"}}]
[]
[null,null,null,"TOTAL DO POSTO",{"$f":"SUM(E109:E110)","v":{"$error":"#DIV/0!"}}]
[]
[null,"MÓDULO 7 - DESTAQUE DO MÓDULO 2 - 13º SALÁRIO",null,null,"Percentuais","Valor"]
[null,null,"A","13º Salário",{"$f":"'Encargos Sociais'!E31","v":8.3333333333333329E-2},{"$f":"ROUND(E115*F$23,2)","v":{"$error":"#DIV/0!"}}]
[null,null,"B","Encargos Sociais sobre o 13º Salário - Taxa calculada no SUBMÓDULO 2.2",{"$f":"SUM($E$31:$E$39)","v":0.35800000000000004},{"$f":"ROUND(E116*$F$115,2)","v":{"$error":"#DIV/0!"}},null,"* Nota 1 - Provisiona-se, mensalmente, o proporcional a 1/12 dos valores referentes a gratificação natalina e adicional de férias."]
[null,null,"C","BDI sobre o 13º Salário - Taxa calculada no MÓDULO 6",{"$f":"E101","v":0.26939999999999997},{"$f":"ROUND(E117*($F$115+$F$116),2)","v":{"$error":"#DIV/0!"}}]
[]
[null,null,null,"TOTAL DO DESTAQUE DO 13º SALÁRIO",null,{"$f":"SUM(F115:F117)","v":{"$error":"#DIV/0!"}}]
[]
[null,null,null,"QUADRO-RESUMO DO CUSTO MENSAL POR EMPREGADO","Valor"]
[null,null,null,"Custo total - sem o 13º Salário",{"$f":"E112","v":{"$error":"#DIV/0!"}}]
[null,null,null,"Destaque do 13º Salário (valor mensal)",{"$f":"F119","v":{"$error":"#DIV/0!"}}]
[]
[null,null,null,"TOTAL DO POSTO",{"$f":"E122+E123","v":{"$error":"#DIV/0!"}}]

{"sheet":"Dados Gerais","index":16,"n_rows":118,"n_cols":63,"rows_kept":118,"cut":false,"hidden":false,"merged":[[2,1,2,2]]}
[]
[]
[null,"INFORMAÇÕES DE ENTRADA"]
[]
[null,null,null,1,2,3,4,5,6,7,8,9,10,11,12,13,14,15,16,17,18,19,20,21,22,23,24,25,26,27,28,29,30,31,32,33,34,35,36,37,38,39,40,41,42,43,44,45,46,47,48,49,50,51,52,53,54,55,56,57,58,59,60]
[null,"",null,"CARGO 1","CARGO 2","CARGO 3","CARGO 4","CARGO 5","CARGO 6","CARGO 7","CARGO 8","CARGO 9","CARGO 10","CARGO 11","CARGO 12","CARGO 13","CARGO 14","CARGO 15","CARGO 16","CARGO 17","CARGO 18","CARGO 19","CARGO 20","CARGO 21","CARGO 22","CARGO 23","CARGO 24","CARGO 25","CARGO 26","CARGO 27","CARGO 28","CARGO 29","CARGO 30","CARGO 31","CARGO 32","CARGO 33","CARGO 34","CARGO 35","CARGO 36","CARGO 37","CARGO 38","CARGO 39","CARGO 40","CARGO 41","CARGO 42","CARGO 43","CARGO 44","CARGO 45","CARGO 46","CARGO 47","CARGO 48","CARGO 49","CARGO 50","CARGO 51","CARGO 52","CARGO 53","CARGO 54","CARGO 55","CARGO 56","CARGO 57","CARGO 58","CARGO 59","CARGO 60"]
[null,"INFORMAÇÕES BÁSICAS"]
[]
[null,"DESCRIÇÃO DOS POSTOS DE SERVIÇO"]
[null,null,null,"BOMBEIRO HIDRÁULICO DE MANUTENÇÃO","ENCARREGADO DE INSTALAÇÕES","TÉCNICO EM ELETRÔNICA (DETECÇÃO, ALARME E COMBATE A INCÊNCIO)","TÉCNICO EM ELETROTÉCNICA (QUADROS DE COMANDO E AUTOMAÇÃO)","OPERADOR DE CENTRAL DE DETECÇÃO E ALARME DE INCÊNDIO","OPERADOR DE CENTRAL DE DETECÇÃO E ALARME DE INCÊNDIO (COM ADICIONAL NOTURNO)"]
[null,"REMUNERAÇÕES"]
[null,null,null,2176.5817327117325,3527.9232628091827,2899.8948731090973,3004.8634828574245,2333.4075053418801,2333.4075053418801]
[null,"QUANTIDADE DE POSTOS"]
[null,null,null,1,1,1,1,4,4]
[null,"JORNADA"]
[null,null,"HORAS",220,220,220,220,180,180]
[null,null,"DIAS/MÊS",22,22,22,22,15,15]
[null,"CCT UTILIZADA"]
[null,null,"SINDICATOS E REFERÊNCIA","CCT STICOMBE/DF x SINDUSCON/DF 2021/2023","CCT STICOMBE/DF x SINDUSCON/DF 2021/2023","CCT STICOMBE/DF x SINDUSCON/DF 2021/2023","CCT STICOMBE/DF x SINDUSCON/DF 2021/2023","CCT STICOMBE/DF x SINDUSCON/DF 2021/2023","CCT STICOMBE/DF x SINDUSCON/DF 2021/2023"]
[null,null,"DATA-BASE","2021-05-01","2021-05-01","2021-05-01","2021-05-01","2021-05-01","2021-05-01"]
[]
[null,"ADICIONAIS LEGAIS E GRATIFICAÇÕES"]
[]
[null,"PERICULOSIDADE (PERCENTUAL)"]
[null,null,null,0,0,0,0,0,0]
[null,"BASE DE CÁLCULO DO ADICIONAL DE PERICULOSIDADE (SALÁRIO BÁSICO)"]
[null,null,null,{"$f":"D12","v":2176.5817327117325},{"$f":"E12","v":3527.9232628091827},{"$f":"F12","v":2899.8948731090973},2386.75,2386.75,2386.75,{"$f":"J12","v":0},{"$f":"K12","v":0},0,0,0,0]
[null,"VALOR MENSAL DO ADICIONAL DE PERICULOSIDADE"]
[null,null,null,{"$f":"ROUND(D25*D12,2)","v":0},{"$f":"ROUND(E25*E12,2)","v":0},{"$f":"ROUND(F25*F12,2)","v":0},0,0,0,{"$f":"ROUND(J25*J12,2)","v":0},{"$f":"ROUND(K25*K12,2)","v":0},0,0,0,0]
[null,"INSALUBRIDADE (PERCENTUAL)"]
[null,null,null,0,0,0,0,0,0]
[null,"BASE DE CÁLCULO DO ADICIONAL DE INSALUBRIDADE (SALÁRIO MÍNIMO LEGAL)"]
[null,null,null,1100,1100,1100,1100,1100,1100]
[null,"VALOR MENSAL DO ADICIONAL DE INSALUBRIDADE"]
[null,null,null,{"$f":"ROUND(D31*D12,2)","v":0},{"$f":"ROUND(E31*E12,2)","v":0},{"$f":"ROUND(F31*F12,2)","v":0},0,0,0,{"$f":"ROUND(J31*J12,2)","v":0},0,0,0,0,0]
[null,"GRATIFICAÇÃO - VALOR MENSAL (R$)"]
[null,null,null,0,0,0,0,0,0,0,0,0,0,0,0]
[]
[null,"ADICIONAL NOTURNO"]
[]
[null,"INCIDÊNCIA (PERCENTUAL)"]
[null,null,null,0.2,0.2,0.2,0.2,0.2,0.2]
[null,"HORAS REAIS POR DIA"]
[null,null,null,0,0,0,0,0,7]
[null,"HORAS FICTAS POR DIA"]
[null,null,null,{"$f":"D44*8/8","v":0},{"$f":"E44*8/8","v":0},{"$f":"F44*8/8","v":0},{"$f":"G44*8/8","v":0},0,{"$f":"I44*8/8","v":7},0,{"$f":"K44*8/8","v":0},0,0,0,0]
[null,"BASE DE CÁLCULO DO ADICIONAL NOTURNO (INCLUINDO ADICIONAIS E GRATIFICAÇÕES)"]
[null,null,null,{"$f":"D12+D29+D35+D37","v":2176.5817327117325},3527.9232628091827,{"$f":"F12+F29+F35+F37","v":2899.8948731090973},{"$f":"G12+G29+G35+G37","v":3004.8634828574245},2333.4075053418801,2333.4075053418801,0,{"$f":"K12+K29+K35+K37","v":0},0,0,0,{"$f":"O12+O29+O35+O37","v":0}]
[null,"VALOR MENSAL DO ADICIONAL NOTURNO (HORA NORMAL + HORA REDUZIDA) - POR POSTO"]
[null,null,null,{"$f":"ROUND(D48/D16*D42*D46*D17,2)","v":0},0,0,0,0,{"$f":"ROUND(I48/I16*I42*I46*I17,2)","v":272.23},{"$f":"ROUND(J46*J17*J42*J48/J16,2)","v":{"$error":"#DIV/0!"}},{"$f":"ROUND(K46*K17*K42*K48/K16,2)","v":{"$error":"#DIV/0!"}},{"$error":"#DIV/0!"},{"$error":"#DIV/0!"},{"$error":"#DIV/0!"},{"$f":"ROUND(O46*O17*O42*O48/O16,2)","v":{"$error":"#DIV/0!"}}]
[]
[null,"ADICIONAL DE HORA EXTRA"]
[]
[null,"INCIDÊNCIA (PERCENTUAL 1)"]
[null,null,"100% trabalho realizado em feriados CCT cláusula 33ª",0.5,0.5,0.5,0.5,0.5,0.5]
[null,"HORAS EXTRAS POR MÊS (PERCENTUAL 1)"]
[null,null,null,0,0,0,0,0,0]
[null,"VALOR MENSAL DO ADICIONAL DE HORAS EXTRAS (PERCENTUAL 1) - POR POSTO"]
[null,null,null,{"$f":"ROUND(D57*D55*D12/D16,2)","v":0},{"$f":"ROUND(E57*E55*E12/E16,2)","v":0},{"$f":"ROUND(F57*F55*F12/F16,2)","v":0},0,0,0,{"$f":"ROUND(J57*J55*J12/J16,2)","v":{"$error":"#DIV/0!"}},{"$f":"ROUND(K57*K55*K12/K16,2)","v":{"$error":"#DIV/0!"}},{"$error":"#DIV/0!"},{"$error":"#DIV/0!"},{"$error":"#DIV/0!"},{"$error":"#DIV/0!"}]
[null,"INCIDÊNCIA (PERCENTUAL 2)"]
[null,null,null,1,1,1,1,1,1]
[null,"HORAS EXTRAS POR MÊS (PERCENTUAL 2)"]
[null,null,null,0,0,0,0,{"$f":"12/12*12","v":12},{"$f":"12/12*12","v":12}]
[null,"VALOR MENSAL DO ADICIONAL DE HORAS EXTRAS (PERCENTUAL 2) - POR POSTO"]
[null,null,null,{"$f":"ROUND(D63*D61*D12/D16,2)","v":0},{"$f":"ROUND(E63*E61*E12/E16,2)","v":0},{"$f":"ROUND(F63*F61*F12/F16,2)","v":0},0,0,0,{"$f":"ROUND(J63*J61*J12/J16,2)","v":{"$error":"#DIV/0!"}},{"$f":"ROUND(K63*K61*K12/K16,2)","v":{"$error":"#DIV/0!"}},{"$error":"#DIV/0!"},{"$error":"#DIV/0!"},{"$error":"#DIV/0!"},{"$error":"#DIV/0!"}]
[null,"TOTAL MENSAL DOS ADICIONAIS DE HORAS EXTRAS - POR POSTO"]
[null,null,null,{"$f":"D65+D59","v":0},{"$f":"E65+E59","v":0},{"$f":"F65+F59","v":0},0,{"$f":"H12/H16*H63*H61","v":155.56050035612535},{"$f":"I12/I16*I63*I61","v":155.56050035612535},{"$f":"J65+J59","v":{"$error":"#DIV/0!"}},{"$f":"K65+K59","v":{"$error":"#DIV/0!"}},{"$error":"#DIV/0!"},{"$error":"#DIV/0!"},{"$error":"#DIV/0!"},{"$error":"#DIV/0!"}]
[]
[null,"BENEFÍCIOS COMUNS - AUXÍLIO TRANSPORTE"]
[]
[null,"DISTRIBUIÇÃO ESTIMADA DE PROCEDÊNCIA"]
[null,null,"Cidade-satélite",0.68,0.68,0.68,0.68,0.68,0.68]
[null,null,"Região do entorno",0.32,0.32,0.32,0.32,0.32,0.32]
[null,null,"Esplanada - apenas para os que vêm do entorno",{"$f":"D73","v":0.32},{"$f":"E73","v":0.32},{"$f":"F73","v":0.32},{"$f":"G73","v":0.32},0.32,{"$f":"I73","v":0.32}]
[null,"VALORES DOS VALES"]
[null,null,"Cidade-satélite",5.5,5.5,5.5,{"$f":"D76","v":5.5},5.5,5.5]
[null,null,"Região do entorno",7.05,7.05,7.05,7.05,7.05,7.05]
[null,null,"Esplanada",2.75,2.75,2.75,2.75,2.75,2.75]
[null,"VALOR MENSAL BRUTO DE PAGAMENTO - POR POSTO"]
[null,null,null,{"$f":"ROUND((D72*D76+D73*D77+D74*D78)*2*D17,2)","v":302.54000000000002},{"$f":"ROUND((E72*E76+E73*E77+E74*E78)*2*E17,2)","v":302.54000000000002},{"$f":"ROUND((F72*F76+F73*F77+F74*F78)*2*F17,2)","v":302.54000000000002},{"$f":"ROUND((G72*G76+G73*G77+G74*G78)*2*G17,2)","v":302.54000000000002},206.28,{"$f":"ROUND((I72*I76+I73*I77+I74*I78)*2*I17,2)","v":206.28},{"$f":"ROUND((J72*J76+J73*J77+J74*J78)*2*J17,2)","v":0},{"$f":"ROUND((K72*K76+K73*K77+K74*K78)*2*K17,2)","v":0},0,0,0,0]
[null,"PERCENTUAL DE DESCONTO"]
[null,null,null,0,0,0,0,0,0]
[null,"VALOR MENSAL DO DESCONTO - POR POSTO"]
[null,null,null,{"$f":"ROUND(D82*D12,2)","v":0},0,{"$f":"ROUND(F82*F12,2)","v":0},{"$f":"ROUND(G82*G12,2)","v":0},0,0,0,{"$f":"ROUND(K82*K12,2)","v":0},0,0,0,0]
[null,"VALOR MENSAL LÍQUIDO DO VALE TRANSPORTE - POR POSTO"]
[null,null,null,{"$f":"IF(D80>D84,D80-D84,0)","v":302.54000000000002},302.54000000000002,{"$f":"IF(F80>F84,F80-F84,0)","v":302.54000000000002},{"$f":"IF(G80>G84,G80-G84,0)","v":302.54000000000002},206.28,206.28,0,{"$f":"IF(K80>K84,K80-K84,0)","v":0},0,0,0,{"$f":"IF(O80>O84,O80-O84,0)","v":0}]
[null,null,null,{"$f":"D86*D14","v":302.54000000000002},{"$f":"E86*E14","v":302.54000000000002},{"$f":"F86*F14","v":302.54000000000002},2962.54,2962.54,2962.54,{"$f":"J86*J14","v":0},{"$f":"K86*K14","v":0},{"$f":"L86*L14","v":0},{"$f":"M86*M14","v":0}]
[null,"BENEFÍCIOS COMUNS - AUXÍLIO ALIMENTAÇÃO"]
[]
[null,null,"VALOR CCT",{"$f":"18.31+4.21","v":22.52},{"$f":"18.31+4.21","v":22.52},22.52,22.52,22.52,22.52]
[null,null,"VALOR CD",24.31,24.31,24.31,24.31,24.31,24.31]
[null,"VALOR MENSAL DO AUXÍLIO ALIMENTAÇÃO - POR POSTO"]
[null,null,null,{"$f":"ROUND(LARGE(D90:D91,1)*D17,2)","v":534.82000000000005},{"$f":"ROUND(LARGE(E90:E91,1)*E17,2)","v":534.82000000000005},{"$f":"ROUND(LARGE(F90:F91,1)*F17,2)","v":534.82000000000005},{"$f":"ROUND(LARGE(G90:G91,1)*G17,2)","v":534.82000000000005},364.65,{"$f":"ROUND(LARGE(I90:I91,1)*I17,2)","v":364.65},{"$error":"#NUM!"},{"$f":"ROUND(LARGE(K90:K91,1)*K17,2)","v":{"$error":"#NUM!"}},{"$error":"#NUM!"},{"$error":"#NUM!"},{"$error":"#NUM!"},{"$error":"#NUM!"}]
[null,null,null,{"$f":"D93*D14","v":534.82000000000005},{"$f":"E93*E14","v":534.82000000000005},{"$f":"F93*F14","v":534.82000000000005},10339.56,10339.56,10339.56,{"$f":"J93*J14","v":{"$error":"#NUM!"}},{"$f":"K93*K14","v":{"$error":"#NUM!"}},{"$f":"L93*L14","v":{"$error":"#NUM!"}},{"$f":"M93*M14","v":{"$error":"#NUM!"}}]
[null,"BENEFÍCIOS ESPECIAIS - ASSISTÊNCIA MÉDICA E FAMILIAR"]
[]
[null,null,"OBRIGAÇÃO DE PAGTO x % CONTR. PATRONAL","NÃO","NÃO","NÃO","NÃO","NÃO","NÃO","NÃO","SIM","SIM","SIM","SIM","SIM"]
[null,null,"VALOR CCT",0,0,0,0,0,0,0]
[null,null,"VALOR MERCADO",0,0,0,0,0,0,0,{"$f":"371.67*0.6","v":223.00200000000001},{"$f":"371.67*0.5","v":185.83500000000001},{"$f":"371.67*0.5","v":185.83500000000001},185.83500000000001,185.83500000000001]
[null,"VALOR MENSAL DO AUXÍLIO ESPECIAL - ASSISTÊNCIA MÉDICA E FAMILIAR - POR POSTO"]
[null,null,null,{"$f":"IF(D97=\"SIM\",ROUND(SMALL(D98:D99,1),2),0)","v":0},{"$f":"IF(E97=\"SIM\",ROUND(SMALL(E98:E99,1),2),0)","v":0},0,0,0,0,0,223,185.84,185.84,185.84,185.84]
[]
[null,"BENEFÍCIOS ESPECIAIS - SEGURO DE VIDA E AUXÍLIO-FUNERAL, AUX ODONT, AUX CRECHE"]
[]
[null,"SEGURO DE VIDA E AUXÍLIO FUNERAL"]
[null,null,"OBRIGAÇÃO DE PAGTO","SIM","SIM","SIM","SIM","SIM","SIM"]
[null,null,"VALOR CCT",0,0,0,0,0,0]
[null,null,"VALOR MERCADO",12.36,12.36,12.36,12.36,12.36,12.36]
[null,"VALOR MENSAL DO AUXÍLIO ESPECIAL - SEGURO DE VIDA E AUXÍLIO FUNERAL - POR POSTO"]
[null,null,null,{"$f":"IF(D106=\"SIM\",ROUND(SMALL(D107:D108,1),2),0)","v":0},{"$f":"IF(E106=\"SIM\",ROUND(SMALL(E107:E108,1),2),0)","v":0},{"$f":"IF(F106=\"SIM\",ROUND(SMALL(F107:F108,1),2),0)","v":0},{"$f":"IF(G106=\"SIM\",ROUND(SMALL(G107:G108,1),2),0)","v":0},0,0,0,{"$f":"IF(K106=\"SIM\",ROUND(SMALL(K107:K108,1),2),0)","v":0},0,0,0,{"$f":"IF(O106=\"SIM\",ROUND(SMALL(O107:O108,1),2),0)","v":0}]
[null,"AUXÍLIO ODONTOLÓGICO"]
[null,null,"OBRIGAÇÃO DE PAGTO","NÃO","NÃO","NÃO","NÃO","NÃO","NÃO","NÃO","NÃO","NÃO","NÃO","NÃO","NÃO"]
[null,null,"VALOR CCT",0,0,0,0,0,0,0,0,0,0,0,0]
[null,null,"VALOR MERCADO",0,0,0,0,0,0,0,0,0,0,0,0]
[null,"VALOR MENSAL DO AUXÍLIO ESPECIAL - SEGURO DE VIDA E AUX FUNERAL - POR POSTO"]
[null,null,null,{"$f":"IF(D112=\"SIM\",ROUND(SMALL(D113:D114,1),2)*D17,0)","v":0},{"$f":"IF(E112=\"SIM\",ROUND(SMALL(E113:E114,1),2)*E17,0)","v":0},{"$f":"IF(F112=\"SIM\",ROUND(SMALL(F113:F114,1),2)*F17,0)","v":0},0,0,0,{"$f":"IF(J112=\"SIM\",ROUND(SMALL(J113:J114,1),2)*J17,0)","v":0},{"$f":"IF(K112=\"SIM\",ROUND(SMALL(K113:K114,1),2)*K17,0)","v":0},0,0,0,0]
[null,"TOTAL MENSAL DOS AUXÍLIOS ESPECIAIS - POR POSTO"]
[null,null,null,{"$f":"D116+D110","v":0},0,{"$f":"F116+F110","v":0},{"$f":"G116+G110","v":0},0,{"$f":"I116+I110","v":0},0,{"$f":"K116+K110","v":0},0,0,0,{"$f":"O116+O110","v":0}]

{"sheet":"Encargos Sociais","index":17,"n_rows":45,"n_cols":7,"rows_kept":45,"cut":false,"hidden":false,"merged":[[1,1,1,3],[2,1,2,4]]}
[]
[]
[null,"ENCARGOS SOCIAIS SOBRE A MÃO DE OBRA"]
[null,null,null,null,"Percentuais"]
[]
[null,"Referência:"]
[null,null,"SINAPI OUT/2018"]
[]
[null,"Categorias:"]
[null,null,"TODAS"]
[]
[null,"GRUPO A: Encargos Sociais Básicos - Previdenciários (GPS), Fundo de Garantia por Tempo de Serviço (FGTS) e Outras Contribuições",null,null,{"$f":"ROUND(SUM(E13:E21),4)","v":0.35799999999999998}]
[null,null,"A","INSS (art. 22, inciso I, Lei nº 8.212/91)",0.2]
[null,null,"B","Salário Educação (art. 3º, inciso I, Decreto nº 87.043/82)",2.5000000000000001E-2]
[null,null,"C","SAT/RAT (art. 22, II, Lei 8.212/91 e Anexo V, Decreto 6.042/07) - Enquadramento 3314-7/10",0.01]
[null,null,"D","SESC ou SESI (art. 30, Lei nº 8.036/90 e art. 1º, Lei 8.154/90)",1.4999999999999999E-2]
[null,null,"E","SENAI ou SENAC (Decreto nº 2.318/86)",0.01]
[null,null,"F","SEBRAE (§ 3º, art. 8º, Lei 8.029/90, alterada pela Lei nº 8.154/90)",6.0000000000000001E-3,null,"* Nota 1 - Os percentuais dos encargos previdenciários, do FGTS e demais contribuições são estabelecidos por legislação vigente."]
[null,null,"G","INCRA (art. 1º, I, Decreto Lei 1.146/70 e Lei 7.787, de 30/06/89)",2E-3,null,"* Nota 2 - O SAT, a depender do grau de risco do serviço, irá variar entre 1%, para risco leve, de 2%, para risco médio, e de 3% para risco grave."]
[null,null,"H","FGTS (Lei Complementar nº 110/01 e art. 30, Lei nº 8.036/90)",0.08,null,"* Nota 3 - Os percentuais do Submódulo 2.2 incidem sobre o Módulo 1, o Submódulo 2.1, o Módulo 3, o Módulo 4 e o Módulo 6."]
[null,null,"I","SECONCI (Convenções Coletivas de Trabalho da construção)",0.01]
[]
[null,"GRUPO B: Encargos Sociais Relacionados ao Custo de Reposição do Profissional Ausente - Ausências Legais",null,null,{"$f":"ROUND(SUM(E24:E32),4)","v":0.22459999999999999}]
[null,null,"A","Férias (Arts. 129 e 130, inc. I, da CLT)",{"$f":"1/11","v":9.0909090909090912E-2},null,"* Nota 1 - As alíneas “A” a “F” referem-se somente ao custo que será pago ao repositor pelos dias \ntrabalhados quando da necessidade de substituir a mão de obra alocada na prestação do serviço."]
[null,null,"B","Ausências Legais (Arts. 131 e 473 da CLT)",{"$f":"2/252","v":7.9365079365079361E-3},null,"* Nota 2 - Adotou-se a estimativa do SINAPI de 2 dias por ano. Em 252 dias úteis por ano."]
[null,null,"C","Licença-Paternidade (Art. 7º, XIX, e art. 10, §1º, do ADCT, CF/1988 e Art. 1º, II, da Lei 11.770/2008)",{"$f":"(5/(30*12))*0.0596","v":8.2777777777777776E-4},null,"* Nota 3 - Utilizada a proporção de 50% para homens, 5 dias de afastamento, e a probabilidade de um trabalhador requerer a Licença Paternidade em 5,96%, conforme SINAPI (Anuário Estatístico da Previdência Social - 2017)"]
[null,null,"D","Ausência por Acidente de Trabalho (Art. 131, III, da CLT)",{"$f":"0.0205*15/360","v":8.541666666666667E-4},null,"* Nota 4 - Utilzada a estatística de 2,05% dos contribuintes beneficiados com a emissão do auxílio, conforme Anuário Estatístico da Previdência Social. Afastamento de 15 dias a cargo da empresa."]
[null,null,"E","Afastamento Maternidade (Art. 71 da Lei nº 8.213/1991)",{"$f":"0.0508*(120/360)*(30+30*4/3)/360","v":3.2925925925925922E-3},null,"* Nota 5 - Utilizada a estimativa de 120 dias de afastamento, e a probabilidade de uma trabalhadora requerer a Licença Maternidade em 5,08%, conforme SINAPI (citando dados do IBGE 2017) - A própria previdência paga o benefício pelos 120 dias, contudo o empregador arca com o 13º e com as férias"]
[null,null,"F","Auxílio Enfermidade - Doença (Art. 59 da Lei nº 8.213/1991)",{"$f":"((0.0376*15)+2)/360","v":7.1222222222222225E-3},null,"* Nota 6 - Utilizada a estatística de 3,76% dos contribuintes beneficiados com o auxílio, conforme Anuário Estatístico da Previdência Social de 2016 (acrescidos de 2 dias ao ano, para os quais o trabalhador nem requer o benefício da Previdência - conforme SINAPI)"]
[null,null,"G","Adicional de Férias (componente do Submódulo 2.1)",{"$f":"1/3*1/11","v":3.03030303030303E-2},null,"* Nota 7 - O adicional de férias contido no Submódulo 2.1 corresponde a 1/3 da remuneração que, por sua vez, é dividida por 12 contome Nota 1."]
[null,null,"H","13º Salário (destacado na planilha de custos)",{"$f":"1/12","v":8.3333333333333329E-2},null,"* Nota 8 - Provisiona-se, mensalmente, o proporcional a 1/12 dos valores referentes a gratificação natalina e adicional de férias."]
[null,null,"I","Intervalo para repouso ou alimentação (componente do Submódulo 4.2)",0]
[]
[null,"GRUPO C: Encargos Sociais Relacionados à Previsão para Rescisão Trabalhista",null,null,{"$f":"ROUND(SUM(E35:E40),4)","v":5.7099999999999998E-2}]
[null,null,"A","Aviso Prévio Indenizado (Art. 7º, inciso XXI, da CF/1988 e arts. 477, 487, §1º, e 491 da CLT)",{"$f":"0.1*30/360","v":8.3333333333333332E-3},null,"* Nota 1 - Considerou-se demissões de 10% por ano para substituições, a um prazo estimado de contrato de 3 anos. Aviso prévio - 1º ano 30 dias. Considerou-se os 10% demitidos sem justa causa e recebendo aviso indenizado."]
[null,null,"B","Incidência do FGTS sobre o Aviso Prévio Indenizado (Súmula 305 TST)",{"$f":"E20*E35","v":6.6666666666666664E-4},null,"* Nota 2 - No cálculo do percentual, considerou-se 36 dias, correspondendo à metade da duração média dos contratos (2 anos)"]
[null,null,"C","Multa do FGTS sobre o Aviso Prévio Indenizado (Art. 18, §1º, da Lei 8.036/1990)",{"$f":"(1+1/12+1/12+1/36)*0.4*E20*0.1/3","v":1.274074074074074E-3},null,"* Nota 3 - Incide sobre a Remuneração + 13º salário (1/12) + Férias (1/12) + Adicional de Férias (1/36) x 40% multa para o empregador x 8% FGTS x 10% do pessoal, uma vez a cada 3 anos"]
[null,null,"D","Aviso Prévio Trabalhado (Art. 488, parágrafo único, CLT)",{"$f":"((7+2*3)*100%/360)/3","v":1.2037037037037035E-2},null,"* Nota 3 - Considerou-se demissões de 100% ao final do contrato, com um prazo médio estimado de 3 anos. Assim, calcula-se 7 dias para o 1º ano de contrato e mais 3 dias para os 2 anos seguintes. Total 13 dias."]
[null,null,"E","Incidência de GPS, FGTS e outras contribuições sobre o Aviso Prévio Trabalhado",{"$f":"E38*E12","v":4.3092592592592583E-3}]
[null,null,"F","Multa do FGTS sobre o Aviso Prévio Trabalhado",{"$f":"(1+1/12+1/12+1/36)*0.4*E20*(1-0.2019)","v":3.0505155555555549E-2},null,"* Nota 4 - Incide sobre a Remuneração + 13º salário (1/12) + Férias (1/12) + Adicional de Férias (1/36) x 40% multa para o empregador x 8% FGTS"]
[]
[null,"GRUPO D: Reincidências",null,null,{"$f":"ROUND(SUM(E43:E43),4)","v":8.0399999999999999E-2}]
[null,null,"A","Reincidência do Grupo A sobre o Grupo B",{"$f":"E12*E23","v":8.04068E-2}]
[]
[null,null,null,"SOMATÓRIO - ENCARGOS SOCIAIS SOBRE A MÃO DE OBRA",{"$f":"E42+E34+E23+E12","v":0.72009999999999996}]

{"sheet":"BDI","index":18,"n_rows":26,"n_cols":7,"rows_kept":26,"cut":false,"hidden":false,"merged":[[1,1,1,3],[2,1,2,4]]}
[]
[]
[null,"COMPOSIÇÃO DA TAXA DE CUSTOS INDIRETOS, TRIBUTOS E LUCRO - BDI"]
[null,"APLICAÇÃO: MÃO DE OBRA, 13º, MATERIAIS, EPC E EQUIPAMENTO DE REGISTRO DE FREQUÊNCIA",null,null,"Percentuais"]
[]
[null,"Custos Indiretos da Contratada",null,null,{"$f":"SUM(E7:E8)","v":4.4400000000000002E-2}]
[null,null,"A","Administração Central",3.9E-2,null,"* Nota 1 - O Somatório da Administração Central com o Lucro deve ser inferior a 12%"]
[null,null,"B","Seguros, Garantias e Riscos",{"$f":"0.34%+0.2%","v":5.4000000000000003E-3},null,"* Nota 2 - O risco previsto para o porte do contrato majorado em mais 0,20% devido ao não pagamento dos insumos componentes do custo do posto quando da ausência do mesmo."]
[]
[null,"Lucro",null,null,{"$f":"SUM(E11:E11)","v":0.06}]
[null,null,"A","Lucro Real sobre os Custos Administrados",0.06]
[]
[null,"Despesas Financeiras",null,null,{"$f":"E14","v":4.4669210982628549E-3}]
[null,null,"A","Cálculo Baseado no Prazo para a Restituição dos Desembolsos Realizados pelo Contratado e na Taxa de Retorno Arbitrada",{"$f":"(1+E16)^(E15/252)-1","v":4.4669210982628549E-3},null,"* Nota 1 - DF = [(1+TR)^(DU/252)]/100"]
[null,null,"A.1","Dias Úteis Considerados",11,null,"* Nota 2 - Diferença de dias entre o desembolso, pelo contratado, e o pagamento, pela Câmara"]
[null,null,"A.2","Taxa de Retorno",0.1075,null,"* Nota 3 - A taxa sugerida é a meta da SELIC"]
[]
[null,"Impostos - Tributos Federais",null,null,{"$f":"SUM(E19:E21)","v":7.3999999999999996E-2}]
[null,null,"A","Contribuição para o Financiamento da Seguridade Social - COFINS",{"$f":"0.8*7.6%","v":6.08E-2},null,"* Nota 1 - Redução de 20% considerando as deduções permitidas em Lei, conforme SENGE, citado pelo TCU - Acórdão 2622/2013"]
[null,null,"B","Programa de Integração Social - PIS",{"$f":"0.8*1.65%","v":1.3200000000000002E-2},null,"* Nota 2 - Redução de 20% considerando as deduções permitidas em Lei, conforme SENGE, citado pelo TCU - Acórdão 2622/2013"]
[null,null,"C","Contribuição Previdenciária sobre a Receita Bruta - CPRB",0,null,"* Nota 3 - Lei 12.546/2011 - Verificar atualizações e setores beneficiados"]
[]
[null,"Impostos - Tributos Distritais",null,null,{"$f":"SUM(E24:E24)","v":0.05}]
[null,null,"A","Imposto sobre Serviço de Qualquer Natureza - ISS",0.05]
[]
[null,null,null,"SOMATÓRIO - TAXA DE CUSTOS INDIRETOS, TRIBUTOS E LUCRO - BDI",{"$f":"ROUND((((1+E6)*(1+E10)*(1+E13)/(1-E18-E23))-1),4)","v":0.26939999999999997},null,"* Nota 1 - [(1+AC+SGR)*(1+L)*(1+DF)/(1-CONFINS-PIS-CPRB-ISS)]-1"]

{"sheet":"Uniformes","index":19,"n_rows":37,"n_cols":130,"rows_kept":37,"cut":false,"hidden":false,"merged":[[1,1,1,3],[2,1,2,7]]}
[]
[]
[null,"UNIFORMES - AQUISIÇÃO",null,null,null,null,null,null,null,null,1,null,{"$f":"K3+1","v":2},null,{"$f":"M3+1","v":3},null,{"$f":"O3+1","v":4},null,{"$f":"Q3+1","v":5},null,{"$f":"S3+1","v":6},null,{"$f":"U3+1","v":7},null,{"$f":"W3+1","v":8},null,{"$f":"Y3+1","v":9},null,{"$f":"AA3+1","v":10},null,{"$f":"AC3+1","v":11},null,{"$f":"AE3+1","v":12},null,{"$f":"AG3+1","v":13},null,{"$f":"AI3+1","v":14},null,{"$f":"AK3+1","v":15},null,{"$f":"AM3+1","v":16},null,{"$f":"AO3+1","v":17},null,{"$f":"AQ3+1","v":18},null,{"$f":"AS3+1","v":19},null,{"$f":"AU3+1","v":20},null,{"$f":"AW3+1","v":21},null,{"$f":"AY3+1","v":22},null,{"$f":"BA3+1","v":23},null,{"$f":"BC3+1","v":24},null,{"$f":"BE3+1","v":25},null,{"$f":"BG3+1","v":26},null,{"$f":"BI3+1","v":27},null,{"$f":"BK3+1","v":28},null,{"$f":"BM3+1","v":29},null,{"$f":"BO3+1","v":30},null,{"$f":"BQ3+1","v":31},null,{"$f":"BS3+1","v":32},null,{"$f":"BU3+1","v":33},null,{"$f":"BW3+1","v":34},null,{"$f":"BY3+1","v":35},null,{"$f":"CA3+1","v":36},null,{"$f":"CC3+1","v":37},null,{"$f":"CE3+1","v":38},null,{"$f":"CG3+1","v":39},null,{"$f":"CI3+1","v":40},null,{"$f":"CK3+1","v":41},null,{"$f":"CM3+1","v":42},null,{"$f":"CO3+1","v":43},null,{"$f":"CQ3+1","v":44},null,{"$f":"CS3+1","v":45},null,{"$f":"CU3+1","v":46},null,{"$f":"CW3+1","v":47},null,{"$f":"CY3+1","v":48},null,{"$f":"DA3+1","v":49},null,{"$f":"DC3+1","v":50},null,{"$f":"DE3+1","v":51},null,{"$f":"DG3+1","v":52},null,{"$f":"DI3+1","v":53},null,{"$f":"DK3+1","v":54},null,{"$f":"DM3+1","v":55},null,{"$f":"DO3+1","v":56},null,{"$f":"DQ3+1","v":57},null,{"$f":"DS3+1","v":58},null,{"$f":"DU3+1","v":59},null,{"$f":"DW3+1","v":60}]
[]
[null,null,null,null,null,null,null,null,null,null,{"$f":"ROUND(SUM(L4:L52),2)","v":388.58},null,{"$f":"ROUND(SUM(N4:N52),2)","v":388.58},null,{"$f":"ROUND(SUM(P4:P52),2)","v":388.58},null,{"$f":"ROUND(SUM(R4:R52),2)","v":388.58},null,{"$f":"ROUND(SUM(T4:T52),2)","v":388.58},null,{"$f":"ROUND(SUM(V4:V52),2)","v":388.58},null,{"$f":"ROUND(SUM(X4:X52),2)","v":0},null,{"$f":"ROUND(SUM(Z4:Z52),2)","v":0},null,{"$f":"ROUND(SUM(AB4:AB52),2)","v":0},null,{"$f":"ROUND(SUM(AD4:AD52),2)","v":0},null,{"$f":"ROUND(SUM(AF4:AF52),2)","v":0},null,{"$f":"ROUND(SUM(AH4:AH52),2)","v":0},null,{"$f":"ROUND(SUM(AJ4:AJ52),2)","v":0},null,{"$f":"ROUND(SUM(AL4:AL52),2)","v":0},null,{"$f":"ROUND(SUM(AN4:AN52),2)","v":0},null,{"$f":"ROUND(SUM(AP4:AP52),2)","v":0},null,{"$f":"ROUND(SUM(AR4:AR52),2)","v":0},null,{"$f":"ROUND(SUM(AT4:AT52),2)","v":0},null,{"$f":"ROUND(SUM(AV4:AV52),2)","v":0},null,{"$f":"ROUND(SUM(AX4:AX52),2)","v":0},null,{"$f":"ROUND(SUM(AZ4:AZ52),2)","v":0},null,{"$f":"ROUND(SUM(BB4:BB52),2)","v":0},null,{"$f":"ROUND(SUM(BD4:BD52),2)","v":0},null,{"$f":"ROUND(SUM(BF4:BF52),2)","v":0},null,{"$f":"ROUND(SUM(BH4:BH52),2)","v":0},null,{"$f":"ROUND(SUM(BJ4:BJ52),2)","v":0},null,{"$f":"ROUND(SUM(BL4:BL52),2)","v":0},null,{"$f":"ROUND(SUM(BN4:BN52),2)","v":0},null,{"$f":"ROUND(SUM(BP4:BP52),2)","v":0},null,{"$f":"ROUND(SUM(BR4:BR52),2)","v":0},null,{"$f":"ROUND(SUM(BT4:BT52),2)","v":0},null,{"$f":"ROUND(SUM(BV4:BV52),2)","v":0},null,{"$f":"ROUND(SUM(BX4:BX52),2)","v":0},null,{"$f":"ROUND(SUM(BZ4:BZ52),2)","v":0},null,{"$f":"ROUND(SUM(CB4:CB52),2)","v":0},null,{"$f":"ROUND(SUM(CD4:CD52),2)","v":0},null,{"$f":"ROUND(SUM(CF4:CF52),2)","v":0},null,{"$f":"ROUND(SUM(CH4:CH52),2)","v":0},null,{"$f":"ROUND(SUM(CJ4:CJ52),2)","v":0},null,{"$f":"ROUND(SUM(CL4:CL52),2)","v":0},null,{"$f":"ROUND(SUM(CN4:CN52),2)","v":0},null,{"$f":"ROUND(SUM(CP4:CP52),2)","v":0},null,{"$f":"ROUND(SUM(CR4:CR52),2)","v":0},null,{"$f":"ROUND(SUM(CT4:CT52),2)","v":0},null,{"$f":"ROUND(SUM(CV4:CV52),2)","v":0},null,{"$f":"ROUND(SUM(CX4:CX52),2)","v":0},null,{"$f":"ROUND(SUM(CZ4:CZ52),2)","v":0},null,{"$f":"ROUND(SUM(DB4:DB52),2)","v":0},null,{"$f":"ROUND(SUM(DD4:DD52),2)","v":0},null,{"$f":"ROUND(SUM(DF4:DF52),2)","v":0},null,{"$f":"ROUND(SUM(DH4:DH52),2)","v":0},null,{"$f":"ROUND(SUM(DJ4:DJ52),2)","v":0},null,{"$f":"ROUND(SUM(DL4:DL52),2)","v":0},null,{"$f":"ROUND(SUM(DN4:DN52),2)","v":0},null,{"$f":"ROUND(SUM(DP4:DP52),2)","v":0},null,{"$f":"ROUND(SUM(DR4:DR52),2)","v":0},null,{"$f":"ROUND(SUM(DT4:DT52),2)","v":0},null,{"$f":"ROUND(SUM(DV4:DV52),2)","v":0},null,{"$f":"ROUND(SUM(DX4:DX52),2)","v":0},null,{"$f":"ROUND(SUM(DZ4:DZ52),2)","v":0}]
[null,null,"CATEGORIAS",null,null,null,null,"QUANTIDADE"]
[]
[null,null,1,{"$f":"HLOOKUP($C8,'Dados Gerais'!$D$5:$BK$10,6)","v":"BOMBEIRO HIDRÁULICO DE MANUTENÇÃO"},null,null,null,{"$f":"HLOOKUP($C8,'Dados Gerais'!$D$5:$BK$14,10)","v":1},null,null,{"$f":"IF($C8=K$3,1,0)","v":1},null,{"$f":"IF($C8=M$3,1,0)","v":0},null,{"$f":"IF($C8=O$3,1,0)","v":0},null,{"$f":"IF($C8=Q$3,1,0)","v":0},null,{"$f":"IF($C8=S$3,1,0)","v":0},null,{"$f":"IF($C8=U$3,1,0)","v":0},null,{"$f":"IF($C8=W$3,1,0)","v":0},null,{"$f":"IF($C8=Y$3,1,0)","v":0},null,{"$f":"IF($C8=AA$3,1,0)","v":0},null,{"$f":"IF($C8=AC$3,1,0)","v":0},null,{"$f":"IF($C8=AE$3,1,0)","v":0},null,{"$f":"IF($C8=AG$3,1,0)","v":0},null,{"$f":"IF($C8=AI$3,1,0)","v":0},null,{"$f":"IF($C8=AK$3,1,0)","v":0},null,{"$f":"IF($C8=AM$3,1,0)","v":0},null,{"$f":"IF($C8=AO$3,1,0)","v":0},null,{"$f":"IF($C8=AQ$3,1,0)","v":0},null,{"$f":"IF($C8=AS$3,1,0)","v":0},null,{"$f":"IF($C8=AU$3,1,0)","v":0},null,{"$f":"IF($C8=AW$3,1,0)","v":0},null,{"$f":"IF($C8=AY$3,1,0)","v":0},null,{"$f":"IF($C8=BA$3,1,0)","v":0},null,{"$f":"IF($C8=BC$3,1,0)","v":0},null,{"$f":"IF($C8=BE$3,1,0)","v":0},null,{"$f":"IF($C8=BG$3,1,0)","v":0},null,{"$f":"IF($C8=BI$3,1,0)","v":0},null,{"$f":"IF($C8=BK$3,1,0)","v":0},null,{"$f":"IF($C8=BM$3,1,0)","v":0},null,{"$f":"IF($C8=BO$3,1,0)","v":0},null,{"$f":"IF($C8=BQ$3,1,0)","v":0},null,{"$f":"IF($C8=BS$3,1,0)","v":0},null,{"$f":"IF($C8=BU$3,1,0)","v":0},null,{"$f":"IF($C8=BW$3,1,0)","v":0},null,{"$f":"IF($C8=BY$3,1,0)","v":0},null,{"$f":"IF($C8=CA$3,1,0)","v":0},null,{"$f":"IF($C8=CC$3,1,0)","v":0},null,{"$f":"IF($C8=CE$3,1,0)","v":0},null,{"$f":"IF($C8=CG$3,1,0)","v":0},null,{"$f":"IF($C8=CI$3,1,0)","v":0},null,{"$f":"IF($C8=CK$3,1,0)","v":0},null,{"$f":"IF($C8=CM$3,1,0)","v":0},null,{"$f":"IF($C8=CO$3,1,0)","v":0},null,{"$f":"IF($C8=CQ$3,1,0)","v":0},null,{"$f":"IF($C8=CS$3,1,0)","v":0},null,{"$f":"IF($C8=CU$3,1,0)","v":0},null,{"$f":"IF($C8=CW$3,1,0)","v":0},null,{"$f":"IF($C8=CY$3,1,0)","v":0},null,{"$f":"IF($C8=DA$3,1,0)","v":0},null,{"$f":"IF($C8=DC$3,1,0)","v":0},null,{"$f":"IF($C8=DE$3,1,0)","v":0},null,{"$f":"IF($C8=DG$3,1,0)","v":0},null,{"$f":"IF($C8=DI$3,1,0)","v":0},null,{"$f":"IF($C8=DK$3,1,0)","v":0},null,{"$f":"IF($C8=DM$3,1,0)","v":0},null,{"$f":"IF($C8=DO$3,1,0)","v":0},null,{"$f":"IF($C8=DQ$3,1,0)","v":0},null,{"$f":"IF($C8=DS$3,1,0)","v":0},null,{"$f":"IF($C8=DU$3,1,0)","v":0},null,{"$f":"IF($C8=DW$3,1,0)","v":0},null,{"$f":"IF($C8=DY$3,1,0)","v":0}]
[null,null,2,{"$f":"HLOOKUP($C9,'Dados Gerais'!$D$5:$BK$10,6)","v":"ENCARREGADO DE INSTALAÇÕES"},null,null,null,{"$f":"HLOOKUP($C9,'Dados Gerais'!$D$5:$BK$14,10)","v":1},null,null,{"$f":"IF($C9=K$3,1,0)","v":0},null,1,null,0,null,0,null,0,null,0,null,0,null,0,null,0,null,0,null,0,null,0,null,0,null,0,null,0,null,0,null,0,null,0,null,0,null,0,null,0,null,0,null,0,null,0,null,0,null,0,null,0,null,0,null,0,null,0,null,0,null,0,null,0,null,0,null,0,null,0,null,0,null,0,null,0,null,0,null,0,null,0,null,0,null,0,null,0,null,0,null,0,null,0,null,0,null,0,null,0,null,0,null,0,null,0,null,0,null,0,null,0,null,0,null,0,null,0]
[null,null,3,{"$f":"HLOOKUP($C10,'Dados Gerais'!$D$5:$BK$10,6)","v":"TÉCNICO EM ELETRÔNICA (DETECÇÃO, ALARME E COMBATE A INCÊNCIO)"},null,null,null,{"$f":"HLOOKUP($C10,'Dados Gerais'!$D$5:$BK$14,10)","v":1},null,null,{"$f":"IF($C10=K$3,1,0)","v":0},null,0,null,1,null,0,null,0,null,0,null,0,null,0,null,0,null,0,null,0,null,0,null,0,null,0,null,0,null,0,null,0,null,0,null,0,null,0,null,0,null,0,null,0,null,0,null,0,null,0,null,0,null,0,null,0,null,0,null,0,null,0,null,0,null,0,null,0,null,0,null,0,null,0,null,0,null,0,null,0,null,0,null,0,null,0,null,0,null,0,null,0,null,0,null,0,null,0,null,0,null,0,null,0,null,0,null,0,null,0,null,0,null,0,null,0,null,0]
[null,null,4,{"$f":"HLOOKUP($C11,'Dados Gerais'!$D$5:$BK$10,6)","v":"TÉCNICO EM ELETROTÉCNICA (QUADROS DE COMANDO E AUTOMAÇÃO)"},null,null,null,{"$f":"HLOOKUP($C11,'Dados Gerais'!$D$5:$BK$14,10)","v":1},null,null,{"$f":"IF($C11=K$3,1,0)","v":0},null,0,null,0,null,1,null,0,null,0,null,0,null,0,null,0,null,0,null,0,null,0,null,0,null,0,null,0,null,0,null,0,null,0,null,0,null,0,null,0,null,0,null,0,null,0,null,0,null,0,null,0,null,0,null,0,null,0,null,0,null,0,null,0,null,0,null,0,null,0,null,0,null,0,null,0,null,0,null,0,null,0,null,0,null,0,null,0,null,0,null,0,null,0,null,0,null,0,null,0,null,0,null,0,null,0,null,0,null,0,null,0,null,0,null,0,null,0]
[]
[]
[null,null,"ITEM","DESCRIÇÃO","QUANT ANUAL\nPOR POSTO","Nº DE POSTOS","QUANT ANUAL\nTOTAL","VALOR"]
[null,null,null,null,null,null,null,null,null,null,null,null,null,null,null,null,null,null,null,null,null,null,null,null,null,null,null,null,null,null,null,null,null,null,null,null,null,null,null,null,null,null,null,null,null,null,null,{"$f":"IF(SUM(AU$7:AU$12)>0,$E15*$H15,0)","v":0},null,{"$f":"IF(SUM(AW$7:AW$12)>0,$E15*$H15,0)","v":0},null,{"$f":"IF(SUM(AY$7:AY$12)>0,$E15*$H15,0)","v":0},null,{"$f":"IF(SUM(BA$7:BA$12)>0,$E15*$H15,0)","v":0},null,{"$f":"IF(SUM(BC$7:BC$12)>0,$E15*$H15,0)","v":0},null,{"$f":"IF(SUM(BE$7:BE$12)>0,$E15*$H15,0)","v":0},null,{"$f":"IF(SUM(BG$7:BG$12)>0,$E15*$H15,0)","v":0},null,{"$f":"IF(SUM(BI$7:BI$12)>0,$E15*$H15,0)","v":0},null,{"$f":"IF(SUM(BK$7:BK$12)>0,$E15*$H15,0)","v":0},null,{"$f":"IF(SUM(BM$7:BM$12)>0,$E15*$H15,0)","v":0},null,{"$f":"IF(SUM(BO$7:BO$12)>0,$E15*$H15,0)","v":0},null,{"$f":"IF(SUM(BQ$7:BQ$12)>0,$E15*$H15,0)","v":0},null,{"$f":"IF(SUM(BS$7:BS$12)>0,$E15*$H15,0)","v":0},null,{"$f":"IF(SUM(BU$7:BU$12)>0,$E15*$H15,0)","v":0},null,{"$f":"IF(SUM(BW$7:BW$12)>0,$E15*$H15,0)","v":0},null,{"$f":"IF(SUM(BY$7:BY$12)>0,$E15*$H15,0)","v":0},null,{"$f":"IF(SUM(CA$7:CA$12)>0,$E15*$H15,0)","v":0},null,{"$f":"IF(SUM(CC$7:CC$12)>0,$E15*$H15,0)","v":0},null,{"$f":"IF(SUM(CE$7:CE$12)>0,$E15*$H15,0)","v":0},null,{"$f":"IF(SUM(CG$7:CG$12)>0,$E15*$H15,0)","v":0},null,{"$f":"IF(SUM(CI$7:CI$12)>0,$E15*$H15,0)","v":0},null,{"$f":"IF(SUM(CK$7:CK$12)>0,$E15*$H15,0)","v":0},null,{"$f":"IF(SUM(CM$7:CM$12)>0,$E15*$H15,0)","v":0},null,{"$f":"IF(SUM(CO$7:CO$12)>0,$E15*$H15,0)","v":0},null,{"$f":"IF(SUM(CQ$7:CQ$12)>0,$E15*$H15,0)","v":0},null,{"$f":"IF(SUM(CS$7:CS$12)>0,$E15*$H15,0)","v":0},null,{"$f":"IF(SUM(CU$7:CU$12)>0,$E15*$H15,0)","v":0},null,{"$f":"IF(SUM(CW$7:CW$12)>0,$E15*$H15,0)","v":0},null,{"$f":"IF(SUM(CY$7:CY$12)>0,$E15*$H15,0)","v":0},null,{"$f":"IF(SUM(DA$7:DA$12)>0,$E15*$H15,0)","v":0},null,{"$f":"IF(SUM(DC$7:DC$12)>0,$E15*$H15,0)","v":0},null,{"$f":"IF(SUM(DE$7:DE$12)>0,$E15*$H15,0)","v":0},null,{"$f":"IF(SUM(DG$7:DG$12)>0,$E15*$H15,0)","v":0},null,{"$f":"IF(SUM(DI$7:DI$12)>0,$E15*$H15,0)","v":0},null,{"$f":"IF(SUM(DK$7:DK$12)>0,$E15*$H15,0)","v":0},null,{"$f":"IF(SUM(DM$7:DM$12)>0,$E15*$H15,0)","v":0},null,{"$f":"IF(SUM(DO$7:DO$12)>0,$E15*$H15,0)","v":0},null,{"$f":"IF(SUM(DQ$7:DQ$12)>0,$E15*$H15,0)","v":0},null,{"$f":"IF(SUM(DS$7:DS$12)>0,$E15*$H15,0)","v":0},null,{"$f":"IF(SUM(DU$7:DU$12)>0,$E15*$H15,0)","v":0},null,{"$f":"IF(SUM(DW$7:DW$12)>0,$E15*$H15,0)","v":0},null,{"$f":"IF(SUM(DY$7:DY$12)>0,$E15*$H15,0)","v":0}]
[null,null,null,"Calça jeans azul marinho",2,{"$f":"SUM(H8:H11)","v":4},{"$f":"E16*F16","v":8},68.099999999999994,null,null,null,{"$f":"IF(SUM(K$7:K$12)>0,$E16*$H16,0)","v":136.19999999999999},null,{"$f":"IF(SUM(M$7:M$12)>0,$E16*$H16,0)","v":136.19999999999999},null,{"$f":"IF(SUM(O$7:O$12)>0,$E16*$H16,0)","v":136.19999999999999},null,{"$f":"IF(SUM(Q$7:Q$12)>0,$E16*$H16,0)","v":136.19999999999999},null,{"$f":"IF(SUM(S$7:S$12)>0,$E16*$H16,0)","v":0},null,{"$f":"IF(SUM(U$7:U$12)>0,$E16*$H16,0)","v":0},null,{"$f":"IF(SUM(W$7:W$12)>0,$E16*$H16,0)","v":0},null,{"$f":"IF(SUM(Y$7:Y$12)>0,$E16*$H16,0)","v":0},null,{"$f":"IF(SUM(AA$7:AA$12)>0,$E16*$H16,0)","v":0},null,{"$f":"IF(SUM(AC$7:AC$12)>0,$E16*$H16,0)","v":0},null,{"$f":"IF(SUM(AE$7:AE$12)>0,$E16*$H16,0)","v":0},null,{"$f":"IF(SUM(AG$7:AG$12)>0,$E16*$H16,0)","v":0},null,{"$f":"IF(SUM(AI$7:AI$12)>0,$E16*$H16,0)","v":0},null,{"$f":"IF(SUM(AK$7:AK$12)>0,$E16*$H16,0)","v":0},null,{"$f":"IF(SUM(AM$7:AM$12)>0,$E16*$H16,0)","v":0},null,{"$f":"IF(SUM(AO$7:AO$12)>0,$E16*$H16,0)","v":0},null,{"$f":"IF(SUM(AQ$7:AQ$12)>0,$E16*$H16,0)","v":0},null,{"$f":"IF(SUM(AS$7:AS$12)>0,$E16*$H16,0)","v":0},null,0,null,0,null,0,null,0,null,0,null,0,null,0,null,0,null,0,null,0,null,0,null,0,null,0,null,0,null,0,null,0,null,0,null,0,null,0,null,0,null,0,null,0,null,0,null,0,null,0,null,0,null,0,null,0,null,0,null,0,null,0,null,0,null,0,null,0,null,0,null,0,null,0,null,0,null,0,null,0,null,0,null,0]
[null,null,null,"Camisa com manga curta em poliéster na cor azul marinho",6,{"$f":"F16","v":4},{"$f":"E17*F17","v":24},27.09,null,null,null,{"$f":"IF(SUM(K$7:K$12)>0,$E17*$H17,0)","v":162.54},null,{"$f":"IF(SUM(M$7:M$12)>0,$E17*$H17,0)","v":162.54},null,{"$f":"IF(SUM(O$7:O$12)>0,$E17*$H17,0)","v":162.54},null,{"$f":"IF(SUM(Q$7:Q$12)>0,$E17*$H17,0)","v":162.54},null,{"$f":"IF(SUM(S$7:S$12)>0,$E17*$H17,0)","v":0},null,{"$f":"IF(SUM(U$7:U$12)>0,$E17*$H17,0)","v":0},null,{"$f":"IF(SUM(W$7:W$12)>0,$E17*$H17,0)","v":0},null,{"$f":"IF(SUM(Y$7:Y$12)>0,$E17*$H17,0)","v":0},null,{"$f":"IF(SUM(AA$7:AA$12)>0,$E17*$H17,0)","v":0},null,{"$f":"IF(SUM(AC$7:AC$12)>0,$E17*$H17,0)","v":0},null,{"$f":"IF(SUM(AE$7:AE$12)>0,$E17*$H17,0)","v":0},null,{"$f":"IF(SUM(AG$7:AG$12)>0,$E17*$H17,0)","v":0},null,{"$f":"IF(SUM(AI$7:AI$12)>0,$E17*$H17,0)","v":0},null,{"$f":"IF(SUM(AK$7:AK$12)>0,$E17*$H17,0)","v":0},null,{"$f":"IF(SUM(AM$7:AM$12)>0,$E17*$H17,0)","v":0},null,{"$f":"IF(SUM(AO$7:AO$12)>0,$E17*$H17,0)","v":0},null,{"$f":"IF(SUM(AQ$7:AQ$12)>0,$E17*$H17,0)","v":0},null,{"$f":"IF(SUM(AS$7:AS$12)>0,$E17*$H17,0)","v":0},null,0,null,0,null,0,null,0,null,0,null,0,null,0,null,0,null,0,null,0,null,0,null,0,null,0,null,0,null,0,null,0,null,0,null,0,null,0,null,0,null,0,null,0,null,0,null,0,null,0,null,0,null,0,null,0,null,0,null,0,null,0,null,0,null,0,null,0,null,0,null,0,null,0,null,0,null,0,null,0,null,0,null,0]
[null,null,null,"Meia social preta",8,{"$f":"F17","v":4},{"$f":"E18*F18","v":32},11.23,null,null,null,{"$f":"IF(SUM(K$7:K$12)>0,$E18*$H18,0)","v":89.84},null,{"$f":"IF(SUM(M$7:M$12)>0,$E18*$H18,0)","v":89.84},null,{"$f":"IF(SUM(O$7:O$12)>0,$E18*$H18,0)","v":89.84},null,{"$f":"IF(SUM(Q$7:Q$12)>0,$E18*$H18,0)","v":89.84},null,{"$f":"IF(SUM(S$7:S$12)>0,$E18*$H18,0)","v":0},null,{"$f":"IF(SUM(U$7:U$12)>0,$E18*$H18,0)","v":0},null,{"$f":"IF(SUM(W$7:W$12)>0,$E18*$H18,0)","v":0},null,{"$f":"IF(SUM(Y$7:Y$12)>0,$E18*$H18,0)","v":0},null,{"$f":"IF(SUM(AA$7:AA$12)>0,$E18*$H18,0)","v":0},null,{"$f":"IF(SUM(AC$7:AC$12)>0,$E18*$H18,0)","v":0},null,{"$f":"IF(SUM(AE$7:AE$12)>0,$E18*$H18,0)","v":0},null,{"$f":"IF(SUM(AG$7:AG$12)>0,$E18*$H18,0)","v":0},null,{"$f":"IF(SUM(AI$7:AI$12)>0,$E18*$H18,0)","v":0},null,{"$f":"IF(SUM(AK$7:AK$12)>0,$E18*$H18,0)","v":0},null,{"$f":"IF(SUM(AM$7:AM$12)>0,$E18*$H18,0)","v":0},null,{"$f":"IF(SUM(AO$7:AO$12)>0,$E18*$H18,0)","v":0},null,{"$f":"IF(SUM(AQ$7:AQ$12)>0,$E18*$H18,0)","v":0},null,{"$f":"IF(SUM(AS$7:AS$12)>0,$E18*$H18,0)","v":0},null,0,null,0,null,0,null,0,null,0,null,0,null,0,null,0,null,0,null,0,null,0,null,0,null,0,null,0,null,0,null,0,null,0,null,0,null,0,null,0,null,0,null,0,null,0,null,0,null,0,null,0,null,0,null,0,null,0,null,0,null,0,null,0,null,0,null,0,null,0,null,0,null,0,null,0,null,0,null,0,null,0,null,0]
[null,null,null,null,null,null,null,null,null,null,null,null,null,null,null,null,null,null,null,null,null,null,null,null,null,null,null,null,null,null,null,null,null,null,null,null,null,null,null,null,null,null,null,null,null,null,null,0,null,0,null,0,null,0,null,0,null,0,null,0,null,0,null,0,null,0,null,0,null,0,null,0,null,0,null,0,null,0,null,0,null,0,null,0,null,0,null,0,null,0,null,0,null,0,null,0,null,0,null,0,null,0,null,0,null,0,null,0,null,0,null,0,null,0,null,0,null,0,null,0,null,0,null,0,null,0,null,0,null,0]
[]
[null,null,"CATEGORIAS",null,null,null,null,"QUANTIDADE"]
[]
[null,null,5,{"$f":"HLOOKUP($C23,'Dados Gerais'!$D$5:$BK$10,6)","v":"OPERADOR DE CENTRAL DE DETECÇÃO E ALARME DE INCÊNDIO"},null,null,null,{"$f":"HLOOKUP($C23,'Dados Gerais'!$D$5:$BK$14,10)","v":4},null,null,{"$f":"IF($C23=K$3,1,0)","v":0},null,0,null,0,null,0,null,1,null,0,null,0,null,0,null,{"$f":"IF($C23=AA$3,1,0)","v":0},null,0,null,0,null,0,null,0,null,0,null,0,null,0,null,0,null,0,null,{"$f":"IF($C23=AU$3,1,0)","v":0},null,{"$f":"IF($C23=AW$3,1,0)","v":0},null,{"$f":"IF($C23=AY$3,1,0)","v":0},null,{"$f":"IF($C23=BA$3,1,0)","v":0},null,{"$f":"IF($C23=BC$3,1,0)","v":0},null,{"$f":"IF($C23=BE$3,1,0)","v":0},null,{"$f":"IF($C23=BG$3,1,0)","v":0},null,{"$f":"IF($C23=BI$3,1,0)","v":0},null,{"$f":"IF($C23=BK$3,1,0)","v":0},null,{"$f":"IF($C23=BM$3,1,0)","v":0},null,{"$f":"IF($C23=BO$3,1,0)","v":0},null,{"$f":"IF($C23=BQ$3,1,0)","v":0},null,{"$f":"IF($C23=BS$3,1,0)","v":0},null,{"$f":"IF($C23=BU$3,1,0)","v":0},null,{"$f":"IF($C23=BW$3,1,0)","v":0},null,{"$f":"IF($C23=BY$3,1,0)","v":0},null,{"$f":"IF($C23=CA$3,1,0)","v":0},null,{"$f":"IF($C23=CC$3,1,0)","v":0},null,{"$f":"IF($C23=CE$3,1,0)","v":0},null,{"$f":"IF($C23=CG$3,1,0)","v":0},null,{"$f":"IF($C23=CI$3,1,0)","v":0},null,{"$f":"IF($C23=CK$3,1,0)","v":0},null,{"$f":"IF($C23=CM$3,1,0)","v":0},null,{"$f":"IF($C23=CO$3,1,0)","v":0},null,{"$f":"IF($C23=CQ$3,1,0)","v":0},null,{"$f":"IF($C23=CS$3,1,0)","v":0},null,{"$f":"IF($C23=CU$3,1,0)","v":0},null,{"$f":"IF($C23=CW$3,1,0)","v":0},null,{"$f":"IF($C23=CY$3,1,0)","v":0},null,{"$f":"IF($C23=DA$3,1,0)","v":0},null,{"$f":"IF($C23=DC$3,1,0)","v":0},null,{"$f":"IF($C23=DE$3,1,0)","v":0},null,{"$f":"IF($C23=DG$3,1,0)","v":0},null,{"$f":"IF($C23=DI$3,1,0)","v":0},null,{"$f":"IF($C23=DK$3,1,0)","v":0},null,{"$f":"IF($C23=DM$3,1,0)","v":0},null,{"$f":"IF($C23=DO$3,1,0)","v":0},null,{"$f":"IF($C23=DQ$3,1,0)","v":0},null,{"$f":"IF($C23=DS$3,1,0)","v":0},null,{"$f":"IF($C23=DU$3,1,0)","v":0},null,{"$f":"IF($C23=DW$3,1,0)","v":0},null,{"$f":"IF($C23=DY$3,1,0)","v":0}]
[null,null,6,{"$f":"HLOOKUP($C24,'Dados Gerais'!$D$5:$BK$10,6)","v":"OPERADOR DE CENTRAL DE DETECÇÃO E ALARME DE INCÊNDIO (COM ADICIONAL NOTURNO)"},null,null,null,{"$f":"HLOOKUP($C24,'Dados Gerais'!$D$5:$BK$14,10)","v":4},null,null,0,null,0,null,0,null,0,null,0,null,1,null,0,null,0,null,0,null,0,null,0,null,0,null,0,null,0,null,0,null,0,null,0,null,0,null,0,null,0,null,0,null,0,null,0,null,0,null,0,null,0,null,0,null,0,null,0,null,0,null,0,null,0,null,0,null,0,null,0,null,0,null,0,null,0,null,0,null,0,null,0,null,0,null,0,null,0,null,0,null,0,null,0,null,0,null,0,null,0,null,0,null,0,null,0,null,0,null,0,null,0,null,0,null,0,null,0,null,0]
[]
[]
[null,null,"ITEM","DESCRIÇÃO","QUANT ANUAL\nPOR POSTO","Nº DE POSTOS","QUANT ANUAL\nTOTAL","VALOR"]
[null,null,null,null,null,null,null,null,null,null,null,null,null,null,null,null,null,null,null,null,null,null,null,null,null,null,null,null,null,null,null,null,null,null,null,null,null,null,null,null,null,null,null,null,null,null,null,{"$f":"IF(SUM(AU$7:AU$12)>0,$E28*$H28,0)","v":0},null,{"$f":"IF(SUM(AW$7:AW$12)>0,$E28*$H28,0)","v":0},null,{"$f":"IF(SUM(AY$7:AY$12)>0,$E28*$H28,0)","v":0},null,{"$f":"IF(SUM(BA$7:BA$12)>0,$E28*$H28,0)","v":0},null,{"$f":"IF(SUM(BC$7:BC$12)>0,$E28*$H28,0)","v":0},null,{"$f":"IF(SUM(BE$7:BE$12)>0,$E28*$H28,0)","v":0},null,{"$f":"IF(SUM(BG$7:BG$12)>0,$E28*$H28,0)","v":0},null,{"$f":"IF(SUM(BI$7:BI$12)>0,$E28*$H28,0)","v":0},null,{"$f":"IF(SUM(BK$7:BK$12)>0,$E28*$H28,0)","v":0},null,{"$f":"IF(SUM(BM$7:BM$12)>0,$E28*$H28,0)","v":0},null,{"$f":"IF(SUM(BO$7:BO$12)>0,$E28*$H28,0)","v":0},null,{"$f":"IF(SUM(BQ$7:BQ$12)>0,$E28*$H28,0)","v":0},null,{"$f":"IF(SUM(BS$7:BS$12)>0,$E28*$H28,0)","v":0},null,{"$f":"IF(SUM(BU$7:BU$12)>0,$E28*$H28,0)","v":0},null,{"$f":"IF(SUM(BW$7:BW$12)>0,$E28*$H28,0)","v":0},null,{"$f":"IF(SUM(BY$7:BY$12)>0,$E28*$H28,0)","v":0},null,{"$f":"IF(SUM(CA$7:CA$12)>0,$E28*$H28,0)","v":0},null,{"$f":"IF(SUM(CC$7:CC$12)>0,$E28*$H28,0)","v":0},null,{"$f":"IF(SUM(CE$7:CE$12)>0,$E28*$H28,0)","v":0},null,{"$f":"IF(SUM(CG$7:CG$12)>0,$E28*$H28,0)","v":0},null,{"$f":"IF(SUM(CI$7:CI$12)>0,$E28*$H28,0)","v":0},null,{"$f":"IF(SUM(CK$7:CK$12)>0,$E28*$H28,0)","v":0},null,{"$f":"IF(SUM(CM$7:CM$12)>0,$E28*$H28,0)","v":0},null,{"$f":"IF(SUM(CO$7:CO$12)>0,$E28*$H28,0)","v":0},null,{"$f":"IF(SUM(CQ$7:CQ$12)>0,$E28*$H28,0)","v":0},null,{"$f":"IF(SUM(CS$7:CS$12)>0,$E28*$H28,0)","v":0},null,{"$f":"IF(SUM(CU$7:CU$12)>0,$E28*$H28,0)","v":0},null,{"$f":"IF(SUM(CW$7:CW$12)>0,$E28*$H28,0)","v":0},null,{"$f":"IF(SUM(CY$7:CY$12)>0,$E28*$H28,0)","v":0},null,{"$f":"IF(SUM(DA$7:DA$12)>0,$E28*$H28,0)","v":0},null,{"$f":"IF(SUM(DC$7:DC$12)>0,$E28*$H28,0)","v":0},null,{"$f":"IF(SUM(DE$7:DE$12)>0,$E28*$H28,0)","v":0},null,{"$f":"IF(SUM(DG$7:DG$12)>0,$E28*$H28,0)","v":0},null,{"$f":"IF(SUM(DI$7:DI$12)>0,$E28*$H28,0)","v":0},null,{"$f":"IF(SUM(DK$7:DK$12)>0,$E28*$H28,0)","v":0},null,{"$f":"IF(SUM(DM$7:DM$12)>0,$E28*$H28,0)","v":0},null,{"$f":"IF(SUM(DO$7:DO$12)>0,$E28*$H28,0)","v":0},null,{"$f":"IF(SUM(DQ$7:DQ$12)>0,$E28*$H28,0)","v":0},null,{"$f":"IF(SUM(DS$7:DS$12)>0,$E28*$H28,0)","v":0},null,{"$f":"IF(SUM(DU$7:DU$12)>0,$E28*$H28,0)","v":0},null,{"$f":"IF(SUM(DW$7:DW$12)>0,$E28*$H28,0)","v":0},null,{"$f":"IF(SUM(DY$7:DY$12)>0,$E28*$H28,0)","v":0}]
[null,null,null,"Calça jeans azul marinho",2,{"$f":"SUM(H23:H24)","v":8},{"$f":"E29*F29","v":16},{"$f":"H16","v":68.099999999999994},null,null,null,{"$f":"IF(SUM(K$23:K$25)>0,$E29*$H29,0)","v":0},null,{"$f":"IF(SUM(M$23:M$25)>0,$E29*$H29,0)","v":0},null,{"$f":"IF(SUM(O$23:O$25)>0,$E29*$H29,0)","v":0},null,{"$f":"IF(SUM(Q$23:Q$25)>0,$E29*$H29,0)","v":0},null,{"$f":"IF(SUM(S$23:S$25)>0,$E29*$H29,0)","v":136.19999999999999},null,{"$f":"IF(SUM(U$23:U$25)>0,$E29*$H29,0)","v":136.19999999999999},null,{"$f":"IF(SUM(W$23:W$25)>0,$E29*$H29,0)","v":0},null,{"$f":"IF(SUM(Y$23:Y$25)>0,$E29*$H29,0)","v":0},null,{"$f":"IF(SUM(AA$23:AA$25)>0,$E29*$H29,0)","v":0},null,{"$f":"IF(SUM(AC$23:AC$25)>0,$E29*$H29,0)","v":0},null,{"$f":"IF(SUM(AE$23:AE$25)>0,$E29*$H29,0)","v":0},null,{"$f":"IF(SUM(AG$23:AG$25)>0,$E29*$H29,0)","v":0},null,{"$f":"IF(SUM(AI$23:AI$25)>0,$E29*$H29,0)","v":0},null,{"$f":"IF(SUM(AK$23:AK$25)>0,$E29*$H29,0)","v":0},null,{"$f":"IF(SUM(AM$23:AM$25)>0,$E29*$H29,0)","v":0},null,{"$f":"IF(SUM(AO$23:AO$25)>0,$E29*$H29,0)","v":0},null,{"$f":"IF(SUM(AQ$23:AQ$25)>0,$E29*$H29,0)","v":0},null,{"$f":"IF(SUM(AS$23:AS$25)>0,$E29*$H29,0)","v":0},null,{"$f":"IF(SUM(AU$7:AU$12)>0,$E29*$H29,0)","v":0},null,{"$f":"IF(SUM(AW$7:AW$12)>0,$E29*$H29,0)","v":0},null,{"$f":"IF(SUM(AY$7:AY$12)>0,$E29*$H29,0)","v":0},null,{"$f":"IF(SUM(BA$7:BA$12)>0,$E29*$H29,0)","v":0},null,{"$f":"IF(SUM(BC$7:BC$12)>0,$E29*$H29,0)","v":0},null,{"$f":"IF(SUM(BE$7:BE$12)>0,$E29*$H29,0)","v":0},null,{"$f":"IF(SUM(BG$7:BG$12)>0,$E29*$H29,0)","v":0},null,{"$f":"IF(SUM(BI$7:BI$12)>0,$E29*$H29,0)","v":0},null,{"$f":"IF(SUM(BK$7:BK$12)>0,$E29*$H29,0)","v":0},null,{"$f":"IF(SUM(BM$7:BM$12)>0,$E29*$H29,0)","v":0},null,{"$f":"IF(SUM(BO$7:BO$12)>0,$E29*$H29,0)","v":0},null,{"$f":"IF(SUM(BQ$7:BQ$12)>0,$E29*$H29,0)","v":0},null,{"$f":"IF(SUM(BS$7:BS$12)>0,$E29*$H29,0)","v":0},null,{"$f":"IF(SUM(BU$7:BU$12)>0,$E29*$H29,0)","v":0},null,{"$f":"IF(SUM(BW$7:BW$12)>0,$E29*$H29,0)","v":0},null,{"$f":"IF(SUM(BY$7:BY$12)>0,$E29*$H29,0)","v":0},null,{"$f":"IF(SUM(CA$7:CA$12)>0,$E29*$H29,0)","v":0},null,{"$f":"IF(SUM(CC$7:CC$12)>0,$E29*$H29,0)","v":0},null,{"$f":"IF(SUM(CE$7:CE$12)>0,$E29*$H29,0)","v":0},null,{"$f":"IF(SUM(CG$7:CG$12)>0,$E29*$H29,0)","v":0},null,{"$f":"IF(SUM(CI$7:CI$12)>0,$E29*$H29,0)","v":0},null,{"$f":"IF(SUM(CK$7:CK$12)>0,$E29*$H29,0)","v":0},null,{"$f":"IF(SUM(CM$7:CM$12)>0,$E29*$H29,0)","v":0},null,{"$f":"IF(SUM(CO$7:CO$12)>0,$E29*$H29,0)","v":0},null,{"$f":"IF(SUM(CQ$7:CQ$12)>0,$E29*$H29,0)","v":0},null,{"$f":"IF(SUM(CS$7:CS$12)>0,$E29*$H29,0)","v":0},null,{"$f":"IF(SUM(CU$7:CU$12)>0,$E29*$H29,0)","v":0},null,{"$f":"IF(SUM(CW$7:CW$12)>0,$E29*$H29,0)","v":0},null,{"$f":"IF(SUM(CY$7:CY$12)>0,$E29*$H29,0)","v":0},null,{"$f":"IF(SUM(DA$7:DA$12)>0,$E29*$H29,0)","v":0},null,{"$f":"IF(SUM(DC$7:DC$12)>0,$E29*$H29,0)","v":0},null,{"$f":"IF(SUM(DE$7:DE$12)>0,$E29*$H29,0)","v":0},null,{"$f":"IF(SUM(DG$7:DG$12)>0,$E29*$H29,0)","v":0},null,{"$f":"IF(SUM(DI$7:DI$12)>0,$E29*$H29,0)","v":0},null,{"$f":"IF(SUM(DK$7:DK$12)>0,$E29*$H29,0)","v":0},null,{"$f":"IF(SUM(DM$7:DM$12)>0,$E29*$H29,0)","v":0},null,{"$f":"IF(SUM(DO$7:DO$12)>0,$E29*$H29,0)","v":0},null,{"$f":"IF(SUM(DQ$7:DQ$12)>0,$E29*$H29,0)","v":0},null,{"$f":"IF(SUM(DS$7:DS$12)>0,$E29*$H29,0)","v":0},null,{"$f":"IF(SUM(DU$7:DU$12)>0,$E29*$H29,0)","v":0},null,{"$f":"IF(SUM(DW$7:DW$12)>0,$E29*$H29,0)","v":0},null,{"$f":"IF(SUM(DY$7:DY$12)>0,$E29*$H29,0)","v":0}]
[null,null,null,"Camisa com manga curta em poliéster na cor azul marinho",6,{"$f":"F29","v":8},{"$f":"E30*F30","v":48},{"$f":"H17","v":27.09},null,null,null,{"$f":"IF(SUM(K$23:K$25)>0,$E30*$H30,0)","v":0},null,{"$f":"IF(SUM(M$23:M$25)>0,$E30*$H30,0)","v":0},null,{"$f":"IF(SUM(O$23:O$25)>0,$E30*$H30,0)","v":0},null,{"$f":"IF(SUM(Q$23:Q$25)>0,$E30*$H30,0)","v":0},null,{"$f":"IF(SUM(S$23:S$25)>0,$E30*$H30,0)","v":162.54},null,{"$f":"IF(SUM(U$23:U$25)>0,$E30*$H30,0)","v":162.54},null,{"$f":"IF(SUM(W$23:W$25)>0,$E30*$H30,0)","v":0},null,{"$f":"IF(SUM(Y$23:Y$25)>0,$E30*$H30,0)","v":0},null,{"$f":"IF(SUM(AA$23:AA$25)>0,$E30*$H30,0)","v":0},null,{"$f":"IF(SUM(AC$23:AC$25)>0,$E30*$H30,0)","v":0},null,{"$f":"IF(SUM(AE$23:AE$25)>0,$E30*$H30,0)","v":0},null,{"$f":"IF(SUM(AG$23:AG$25)>0,$E30*$H30,0)","v":0},null,{"$f":"IF(SUM(AI$23:AI$25)>0,$E30*$H30,0)","v":0},null,{"$f":"IF(SUM(AK$23:AK$25)>0,$E30*$H30,0)","v":0},null,{"$f":"IF(SUM(AM$23:AM$25)>0,$E30*$H30,0)","v":0},null,{"$f":"IF(SUM(AO$23:AO$25)>0,$E30*$H30,0)","v":0},null,{"$f":"IF(SUM(AQ$23:AQ$25)>0,$E30*$H30,0)","v":0},null,{"$f":"IF(SUM(AS$23:AS$25)>0,$E30*$H30,0)","v":0},null,{"$f":"IF(SUM(AU$7:AU$12)>0,$E30*$H30,0)","v":0},null,{"$f":"IF(SUM(AW$7:AW$12)>0,$E30*$H30,0)","v":0},null,{"$f":"IF(SUM(AY$7:AY$12)>0,$E30*$H30,0)","v":0},null,{"$f":"IF(SUM(BA$7:BA$12)>0,$E30*$H30,0)","v":0},null,{"$f":"IF(SUM(BC$7:BC$12)>0,$E30*$H30,0)","v":0},null,{"$f":"IF(SUM(BE$7:BE$12)>0,$E30*$H30,0)","v":0},null,{"$f":"IF(SUM(BG$7:BG$12)>0,$E30*$H30,0)","v":0},null,{"$f":"IF(SUM(BI$7:BI$12)>0,$E30*$H30,0)","v":0},null,{"$f":"IF(SUM(BK$7:BK$12)>0,$E30*$H30,0)","v":0},null,{"$f":"IF(SUM(BM$7:BM$12)>0,$E30*$H30,0)","v":0},null,{"$f":"IF(SUM(BO$7:BO$12)>0,$E30*$H30,0)","v":0},null,{"$f":"IF(SUM(BQ$7:BQ$12)>0,$E30*$H30,0)","v":0},null,{"$f":"IF(SUM(BS$7:BS$12)>0,$E30*$H30,0)","v":0},null,{"$f":"IF(SUM(BU$7:BU$12)>0,$E30*$H30,0)","v":0},null,{"$f":"IF(SUM(BW$7:BW$12)>0,$E30*$H30,0)","v":0},null,{"$f":"IF(SUM(BY$7:BY$12)>0,$E30*$H30,0)","v":0},null,{"$f":"IF(SUM(CA$7:CA$12)>0,$E30*$H30,0)","v":0},null,{"$f":"IF(SUM(CC$7:CC$12)>0,$E30*$H30,0)","v":0},null,{"$f":"IF(SUM(CE$7:CE$12)>0,$E30*$H30,0)","v":0},null,{"$f":"IF(SUM(CG$7:CG$12)>0,$E30*$H30,0)","v":0},null,{"$f":"IF(SUM(CI$7:CI$12)>0,$E30*$H30,0)","v":0},null,{"$f":"IF(SUM(CK$7:CK$12)>0,$E30*$H30,0)","v":0},null,{"$f":"IF(SUM(CM$7:CM$12)>0,$E30*$H30,0)","v":0},null,{"$f":"IF(SUM(CO$7:CO$12)>0,$E30*$H30,0)","v":0},null,{"$f":"IF(SUM(CQ$7:CQ$12)>0,$E30*$H30,0)","v":0},null,{"$f":"IF(SUM(CS$7:CS$12)>0,$E30*$H30,0)","v":0},null,{"$f":"IF(SUM(CU$7:CU$12)>0,$E30*$H30,0)","v":0},null,{"$f":"IF(SUM(CW$7:CW$12)>0,$E30*$H30,0)","v":0},null,{"$f":"IF(SUM(CY$7:CY$12)>0,$E30*$H30,0)","v":0},null,{"$f":"IF(SUM(DA$7:DA$12)>0,$E30*$H30,0)","v":0},null,{"$f":"IF(SUM(DC$7:DC$12)>0,$E30*$H30,0)","v":0},null,{"$f":"IF(SUM(DE$7:DE$12)>0,$E30*$H30,0)","v":0},null,{"$f":"IF(SUM(DG$7:DG$12)>0,$E30*$H30,0)","v":0},null,{"$f":"IF(SUM(DI$7:DI$12)>0,$E30*$H30,0)","v":0},null,{"$f":"IF(SUM(DK$7:DK$12)>0,$E30*$H30,0)","v":0},null,{"$f":"IF(SUM(DM$7:DM$12)>0,$E30*$H30,0)","v":0},null,{"$f":"IF(SUM(DO$7:DO$12)>0,$E30*$H30,0)","v":0},null,{"$f":"IF(SUM(DQ$7:DQ$12)>0,$E30*$H30,0)","v":0},null,{"$f":"IF(SUM(DS$7:DS$12)>0,$E30*$H30,0)","v":0},null,{"$f":"IF(SUM(DU$7:DU$12)>0,$E30*$H30,0)","v":0},null,{"$f":"IF(SUM(DW$7:DW$12)>0,$E30*$H30,0)","v":0},null,{"$f":"IF(SUM(DY$7:DY$12)>0,$E30*$H30,0)","v":0}]
[null,null,null,"Meia social preta",8,{"$f":"F30","v":8},{"$f":"E31*F31","v":64},{"$f":"H18","v":11.23},null,null,null,{"$f":"IF(SUM(K$23:K$25)>0,$E31*$H31,0)","v":0},null,{"$f":"IF(SUM(M$23:M$25)>0,$E31*$H31,0)","v":0},null,{"$f":"IF(SUM(O$23:O$25)>0,$E31*$H31,0)","v":0},null,{"$f":"IF(SUM(Q$23:Q$25)>0,$E31*$H31,0)","v":0},null,{"$f":"IF(SUM(S$23:S$25)>0,$E31*$H31,0)","v":89.84},null,{"$f":"IF(SUM(U$23:U$25)>0,$E31*$H31,0)","v":89.84},null,{"$f":"IF(SUM(W$23:W$25)>0,$E31*$H31,0)","v":0},null,{"$f":"IF(SUM(Y$23:Y$25)>0,$E31*$H31,0)","v":0},null,{"$f":"IF(SUM(AA$23:AA$25)>0,$E31*$H31,0)","v":0},null,{"$f":"IF(SUM(AC$23:AC$25)>0,$E31*$H31,0)","v":0},null,{"$f":"IF(SUM(AE$23:AE$25)>0,$E31*$H31,0)","v":0},null,{"$f":"IF(SUM(AG$23:AG$25)>0,$E31*$H31,0)","v":0},null,{"$f":"IF(SUM(AI$23:AI$25)>0,$E31*$H31,0)","v":0},null,{"$f":"IF(SUM(AK$23:AK$25)>0,$E31*$H31,0)","v":0},null,{"$f":"IF(SUM(AM$23:AM$25)>0,$E31*$H31,0)","v":0},null,{"$f":"IF(SUM(AO$23:AO$25)>0,$E31*$H31,0)","v":0},null,{"$f":"IF(SUM(AQ$23:AQ$25)>0,$E31*$H31,0)","v":0},null,{"$f":"IF(SUM(AS$23:AS$25)>0,$E31*$H31,0)","v":0},null,{"$f":"IF(SUM(AU$7:AU$12)>0,$E31*$H31,0)","v":0},null,{"$f":"IF(SUM(AW$7:AW$12)>0,$E31*$H31,0)","v":0},null,{"$f":"IF(SUM(AY$7:AY$12)>0,$E31*$H31,0)","v":0},null,{"$f":"IF(SUM(BA$7:BA$12)>0,$E31*$H31,0)","v":0},null,{"$f":"IF(SUM(BC$7:BC$12)>0,$E31*$H31,0)","v":0},null,{"$f":"IF(SUM(BE$7:BE$12)>0,$E31*$H31,0)","v":0},null,{"$f":"IF(SUM(BG$7:BG$12)>0,$E31*$H31,0)","v":0},null,{"$f":"IF(SUM(BI$7:BI$12)>0,$E31*$H31,0)","v":0},null,{"$f":"IF(SUM(BK$7:BK$12)>0,$E31*$H31,0)","v":0},null,{"$f":"IF(SUM(BM$7:BM$12)>0,$E31*$H31,0)","v":0},null,{"$f":"IF(SUM(BO$7:BO$12)>0,$E31*$H31,0)","v":0},null,{"$f":"IF(SUM(BQ$7:BQ$12)>0,$E31*$H31,0)","v":0},null,{"$f":"IF(SUM(BS$7:BS$12)>0,$E31*$H31,0)","v":0},null,{"$f":"IF(SUM(BU$7:BU$12)>0,$E31*$H31,0)","v":0},null,{"$f":"IF(SUM(BW$7:BW$12)>0,$E31*$H31,0)","v":0},null,{"$f":"IF(SUM(BY$7:BY$12)>0,$E31*$H31,0)","v":0},null,{"$f":"IF(SUM(CA$7:CA$12)>0,$E31*$H31,0)","v":0},null,{"$f":"IF(SUM(CC$7:CC$12)>0,$E31*$H31,0)","v":0},null,{"$f":"IF(SUM(CE$7:CE$12)>0,$E31*$H31,0)","v":0},null,{"$f":"IF(SUM(CG$7:CG$12)>0,$E31*$H31,0)","v":0},null,{"$f":"IF(SUM(CI$7:CI$12)>0,$E31*$H31,0)","v":0},null,{"$f":"IF(SUM(CK$7:CK$12)>0,$E31*$H31,0)","v":0},null,{"$f":"IF(SUM(CM$7:CM$12)>0,$E31*$H31,0)","v":0},null,{"$f":"IF(SUM(CO$7:CO$12)>0,$E31*$H31,0)","v":0},null,{"$f":"IF(SUM(CQ$7:CQ$12)>0,$E31*$H31,0)","v":0},null,{"$f":"IF(SUM(CS$7:CS$12)>0,$E31*$H31,0)","v":0},null,{"$f":"IF(SUM(CU$7:CU$12)>0,$E31*$H31,0)","v":0},null,{"$f":"IF(SUM(CW$7:CW$12)>0,$E31*$H31,0)","v":0},null,{"$f":"IF(SUM(CY$7:CY$12)>0,$E31*$H31,0)","v":0},null,{"$f":"IF(SUM(DA$7:DA$12)>0,$E31*$H31,0)","v":0},null,{"$f":"IF(SUM(DC$7:DC$12)>0,$E31*$H31,0)","v":0},null,{"$f":"IF(SUM(DE$7:DE$12)>0,$E31*$H31,0)","v":0},null,{"$f":"IF(SUM(DG$7:DG$12)>0,$E31*$H31,0)","v":0},null,{"$f":"IF(SUM(DI$7:DI$12)>0,$E31*$H31,0)","v":0},null,{"$f":"IF(SUM(DK$7:DK$12)>0,$E31*$H31,0)","v":0},null,{"$f":"IF(SUM(DM$7:DM$12)>0,$E31*$H31,0)","v":0},null,{"$f":"IF(SUM(DO$7:DO$12)>0,$E31*$H31,0)","v":0},null,{"$f":"IF(SUM(DQ$7:DQ$12)>0,$E31*$H31,0)","v":0},null,{"$f":"IF(SUM(DS$7:DS$12)>0,$E31*$H31,0)","v":0},null,{"$f":"IF(SUM(DU$7:DU$12)>0,$E31*$H31,0)","v":0},null,{"$f":"IF(SUM(DW$7:DW$12)>0,$E31*$H31,0)","v":0},null,{"$f":"IF(SUM(DY$7:DY$12)>0,$E31*$H31,0)","v":0}]
[null,null,null,null,null,null,null,null,null,null,null,{"$f":"IF(SUM(K$23:K$25)>0,$E32*$H32,0)","v":0},null,{"$f":"IF(SUM(M$23:M$25)>0,$E32*$H32,0)","v":0},null,{"$f":"IF(SUM(O$23:O$25)>0,$E32*$H32,0)","v":0},null,{"$f":"IF(SUM(Q$23:Q$25)>0,$E32*$H32,0)","v":0},null,{"$f":"IF(SUM(S$23:S$25)>0,$E32*$H32,0)","v":0},null,{"$f":"IF(SUM(U$23:U$25)>0,$E32*$H32,0)","v":0},null,{"$f":"IF(SUM(W$23:W$25)>0,$E32*$H32,0)","v":0},null,{"$f":"IF(SUM(Y$23:Y$25)>0,$E32*$H32,0)","v":0},null,{"$f":"IF(SUM(AA$23:AA$25)>0,$E32*$H32,0)","v":0},null,{"$f":"IF(SUM(AC$23:AC$25)>0,$E32*$H32,0)","v":0},null,{"$f":"IF(SUM(AE$23:AE$25)>0,$E32*$H32,0)","v":0},null,{"$f":"IF(SUM(AG$23:AG$25)>0,$E32*$H32,0)","v":0},null,{"$f":"IF(SUM(AI$23:AI$25)>0,$E32*$H32,0)","v":0},null,{"$f":"IF(SUM(AK$23:AK$25)>0,$E32*$H32,0)","v":0},null,{"$f":"IF(SUM(AM$23:AM$25)>0,$E32*$H32,0)","v":0},null,{"$f":"IF(SUM(AO$23:AO$25)>0,$E32*$H32,0)","v":0},null,{"$f":"IF(SUM(AQ$23:AQ$25)>0,$E32*$H32,0)","v":0},null,{"$f":"IF(SUM(AS$23:AS$25)>0,$E32*$H32,0)","v":0},null,{"$f":"IF(SUM(AU$7:AU$12)>0,$E32*$H32,0)","v":0},null,{"$f":"IF(SUM(AW$7:AW$12)>0,$E32*$H32,0)","v":0},null,{"$f":"IF(SUM(AY$7:AY$12)>0,$E32*$H32,0)","v":0},null,{"$f":"IF(SUM(BA$7:BA$12)>0,$E32*$H32,0)","v":0},null,{"$f":"IF(SUM(BC$7:BC$12)>0,$E32*$H32,0)","v":0},null,{"$f":"IF(SUM(BE$7:BE$12)>0,$E32*$H32,0)","v":0},null,{"$f":"IF(SUM(BG$7:BG$12)>0,$E32*$H32,0)","v":0},null,{"$f":"IF(SUM(BI$7:BI$12)>0,$E32*$H32,0)","v":0},null,{"$f":"IF(SUM(BK$7:BK$12)>0,$E32*$H32,0)","v":0},null,{"$f":"IF(SUM(BM$7:BM$12)>0,$E32*$H32,0)","v":0},null,{"$f":"IF(SUM(BO$7:BO$12)>0,$E32*$H32,0)","v":0},null,{"$f":"IF(SUM(BQ$7:BQ$12)>0,$E32*$H32,0)","v":0},null,{"$f":"IF(SUM(BS$7:BS$12)>0,$E32*$H32,0)","v":0},null,{"$f":"IF(SUM(BU$7:BU$12)>0,$E32*$H32,0)","v":0},null,{"$f":"IF(SUM(BW$7:BW$12)>0,$E32*$H32,0)","v":0},null,{"$f":"IF(SUM(BY$7:BY$12)>0,$E32*$H32,0)","v":0},null,{"$f":"IF(SUM(CA$7:CA$12)>0,$E32*$H32,0)","v":0},null,{"$f":"IF(SUM(CC$7:CC$12)>0,$E32*$H32,0)","v":0},null,{"$f":"IF(SUM(CE$7:CE$12)>0,$E32*$H32,0)","v":0},null,{"$f":"IF(SUM(CG$7:CG$12)>0,$E32*$H32,0)","v":0},null,{"$f":"IF(SUM(CI$7:CI$12)>0,$E32*$H32,0)","v":0},null,{"$f":"IF(SUM(CK$7:CK$12)>0,$E32*$H32,0)","v":0},null,{"$f":"IF(SUM(CM$7:CM$12)>0,$E32*$H32,0)","v":0},null,{"$f":"IF(SUM(CO$7:CO$12)>0,$E32*$H32,0)","v":0},null,{"$f":"IF(SUM(CQ$7:CQ$12)>0,$E32*$H32,0)","v":0},null,{"$f":"IF(SUM(CS$7:CS$12)>0,$E32*$H32,0)","v":0},null,{"$f":"IF(SUM(CU$7:CU$12)>0,$E32*$H32,0)","v":0},null,{"$f":"IF(SUM(CW$7:CW$12)>0,$E32*$H32,0)","v":0},null,{"$f":"IF(SUM(CY$7:CY$12)>0,$E32*$H32,0)","v":0},null,{"$f":"IF(SUM(DA$7:DA$12)>0,$E32*$H32,0)","v":0},null,{"$f":"IF(SUM(DC$7:DC$12)>0,$E32*$H32,0)","v":0},null,{"$f":"IF(SUM(DE$7:DE$12)>0,$E32*$H32,0)","v":0},null,{"$f":"IF(SUM(DG$7:DG$12)>0,$E32*$H32,0)","v":0},null,{"$f":"IF(SUM(DI$7:DI$12)>0,$E32*$H32,0)","v":0},null,{"$f":"IF(SUM(DK$7:DK$12)>0,$E32*$H32,0)","v":0},null,{"$f":"IF(SUM(DM$7:DM$12)>0,$E32*$H32,0)","v":0},null,{"$f":"IF(SUM(DO$7:DO$12)>0,$E32*$H32,0)","v":0},null,{"$f":"IF(SUM(DQ$7:DQ$12)>0,$E32*$H32,0)","v":0},null,{"$f":"IF(SUM(DS$7:DS$12)>0,$E32*$H32,0)","v":0},null,{"$f":"IF(SUM(DU$7:DU$12)>0,$E32*$H32,0)","v":0},null,{"$f":"IF(SUM(DW$7:DW$12)>0,$E32*$H32,0)","v":0},null,{"$f":"IF(SUM(DY$7:DY$12)>0,$E32*$H32,0)","v":0}]
[]
[null,null,null,null,null,null,null,null,null,null,{"$f":"SUMPRODUCT(#REF!,#REF!)","v":{"$error":"#REF!"}}]
[null,null,null,null,null,null,null,null,null,null,{"$f":"K34*($H$11+#REF!)","v":{"$error":"#REF!"}}]
[null,null,null,null,null,null,null,null,null,null,{"$f":"K35/12","v":{"$error":"#REF!"}}]
[null,null,null,null,null,null,null,null,null,null,{"$f":"K36/91","v":{"$error":"#REF!"}}]

{"sheet":"EPI","index":20,"n_rows":66,"n_cols":128,"rows_kept":66,"cut":false,"hidden":false,"merged":[[1,1,1,3],[2,1,2,5]]}
[]
[]
[null,"EQUIPAMENTOS DE PROTEÇÃO INDIVIDUAL - AQUISIÇÃO",null,null,null,null,null,null,1,null,{"$f":"I3+1","v":2},null,{"$f":"K3+1","v":3},null,{"$f":"M3+1","v":4},null,{"$f":"O3+1","v":5},null,{"$f":"Q3+1","v":6},null,{"$f":"S3+1","v":7},null,{"$f":"U3+1","v":8},null,{"$f":"W3+1","v":9},null,{"$f":"Y3+1","v":10},null,{"$f":"AA3+1","v":11},null,{"$f":"AC3+1","v":12},null,{"$f":"AE3+1","v":13},null,{"$f":"AG3+1","v":14},null,{"$f":"AI3+1","v":15},null,{"$f":"AK3+1","v":16},null,{"$f":"AM3+1","v":17},null,{"$f":"AO3+1","v":18},null,{"$f":"AQ3+1","v":19},null,{"$f":"AS3+1","v":20},null,{"$f":"AU3+1","v":21},null,{"$f":"AW3+1","v":22},null,{"$f":"AY3+1","v":23},null,{"$f":"BA3+1","v":24},null,{"$f":"BC3+1","v":25},null,{"$f":"BE3+1","v":26},null,{"$f":"BG3+1","v":27},null,{"$f":"BI3+1","v":28},null,{"$f":"BK3+1","v":29},null,{"$f":"BM3+1","v":30},null,{"$f":"BO3+1","v":31},null,{"$f":"BQ3+1","v":32},null,{"$f":"BS3+1","v":33},null,{"$f":"BU3+1","v":34},null,{"$f":"BW3+1","v":35},null,{"$f":"BY3+1","v":36},null,{"$f":"CA3+1","v":37},null,{"$f":"CC3+1","v":38},null,{"$f":"CE3+1","v":39},null,{"$f":"CG3+1","v":40},null,{"$f":"CI3+1","v":41},null,{"$f":"CK3+1","v":42},null,{"$f":"CM3+1","v":43},null,{"$f":"CO3+1","v":44},null,{"$f":"CQ3+1","v":45},null,{"$f":"CS3+1","v":46},null,{"$f":"CU3+1","v":47},null,{"$f":"CW3+1","v":48},null,{"$f":"CY3+1","v":49},null,{"$f":"DA3+1","v":50},null,{"$f":"DC3+1","v":51},null,{"$f":"DE3+1","v":52},null,{"$f":"DG3+1","v":53},null,{"$f":"DI3+1","v":54},null,{"$f":"DK3+1","v":55},null,{"$f":"DM3+1","v":56},null,{"$f":"DO3+1","v":57},null,{"$f":"DQ3+1","v":58},null,{"$f":"DS3+1","v":59},null,{"$f":"DU3+1","v":60}]
[]
[null,null,null,null,null,null,null,null,{"$f":"ROUND(SUM(J4:J67),2)","v":661.77},null,{"$f":"ROUND(SUM(L4:L104),2)","v":696.02},null,{"$f":"ROUND(SUM(N4:N104),2)","v":502.75},null,{"$f":"ROUND(SUM(P4:P104),2)","v":456.67},null,{"$f":"ROUND(SUM(R4:R104),2)","v":1413.84},null,{"$f":"ROUND(SUM(T4:T104),2)","v":1413.84},null,{"$f":"ROUND(SUM(V4:V104),2)","v":0},null,{"$f":"ROUND(SUM(X4:X104),2)","v":0},null,{"$f":"ROUND(SUM(Z4:Z104),2)","v":0},null,{"$f":"ROUND(SUM(AB4:AB104),2)","v":0},null,{"$f":"ROUND(SUM(AD4:AD104),2)","v":0},null,{"$f":"ROUND(SUM(AF4:AF104),2)","v":0},null,{"$f":"ROUND(SUM(AH4:AH104),2)","v":0},null,{"$f":"ROUND(SUM(AJ4:AJ104),2)","v":0},null,{"$f":"ROUND(SUM(AL4:AL104),2)","v":0},null,{"$f":"ROUND(SUM(AN4:AN104),2)","v":0},null,{"$f":"ROUND(SUM(AP4:AP104),2)","v":0},null,{"$f":"ROUND(SUM(AR4:AR104),2)","v":0},null,{"$f":"ROUND(SUM(AT4:AT104),2)","v":0},null,{"$f":"ROUND(SUM(AV4:AV104),2)","v":0},null,{"$f":"ROUND(SUM(AX4:AX104),2)","v":0},null,{"$f":"ROUND(SUM(AZ4:AZ104),2)","v":0},null,{"$f":"ROUND(SUM(BB4:BB104),2)","v":0},null,{"$f":"ROUND(SUM(BD4:BD104),2)","v":0},null,{"$f":"ROUND(SUM(BF4:BF104),2)","v":0},null,{"$f":"ROUND(SUM(BH4:BH104),2)","v":0},null,{"$f":"ROUND(SUM(BJ4:BJ104),2)","v":0},null,{"$f":"ROUND(SUM(BL4:BL104),2)","v":0},null,{"$f":"ROUND(SUM(BN4:BN104),2)","v":0},null,{"$f":"ROUND(SUM(BP4:BP104),2)","v":0},null,{"$f":"ROUND(SUM(BR4:BR104),2)","v":0},null,{"$f":"ROUND(SUM(BT4:BT104),2)","v":0},null,{"$f":"ROUND(SUM(BV4:BV104),2)","v":0},null,{"$f":"ROUND(SUM(BX4:BX104),2)","v":0},null,{"$f":"ROUND(SUM(BZ4:BZ104),2)","v":0},null,{"$f":"ROUND(SUM(CB4:CB104),2)","v":0},null,{"$f":"ROUND(SUM(CD4:CD104),2)","v":0},null,{"$f":"ROUND(SUM(CF4:CF104),2)","v":0},null,{"$f":"ROUND(SUM(CH4:CH104),2)","v":0},null,{"$f":"ROUND(SUM(CJ4:CJ104),2)","v":0},null,{"$f":"ROUND(SUM(CL4:CL104),2)","v":0},null,{"$f":"ROUND(SUM(CN4:CN104),2)","v":0},null,{"$f":"ROUND(SUM(CP4:CP104),2)","v":0},null,{"$f":"ROUND(SUM(CR4:CR104),2)","v":0},null,{"$f":"ROUND(SUM(CT4:CT104),2)","v":0},null,{"$f":"ROUND(SUM(CV4:CV104),2)","v":0},null,{"$f":"ROUND(SUM(CX4:CX104),2)","v":0},null,{"$f":"ROUND(SUM(CZ4:CZ104),2)","v":0},null,{"$f":"ROUND(SUM(DB4:DB104),2)","v":0},null,{"$f":"ROUND(SUM(DD4:DD104),2)","v":0},null,{"$f":"ROUND(SUM(DF4:DF104),2)","v":0},null,{"$f":"ROUND(SUM(DH4:DH104),2)","v":0},null,{"$f":"ROUND(SUM(DJ4:DJ104),2)","v":0},null,{"$f":"ROUND(SUM(DL4:DL104),2)","v":0},null,{"$f":"ROUND(SUM(DN4:DN104),2)","v":0},null,{"$f":"ROUND(SUM(DP4:DP104),2)","v":0},null,{"$f":"ROUND(SUM(DR4:DR104),2)","v":0},null,{"$f":"ROUND(SUM(DT4:DT104),2)","v":0},null,{"$f":"ROUND(SUM(DV4:DV104),2)","v":0},null,{"$f":"ROUND(SUM(DX4:DX104),2)","v":0}]
[null,null,"CATEGORIAS",null,null,"QUANTIDADE"]
[null,null,null,null,null,null,null,null,{"$f":"IF($C7=I$3,1,0)","v":0},null,{"$f":"IF($C7=K$3,1,0)","v":0},null,{"$f":"IF($C7=M$3,1,0)","v":0},null,{"$f":"IF($C7=O$3,1,0)","v":0},null,{"$f":"IF($C7=Q$3,1,0)","v":0},null,{"$f":"IF($C7=S$3,1,0)","v":0},null,{"$f":"IF($C7=U$3,1,0)","v":0},null,{"$f":"IF($C7=W$3,1,0)","v":0},null,{"$f":"IF($C7=Y$3,1,0)","v":0},null,{"$f":"IF($C7=AA$3,1,0)","v":0},null,{"$f":"IF($C7=AC$3,1,0)","v":0},null,{"$f":"IF($C7=AE$3,1,0)","v":0},null,{"$f":"IF($C7=AG$3,1,0)","v":0},null,{"$f":"IF($C7=AI$3,1,0)","v":0},null,{"$f":"IF($C7=AK$3,1,0)","v":0},null,{"$f":"IF($C7=AM$3,1,0)","v":0},null,{"$f":"IF($C7=AO$3,1,0)","v":0},null,{"$f":"IF($C7=AQ$3,1,0)","v":0},null,{"$f":"IF($C7=AS$3,1,0)","v":0}]
[null,null,1,{"$f":"HLOOKUP($C8,'Dados Gerais'!$D$5:$BK$10,6)","v":"BOMBEIRO HIDRÁULICO DE MANUTENÇÃO"},null,{"$f":"HLOOKUP($C8,'Dados Gerais'!$D$5:$BK$14,10)","v":1},null,null,{"$f":"IF($C8=I$3,1,0)","v":1},null,0,null,0,null,0,null,0,null,0,null,0,null,0,null,0,null,0,null,0,null,{"$f":"IF($C8=AE$3,1,0)","v":0},null,0,null,0,null,0,null,0,null,0,null,0,null,0,null,{"$f":"IF($C8=AU$3,1,0)","v":0},null,{"$f":"IF($C8=AW$3,1,0)","v":0},null,{"$f":"IF($C8=AY$3,1,0)","v":0},null,{"$f":"IF($C8=BA$3,1,0)","v":0},null,{"$f":"IF($C8=BC$3,1,0)","v":0},null,{"$f":"IF($C8=BE$3,1,0)","v":0},null,{"$f":"IF($C8=BG$3,1,0)","v":0},null,{"$f":"IF($C8=BI$3,1,0)","v":0},null,{"$f":"IF($C8=BK$3,1,0)","v":0},null,{"$f":"IF($C8=BM$3,1,0)","v":0},null,{"$f":"IF($C8=BO$3,1,0)","v":0},null,{"$f":"IF($C8=BQ$3,1,0)","v":0},null,{"$f":"IF($C8=BS$3,1,0)","v":0},null,{"$f":"IF($C8=BU$3,1,0)","v":0},null,{"$f":"IF($C8=BW$3,1,0)","v":0},null,{"$f":"IF($C8=BY$3,1,0)","v":0},null,{"$f":"IF($C8=CA$3,1,0)","v":0},null,{"$f":"IF($C8=CC$3,1,0)","v":0},null,{"$f":"IF($C8=CE$3,1,0)","v":0},null,{"$f":"IF($C8=CG$3,1,0)","v":0},null,{"$f":"IF($C8=CI$3,1,0)","v":0},null,{"$f":"IF($C8=CK$3,1,0)","v":0},null,{"$f":"IF($C8=CM$3,1,0)","v":0},null,{"$f":"IF($C8=CO$3,1,0)","v":0},null,{"$f":"IF($C8=CQ$3,1,0)","v":0},null,{"$f":"IF($C8=CS$3,1,0)","v":0},null,{"$f":"IF($C8=CU$3,1,0)","v":0},null,{"$f":"IF($C8=CW$3,1,0)","v":0},null,{"$f":"IF($C8=CY$3,1,0)","v":0},null,{"$f":"IF($C8=DA$3,1,0)","v":0},null,{"$f":"IF($C8=DC$3,1,0)","v":0},null,{"$f":"IF($C8=DE$3,1,0)","v":0},null,{"$f":"IF($C8=DG$3,1,0)","v":0},null,{"$f":"IF($C8=DI$3,1,0)","v":0},null,{"$f":"IF($C8=DK$3,1,0)","v":0},null,{"$f":"IF($C8=DM$3,1,0)","v":0},null,{"$f":"IF($C8=DO$3,1,0)","v":0},null,{"$f":"IF($C8=DQ$3,1,0)","v":0},null,{"$f":"IF($C8=DS$3,1,0)","v":0},null,{"$f":"IF($C8=DU$3,1,0)","v":0},null,{"$f":"IF($C8=DW$3,1,0)","v":0}]
[null,null,null,null,null,null,null,null,{"$f":"IF($C9=I$3,1,0)","v":0},null,0,null,0,null,0,null,0,null,0,null,0,null,0,null,0,null,0,null,0,null,{"$f":"IF($C9=AE$3,1,0)","v":0},null,0,null,0,null,0,null,0,null,0,null,0,null,0]
[]
[null,null,"ITEM","DESCRIÇÃO","QUANT ANUAL POR POSTO","VALOR"]
[]
[null,null,1,"Luva de segurança em látex, espessura de 0,60mm, forrada internamente com flocos de algodão, palma antiderrapante., marca ref. MUCAMBO",12,6.6,null,null,null,{"$f":"IF(SUM(I$7:I$9)>0,$E13*$F13,0)","v":79.199999999999989},null,{"$f":"IF(SUM(K$7:K$9)>0,$E13*$F13,0)","v":0},null,{"$f":"IF(SUM(M$7:M$9)>0,$E13*$F13,0)","v":0},null,{"$f":"IF(SUM(O$7:O$9)>0,$E13*$F13,0)","v":0},null,{"$f":"IF(SUM(Q$7:Q$9)>0,$E13*$F13,0)","v":0},null,{"$f":"IF(SUM(S$7:S$9)>0,$E13*$F13,0)","v":0},null,{"$f":"IF(SUM(U$7:U$9)>0,$E13*$F13,0)","v":0},null,{"$f":"IF(SUM(W$7:W$9)>0,$E13*$F13,0)","v":0},null,{"$f":"IF(SUM(Y$7:Y$9)>0,$E13*$F13,0)","v":0},null,{"$f":"IF(SUM(AA$7:AA$9)>0,$E13*$F13,0)","v":0},null,{"$f":"IF(SUM(AC$7:AC$9)>0,$E13*$F13,0)","v":0},null,{"$f":"IF(SUM(AE$7:AE$9)>0,$E13*$F13,0)","v":0},null,{"$f":"IF(SUM(AG$7:AG$9)>0,$E13*$F13,0)","v":0},null,{"$f":"IF(SUM(AI$7:AI$9)>0,$E13*$F13,0)","v":0},null,{"$f":"IF(SUM(AK$7:AK$9)>0,$E13*$F13,0)","v":0},null,{"$f":"IF(SUM(AM$7:AM$9)>0,$E13*$F13,0)","v":0},null,{"$f":"IF(SUM(AO$7:AO$9)>0,$E13*$F13,0)","v":0},null,{"$f":"IF(SUM(AQ$7:AQ$9)>0,$E13*$F13,0)","v":0},null,{"$f":"IF(SUM(AS$7:AS$9)>0,$E13*$F13,0)","v":0},null,{"$f":"IF(SUM(AU$7:AU$9)>0,$E13*$F13,0)","v":0},null,{"$f":"IF(SUM(AW$7:AW$9)>0,$E13*$F13,0)","v":0},null,{"$f":"IF(SUM(AY$7:AY$9)>0,$E13*$F13,0)","v":0},null,{"$f":"IF(SUM(BA$7:BA$9)>0,$E13*$F13,0)","v":0},null,{"$f":"IF(SUM(BC$7:BC$9)>0,$E13*$F13,0)","v":0},null,{"$f":"IF(SUM(BE$7:BE$9)>0,$E13*$F13,0)","v":0},null,{"$f":"IF(SUM(BG$7:BG$9)>0,$E13*$F13,0)","v":0},null,{"$f":"IF(SUM(BI$7:BI$9)>0,$E13*$F13,0)","v":0},null,{"$f":"IF(SUM(BK$7:BK$9)>0,$E13*$F13,0)","v":0},null,{"$f":"IF(SUM(BM$7:BM$9)>0,$E13*$F13,0)","v":0},null,{"$f":"IF(SUM(BO$7:BO$9)>0,$E13*$F13,0)","v":0},null,{"$f":"IF(SUM(BQ$7:BQ$9)>0,$E13*$F13,0)","v":0},null,{"$f":"IF(SUM(BS$7:BS$9)>0,$E13*$F13,0)","v":0},null,{"$f":"IF(SUM(BU$7:BU$9)>0,$E13*$F13,0)","v":0},null,{"$f":"IF(SUM(BW$7:BW$9)>0,$E13*$F13,0)","v":0},null,{"$f":"IF(SUM(BY$7:BY$9)>0,$E13*$F13,0)","v":0},null,{"$f":"IF(SUM(CA$7:CA$9)>0,$E13*$F13,0)","v":0},null,{"$f":"IF(SUM(CC$7:CC$9)>0,$E13*$F13,0)","v":0},null,{"$f":"IF(SUM(CE$7:CE$9)>0,$E13*$F13,0)","v":0},null,{"$f":"IF(SUM(CG$7:CG$9)>0,$E13*$F13,0)","v":0},null,{"$f":"IF(SUM(CI$7:CI$9)>0,$E13*$F13,0)","v":0},null,{"$f":"IF(SUM(CK$7:CK$9)>0,$E13*$F13,0)","v":0},null,{"$f":"IF(SUM(CM$7:CM$9)>0,$E13*$F13,0)","v":0},null,{"$f":"IF(SUM(CO$7:CO$9)>0,$E13*$F13,0)","v":0},null,{"$f":"IF(SUM(CQ$7:CQ$9)>0,$E13*$F13,0)","v":0},null,{"$f":"IF(SUM(CS$7:CS$9)>0,$E13*$F13,0)","v":0},null,{"$f":"IF(SUM(CU$7:CU$9)>0,$E13*$F13,0)","v":0},null,{"$f":"IF(SUM(CW$7:CW$9)>0,$E13*$F13,0)","v":0},null,{"$f":"IF(SUM(CY$7:CY$9)>0,$E13*$F13,0)","v":0},null,{"$f":"IF(SUM(DA$7:DA$9)>0,$E13*$F13,0)","v":0},null,{"$f":"IF(SUM(DC$7:DC$9)>0,$E13*$F13,0)","v":0},null,{"$f":"IF(SUM(DE$7:DE$9)>0,$E13*$F13,0)","v":0},null,{"$f":"IF(SUM(DG$7:DG$9)>0,$E13*$F13,0)","v":0},null,{"$f":"IF(SUM(DI$7:DI$9)>0,$E13*$F13,0)","v":0},null,{"$f":"IF(SUM(DK$7:DK$9)>0,$E13*$F13,0)","v":0},null,{"$f":"IF(SUM(DM$7:DM$9)>0,$E13*$F13,0)","v":0},null,{"$f":"IF(SUM(DO$7:DO$9)>0,$E13*$F13,0)","v":0},null,{"$f":"IF(SUM(DQ$7:DQ$9)>0,$E13*$F13,0)","v":0},null,{"$f":"IF(SUM(DS$7:DS$9)>0,$E13*$F13,0)","v":0},null,{"$f":"IF(SUM(DU$7:DU$9)>0,$E13*$F13,0)","v":0},null,{"$f":"IF(SUM(DW$7:DW$9)>0,$E13*$F13,0)","v":0}]
[null,null,2,"Luva de malha tricotada em fios de algodão com acabamento em overloque e palmas pigmentadas em PVC. Ref. LEDAN",4,12.4,null,null,null,{"$f":"IF(SUM(I$7:I$9)>0,$E14*$F14,0)","v":49.6},null,0,null,0,null,0,null,0,null,0,null,0,null,0,null,0,null,0,null,0,null,0,null,0,null,0,null,0,null,0,null,0,null,0,null,0,null,0,null,0,null,0,null,0,null,0,null,0,null,0,null,0,null,0,null,0,null,0,null,0,null,0,null,0,null,0,null,0,null,0,null,0,null,0,null,0,null,0,null,0,null,0,null,0,null,0,null,0,null,0,null,0,null,0,null,0,null,0,null,0,null,0,null,0,null,0,null,0,null,0,null,0,null,0,null,0,null,0]
[null,null,3,"Óculos de segurança constituídos de armação e visor confeccionados em uma única peça de policarbonato INCOLOR, anti-risco, apoio nasal de plástico maleável. Hastes emborrachadas. Ref.: 3M Virtua V4",4,31.71,null,null,null,126.84,null,0,null,0,null,0,null,0,null,0,null,0,null,0,null,0,null,0,null,0,null,0,null,0,null,0,null,0,null,0,null,0,null,0,null,0,null,0,null,0,null,0,null,0,null,0,null,0,null,0,null,0,null,0,null,0,null,0,null,0,null,0,null,0,null,0,null,0,null,0,null,0,null,0,null,0,null,0,null,0,null,0,null,0,null,0,null,0,null,0,null,0,null,0,null,0,null,0,null,0,null,0,null,0,null,0,null,0,null,0,null,0,null,0,null,0,null,0]
[null,null,4,"Capacete de segurança em polietileno de alta densidade, na cor VERMELHA, aba frontal, suspensão em tecido, com Faixa anti-suor, regulagem de tamanho com ajuste simples, com jugular ajustável. MARCA(S) DE REFERÊNCIA:Ref: MSA",1,47.66,null,null,null,47.66,null,0,null,0,null,0,null,0,null,0,null,0,null,0,null,0,null,0,null,0,null,0,null,0,null,0,null,0,null,0,null,0,null,0,null,0,null,0,null,0,null,0,null,0,null,0,null,0,null,0,null,0,null,0,null,0,null,0,null,0,null,0,null,0,null,0,null,0,null,0,null,0,null,0,null,0,null,0,null,0,null,0,null,0,null,0,null,0,null,0,null,0,null,0,null,0,null,0,null,0,null,0,null,0,null,0,null,0,null,0,null,0,null,0,null,0,null,0]
[null,null,5,"Botina de segurança, fechamento em elástico, sem componentes metálicos, confeccionada em couro curtido ao cromo, na cor preta, elásticos laterais, BIQUEIRA EM COMPOSITE ou POLIPROPILENO, solado de poliuretano bidensidade injetado diretamente ao cabedal, solado com perfil antiderrapante e sistemas de absorção de impacto. Com selo conforto. Em conformidade com as Normas de segurança da ABNT NBR ISO 20344 e 20347. Ref.: MARLUVAS.",2,148.97999999999999,null,null,null,297.95999999999998,null,{"$f":"IF(SUM(K$7:K$9)>0,$E17*$F17,0)","v":0},null,{"$f":"IF(SUM(M$7:M$9)>0,$E17*$F17,0)","v":0},null,{"$f":"IF(SUM(O$7:O$9)>0,$E17*$F17,0)","v":0},null,{"$f":"IF(SUM(Q$7:Q$9)>0,$E17*$F17,0)","v":0},null,{"$f":"IF(SUM(S$7:S$9)>0,$E17*$F17,0)","v":0},null,{"$f":"IF(SUM(U$7:U$9)>0,$E17*$F17,0)","v":0},null,{"$f":"IF(SUM(W$7:W$9)>0,$E17*$F17,0)","v":0},null,{"$f":"IF(SUM(Y$7:Y$9)>0,$E17*$F17,0)","v":0},null,{"$f":"IF(SUM(AA$7:AA$9)>0,$E17*$F17,0)","v":0},null,{"$f":"IF(SUM(AC$7:AC$9)>0,$E17*$F17,0)","v":0},null,{"$f":"IF(SUM(AE$7:AE$9)>0,$E17*$F17,0)","v":0},null,{"$f":"IF(SUM(AG$7:AG$9)>0,$E17*$F17,0)","v":0},null,{"$f":"IF(SUM(AI$7:AI$9)>0,$E17*$F17,0)","v":0},null,{"$f":"IF(SUM(AK$7:AK$9)>0,$E17*$F17,0)","v":0},null,{"$f":"IF(SUM(AM$7:AM$9)>0,$E17*$F17,0)","v":0},null,{"$f":"IF(SUM(AO$7:AO$9)>0,$E17*$F17,0)","v":0},null,{"$f":"IF(SUM(AQ$7:AQ$9)>0,$E17*$F17,0)","v":0},null,{"$f":"IF(SUM(AS$7:AS$9)>0,$E17*$F17,0)","v":0},null,0,null,0,null,0,null,0,null,0,null,0,null,0,null,0,null,0,null,0,null,0,null,0,null,0,null,0,null,0,null,0,null,0,null,0,null,0,null,0,null,0,null,0,null,0,null,0,null,0,null,0,null,0,null,0,null,0,null,0,null,0,null,0,null,0,null,0,null,0,null,0,null,0,null,0,null,0,null,0,null,0]
[null,null,6,"Bota em PVC, impermeável, forrada internamente, cano médio. Ref. PEGA FORTE. ",1,47.93,null,null,null,47.93,null,0,null,0,null,0,null,0,null,0,null,0,null,0,null,0,null,0,null,0,null,0,null,0,null,0,null,0,null,0,null,0,null,0,null,0,null,0,null,0,null,0,null,0,null,0,null,0,null,0,null,0,null,0,null,0,null,0,null,0,null,0,null,0,null,0,null,0,null,0,null,0,null,0,null,0,null,0,null,0,null,0,null,0,null,0,null,0,null,0,null,0,null,0,null,0,null,0,null,0,null,0,null,0,null,0,null,0,null,0,null,0,null,0,null,0,null,0]
[null,null,7,"Boné tipo Touca Árabe confeccionado em helanca com viés na aba, elástico interno traseiro para ajuste de tamanho, fechamento da saia em velcro. ",1,12.58,null,null,null,12.58,null,0,null,0,null,0,null,0,null,0,null,0,null,0,null,0,null,0,null,0,null,0,null,0,null,0,null,0,null,0,null,0,null,0,null,0,null,0,null,0,null,0,null,0,null,0,null,0,null,0,null,0,null,0,null,0,null,0,null,0,null,0,null,0,null,0,null,0,null,0,null,0,null,0,null,0,null,0,null,0,null,0,null,0,null,0,null,0,null,0,null,0,null,0,null,0,null,0,null,0,null,0,null,0,null,0,null,0,null,0,null,0,null,0,null,0,null,0]
[]
[null,null,"CATEGORIAS",null,null,"QUANTIDADE"]
[null,null,null,null,null,null,null,null,{"$f":"IF($C22=I$3,1,0)","v":0},null,{"$f":"IF($C22=K$3,1,0)","v":0},null,{"$f":"IF($C22=M$3,1,0)","v":0},null,{"$f":"IF($C22=O$3,1,0)","v":0},null,{"$f":"IF($C22=Q$3,1,0)","v":0},null,{"$f":"IF($C22=S$3,1,0)","v":0},null,{"$f":"IF($C22=U$3,1,0)","v":0},null,{"$f":"IF($C22=W$3,1,0)","v":0},null,{"$f":"IF($C22=Y$3,1,0)","v":0},null,{"$f":"IF($C22=AA$3,1,0)","v":0},null,{"$f":"IF($C22=AC$3,1,0)","v":0},null,{"$f":"IF($C22=AE$3,1,0)","v":0},null,{"$f":"IF($C22=AG$3,1,0)","v":0},null,{"$f":"IF($C22=AI$3,1,0)","v":0},null,{"$f":"IF($C22=AK$3,1,0)","v":0},null,{"$f":"IF($C22=AM$3,1,0)","v":0},null,{"$f":"IF($C22=AO$3,1,0)","v":0},null,{"$f":"IF($C22=AQ$3,1,0)","v":0},null,{"$f":"IF($C22=AS$3,1,0)","v":0}]
[null,null,2,{"$f":"HLOOKUP($C23,'Dados Gerais'!$D$5:$BK$10,6)","v":"ENCARREGADO DE INSTALAÇÕES"},null,{"$f":"HLOOKUP($C23,'Dados Gerais'!$D$5:$BK$14,10)","v":1},null,null,{"$f":"IF($C23=I$3,1,0)","v":0},{"$f":"IF($C23=J$3,1,0)","v":0},1,0,0,0,0,0,0,0,0,0,0,0,0,0,0,0,0,0,0,0,{"$f":"IF($C23=AE$3,1,0)","v":0},0,0,0,0,0,0,0,0,0,0,0,0,0,0,0,{"$f":"IF($C23=AU$3,1,0)","v":0},0,{"$f":"IF($C23=AW$3,1,0)","v":0},0,{"$f":"IF($C23=AY$3,1,0)","v":0},0,{"$f":"IF($C23=BA$3,1,0)","v":0},0,{"$f":"IF($C23=BC$3,1,0)","v":0},0,{"$f":"IF($C23=BE$3,1,0)","v":0},0,{"$f":"IF($C23=BG$3,1,0)","v":0},0,{"$f":"IF($C23=BI$3,1,0)","v":0},0,{"$f":"IF($C23=BK$3,1,0)","v":0},0,{"$f":"IF($C23=BM$3,1,0)","v":0},0,{"$f":"IF($C23=BO$3,1,0)","v":0},0,{"$f":"IF($C23=BQ$3,1,0)","v":0},0,{"$f":"IF($C23=BS$3,1,0)","v":0},0,{"$f":"IF($C23=BU$3,1,0)","v":0},0,{"$f":"IF($C23=BW$3,1,0)","v":0},0,{"$f":"IF($C23=BY$3,1,0)","v":0},0,{"$f":"IF($C23=CA$3,1,0)","v":0},0,{"$f":"IF($C23=CC$3,1,0)","v":0},0,{"$f":"IF($C23=CE$3,1,0)","v":0},0,{"$f":"IF($C23=CG$3,1,0)","v":0},0,{"$f":"IF($C23=CI$3,1,0)","v":0},0,{"$f":"IF($C23=CK$3,1,0)","v":0},0,{"$f":"IF($C23=CM$3,1,0)","v":0},0,{"$f":"IF($C23=CO$3,1,0)","v":0},0,{"$f":"IF($C23=CQ$3,1,0)","v":0},0,{"$f":"IF($C23=CS$3,1,0)","v":0},0,{"$f":"IF($C23=CU$3,1,0)","v":0},0,{"$f":"IF($C23=CW$3,1,0)","v":0},0,{"$f":"IF($C23=CY$3,1,0)","v":0},0,{"$f":"IF($C23=DA$3,1,0)","v":0},0,{"$f":"IF($C23=DC$3,1,0)","v":0},0,{"$f":"IF($C23=DE$3,1,0)","v":0},0,{"$f":"IF($C23=DG$3,1,0)","v":0},0,{"$f":"IF($C23=DI$3,1,0)","v":0},0,{"$f":"IF($C23=DK$3,1,0)","v":0},0,{"$f":"IF($C23=DM$3,1,0)","v":0},0,{"$f":"IF($C23=DO$3,1,0)","v":0},0,{"$f":"IF($C23=DQ$3,1,0)","v":0},0,{"$f":"IF($C23=DS$3,1,0)","v":0},0,{"$f":"IF($C23=DU$3,1,0)","v":0},0,{"$f":"IF($C23=DW$3,1,0)","v":0},0]
[null,null,null,null,null,null,null,null,{"$f":"IF($C24=I$3,1,0)","v":0},null,0,null,0,null,0,null,0,null,0,null,0,null,0,null,0,null,0,null,0,null,{"$f":"IF($C24=AE$3,1,0)","v":0},null,0,null,0,null,0,null,0,null,0,null,0,null,0]
[]
[null,null,"ITEM","DESCRIÇÃO","QUANT ANUAL POR POSTO","VALOR"]
[]
[null,null,1,"Luva de malha tricotada em fios de algodão com acabamento em overloque e palmas pigmentadas em PVC. Ref. LEDAN",5,{"$f":"F14","v":12.4},null,null,null,{"$f":"IF(SUM(I$22:I$24)>0,$E28*$F28,0)","v":0},null,{"$f":"IF(SUM(K$22:K$24)>0,$E28*$F28,0)","v":62},null,{"$f":"IF(SUM(M$22:M$24)>0,$E28*$F28,0)","v":0},null,{"$f":"IF(SUM(O$22:O$24)>0,$E28*$F28,0)","v":0},null,{"$f":"IF(SUM(Q$22:Q$24)>0,$E28*$F28,0)","v":0},null,{"$f":"IF(SUM(S$22:S$24)>0,$E28*$F28,0)","v":0},null,{"$f":"IF(SUM(U$22:U$24)>0,$E28*$F28,0)","v":0},null,{"$f":"IF(SUM(W$22:W$24)>0,$E28*$F28,0)","v":0},null,{"$f":"IF(SUM(Y$22:Y$24)>0,$E28*$F28,0)","v":0},null,{"$f":"IF(SUM(AA$22:AA$24)>0,$E28*$F28,0)","v":0},null,{"$f":"IF(SUM(AC$22:AC$24)>0,$E28*$F28,0)","v":0},null,{"$f":"IF(SUM(AE$22:AE$24)>0,$E28*$F28,0)","v":0},null,{"$f":"IF(SUM(AG$22:AG$24)>0,$E28*$F28,0)","v":0},null,{"$f":"IF(SUM(AI$22:AI$24)>0,$E28*$F28,0)","v":0},null,{"$f":"IF(SUM(AK$22:AK$24)>0,$E28*$F28,0)","v":0},null,{"$f":"IF(SUM(AM$22:AM$24)>0,$E28*$F28,0)","v":0},null,{"$f":"IF(SUM(AO$22:AO$24)>0,$E28*$F28,0)","v":0},null,{"$f":"IF(SUM(AQ$22:AQ$24)>0,$E28*$F28,0)","v":0},null,{"$f":"IF(SUM(AS$22:AS$24)>0,$E28*$F28,0)","v":0},null,{"$f":"IF(SUM(AU$22:AU$24)>0,$E28*$F28,0)","v":0},null,{"$f":"IF(SUM(AW$22:AW$24)>0,$E28*$F28,0)","v":0},null,{"$f":"IF(SUM(AY$22:AY$24)>0,$E28*$F28,0)","v":0},null,{"$f":"IF(SUM(BA$22:BA$24)>0,$E28*$F28,0)","v":0},null,{"$f":"IF(SUM(BC$22:BC$24)>0,$E28*$F28,0)","v":0},null,{"$f":"IF(SUM(BE$22:BE$24)>0,$E28*$F28,0)","v":0},null,{"$f":"IF(SUM(BG$22:BG$24)>0,$E28*$F28,0)","v":0},null,{"$f":"IF(SUM(BI$22:BI$24)>0,$E28*$F28,0)","v":0},null,{"$f":"IF(SUM(BK$22:BK$24)>0,$E28*$F28,0)","v":0},null,{"$f":"IF(SUM(BM$22:BM$24)>0,$E28*$F28,0)","v":0},null,{"$f":"IF(SUM(BO$22:BO$24)>0,$E28*$F28,0)","v":0},null,{"$f":"IF(SUM(BQ$22:BQ$24)>0,$E28*$F28,0)","v":0},null,{"$f":"IF(SUM(BS$22:BS$24)>0,$E28*$F28,0)","v":0},null,{"$f":"IF(SUM(BU$22:BU$24)>0,$E28*$F28,0)","v":0},null,{"$f":"IF(SUM(BW$22:BW$24)>0,$E28*$F28,0)","v":0},null,{"$f":"IF(SUM(BY$22:BY$24)>0,$E28*$F28,0)","v":0},null,{"$f":"IF(SUM(CA$22:CA$24)>0,$E28*$F28,0)","v":0},null,{"$f":"IF(SUM(CC$22:CC$24)>0,$E28*$F28,0)","v":0},null,{"$f":"IF(SUM(CE$22:CE$24)>0,$E28*$F28,0)","v":0},null,{"$f":"IF(SUM(CG$22:CG$24)>0,$E28*$F28,0)","v":0},null,{"$f":"IF(SUM(CI$22:CI$24)>0,$E28*$F28,0)","v":0},null,{"$f":"IF(SUM(CK$22:CK$24)>0,$E28*$F28,0)","v":0},null,{"$f":"IF(SUM(CM$22:CM$24)>0,$E28*$F28,0)","v":0},null,{"$f":"IF(SUM(CO$22:CO$24)>0,$E28*$F28,0)","v":0},null,{"$f":"IF(SUM(CQ$22:CQ$24)>0,$E28*$F28,0)","v":0},null,{"$f":"IF(SUM(CS$22:CS$24)>0,$E28*$F28,0)","v":0},null,{"$f":"IF(SUM(CU$22:CU$24)>0,$E28*$F28,0)","v":0},null,{"$f":"IF(SUM(CW$22:CW$24)>0,$E28*$F28,0)","v":0},null,{"$f":"IF(SUM(CY$22:CY$24)>0,$E28*$F28,0)","v":0},null,{"$f":"IF(SUM(DA$22:DA$24)>0,$E28*$F28,0)","v":0},null,{"$f":"IF(SUM(DC$22:DC$24)>0,$E28*$F28,0)","v":0},null,{"$f":"IF(SUM(DE$22:DE$24)>0,$E28*$F28,0)","v":0},null,{"$f":"IF(SUM(DG$22:DG$24)>0,$E28*$F28,0)","v":0},null,{"$f":"IF(SUM(DI$22:DI$24)>0,$E28*$F28,0)","v":0},null,{"$f":"IF(SUM(DK$22:DK$24)>0,$E28*$F28,0)","v":0},null,{"$f":"IF(SUM(DM$22:DM$24)>0,$E28*$F28,0)","v":0},null,{"$f":"IF(SUM(DO$22:DO$24)>0,$E28*$F28,0)","v":0},null,{"$f":"IF(SUM(DQ$22:DQ$24)>0,$E28*$F28,0)","v":0},null,{"$f":"IF(SUM(DS$22:DS$24)>0,$E28*$F28,0)","v":0},null,{"$f":"IF(SUM(DU$22:DU$24)>0,$E28*$F28,0)","v":0},null,{"$f":"IF(SUM(DW$22:DW$24)>0,$E28*$F28,0)","v":0}]
[null,null,2,"Óculos de segurança constituídos de armação e visor confeccionados em uma única peça de policarbonato INCOLOR, anti-risco, apoio nasal de plástico maleável. Hastes emborrachadas. Ref.: 3M Virtua V4",4,{"$f":"F15","v":31.71},null,null,null,{"$f":"IF(SUM(I$22:I$24)>0,$E29*$F29,0)","v":0},null,126.84,null,0,null,0,null,0,null,0,null,0,null,0,null,0,null,0,null,0,null,0,null,0,null,0,null,0,null,0,null,0,null,0,null,0,null,0,null,0,null,0,null,0,null,0,null,0,null,0,null,0,null,0,null,0,null,0,null,0,null,0,null,0,null,0,null,0,null,0,null,0,null,0,null,0,null,0,null,0,null,0,null,0,null,0,null,0,null,0,null,0,null,0,null,0,null,0,null,0,null,0,null,0,null,0,null,0,null,0,null,0,null,0,null,0,null,0]
[null,null,3,"Capacete de segurança em polietileno de alta densidade, na cor VERMELHA, aba frontal, suspensão em tecido, com Faixa anti-suor, regulagem de tamanho com ajuste simples, com jugular ajustável. MARCA(S) DE REFERÊNCIA:Ref: MSA",1,{"$f":"F16","v":47.66},null,null,null,0,null,{"$f":"IF(SUM(K$22:K$24)>0,$E30*$F30,0)","v":47.66},null,0,null,0,null,0,null,0,null,0,null,0,null,0,null,0,null,0,null,0,null,0,null,0,null,0,null,0,null,0,null,0,null,0,null,0,null,0,null,0,null,0,null,0,null,0,null,0,null,0,null,0,null,0,null,0,null,0,null,0,null,0,null,0,null,0,null,0,null,0,null,0,null,0,null,0,null,0,null,0,null,0,null,0,null,0,null,0,null,0,null,0,null,0,null,0,null,0,null,0,null,0,null,0,null,0,null,0,null,0,null,0,null,0,null,0]
[null,null,4,"Botina de segurança, fechamento em elástico, sem componentes metálicos, confeccionada em couro curtido ao cromo, na cor preta, elásticos laterais, BIQUEIRA EM COMPOSITE ou POLIPROPILENO, solado de poliuretano bidensidade injetado diretamente ao cabedal, solado com perfil antiderrapante e sistemas de absorção de impacto. Com selo conforto. Em conformidade com as Normas de segurança da ABNT NBR ISO 20344 e 20347. Ref.: MARLUVAS.",3,{"$f":"F17","v":148.97999999999999},null,null,null,0,null,446.93999999999994,null,0,null,0,null,0,null,0,null,0,null,0,null,0,null,0,null,0,null,0,null,0,null,0,null,0,null,0,null,0,null,0,null,0,null,0,null,0,null,0,null,0,null,0,null,0,null,0,null,0,null,0,null,0,null,0,null,0,null,0,null,0,null,0,null,0,null,0,null,0,null,0,null,0,null,0,null,0,null,0,null,0,null,0,null,0,null,0,null,0,null,0,null,0,null,0,null,0,null,0,null,0,null,0,null,0,null,0,null,0,null,0,null,0,null,0]
[null,null,5,"Boné tipo Touca Árabe confeccionado em helanca com viés na aba, elástico interno traseiro para ajuste de tamanho, fechamento da saia em velcro. ",1,{"$f":"F19","v":12.58},null,null,null,{"$f":"IF(SUM(I$22:I$24)>0,$E32*$F32,0)","v":0},null,{"$f":"IF(SUM(K$22:K$24)>0,$E32*$F32,0)","v":12.58},null,{"$f":"IF(SUM(M$22:M$24)>0,$E32*$F32,0)","v":0},null,{"$f":"IF(SUM(O$22:O$24)>0,$E32*$F32,0)","v":0},null,{"$f":"IF(SUM(Q$22:Q$24)>0,$E32*$F32,0)","v":0},null,{"$f":"IF(SUM(S$22:S$24)>0,$E32*$F32,0)","v":0},null,{"$f":"IF(SUM(U$22:U$24)>0,$E32*$F32,0)","v":0},null,{"$f":"IF(SUM(W$22:W$24)>0,$E32*$F32,0)","v":0},null,{"$f":"IF(SUM(Y$22:Y$24)>0,$E32*$F32,0)","v":0},null,{"$f":"IF(SUM(AA$22:AA$24)>0,$E32*$F32,0)","v":0},null,{"$f":"IF(SUM(AC$22:AC$24)>0,$E32*$F32,0)","v":0},null,{"$f":"IF(SUM(AE$22:AE$24)>0,$E32*$F32,0)","v":0},null,{"$f":"IF(SUM(AG$22:AG$24)>0,$E32*$F32,0)","v":0},null,{"$f":"IF(SUM(AI$22:AI$24)>0,$E32*$F32,0)","v":0},null,{"$f":"IF(SUM(AK$22:AK$24)>0,$E32*$F32,0)","v":0},null,{"$f":"IF(SUM(AM$22:AM$24)>0,$E32*$F32,0)","v":0},null,{"$f":"IF(SUM(AO$22:AO$24)>0,$E32*$F32,0)","v":0},null,{"$f":"IF(SUM(AQ$22:AQ$24)>0,$E32*$F32,0)","v":0},null,{"$f":"IF(SUM(AS$22:AS$24)>0,$E32*$F32,0)","v":0},null,{"$f":"IF(SUM(AU$22:AU$24)>0,$E32*$F32,0)","v":0},null,{"$f":"IF(SUM(AW$22:AW$24)>0,$E32*$F32,0)","v":0},null,{"$f":"IF(SUM(AY$22:AY$24)>0,$E32*$F32,0)","v":0},null,{"$f":"IF(SUM(BA$22:BA$24)>0,$E32*$F32,0)","v":0},null,{"$f":"IF(SUM(BC$22:BC$24)>0,$E32*$F32,0)","v":0},null,{"$f":"IF(SUM(BE$22:BE$24)>0,$E32*$F32,0)","v":0},null,{"$f":"IF(SUM(BG$22:BG$24)>0,$E32*$F32,0)","v":0},null,{"$f":"IF(SUM(BI$22:BI$24)>0,$E32*$F32,0)","v":0},null,{"$f":"IF(SUM(BK$22:BK$24)>0,$E32*$F32,0)","v":0},null,{"$f":"IF(SUM(BM$22:BM$24)>0,$E32*$F32,0)","v":0},null,{"$f":"IF(SUM(BO$22:BO$24)>0,$E32*$F32,0)","v":0},null,{"$f":"IF(SUM(BQ$22:BQ$24)>0,$E32*$F32,0)","v":0},null,{"$f":"IF(SUM(BS$22:BS$24)>0,$E32*$F32,0)","v":0},null,{"$f":"IF(SUM(BU$22:BU$24)>0,$E32*$F32,0)","v":0},null,{"$f":"IF(SUM(BW$22:BW$24)>0,$E32*$F32,0)","v":0},null,{"$f":"IF(SUM(BY$22:BY$24)>0,$E32*$F32,0)","v":0},null,{"$f":"IF(SUM(CA$22:CA$24)>0,$E32*$F32,0)","v":0},null,{"$f":"IF(SUM(CC$22:CC$24)>0,$E32*$F32,0)","v":0},null,{"$f":"IF(SUM(CE$22:CE$24)>0,$E32*$F32,0)","v":0},null,{"$f":"IF(SUM(CG$22:CG$24)>0,$E32*$F32,0)","v":0},null,{"$f":"IF(SUM(CI$22:CI$24)>0,$E32*$F32,0)","v":0},null,{"$f":"IF(SUM(CK$22:CK$24)>0,$E32*$F32,0)","v":0},null,{"$f":"IF(SUM(CM$22:CM$24)>0,$E32*$F32,0)","v":0},null,{"$f":"IF(SUM(CO$22:CO$24)>0,$E32*$F32,0)","v":0},null,{"$f":"IF(SUM(CQ$22:CQ$24)>0,$E32*$F32,0)","v":0},null,{"$f":"IF(SUM(CS$22:CS$24)>0,$E32*$F32,0)","v":0},null,{"$f":"IF(SUM(CU$22:CU$24)>0,$E32*$F32,0)","v":0},null,{"$f":"IF(SUM(CW$22:CW$24)>0,$E32*$F32,0)","v":0},null,{"$f":"IF(SUM(CY$22:CY$24)>0,$E32*$F32,0)","v":0},null,{"$f":"IF(SUM(DA$22:DA$24)>0,$E32*$F32,0)","v":0},null,{"$f":"IF(SUM(DC$22:DC$24)>0,$E32*$F32,0)","v":0},null,{"$f":"IF(SUM(DE$22:DE$24)>0,$E32*$F32,0)","v":0},null,{"$f":"IF(SUM(DG$22:DG$24)>0,$E32*$F32,0)","v":0},null,{"$f":"IF(SUM(DI$22:DI$24)>0,$E32*$F32,0)","v":0},null,{"$f":"IF(SUM(DK$22:DK$24)>0,$E32*$F32,0)","v":0},null,{"$f":"IF(SUM(DM$22:DM$24)>0,$E32*$F32,0)","v":0},null,{"$f":"IF(SUM(DO$22:DO$24)>0,$E32*$F32,0)","v":0},null,{"$f":"IF(SUM(DQ$22:DQ$24)>0,$E32*$F32,0)","v":0},null,{"$f":"IF(SUM(DS$22:DS$24)>0,$E32*$F32,0)","v":0},null,{"$f":"IF(SUM(DU$22:DU$24)>0,$E32*$F32,0)","v":0},null,{"$f":"IF(SUM(DW$22:DW$24)>0,$E32*$F32,0)","v":0}]
[]
[null,null,"CATEGORIAS",null,null,"QUANTIDADE"]
[null,null,null,null,null,null,null,null,{"$f":"IF($C35=I$3,1,0)","v":0},null,{"$f":"IF($C35=K$3,1,0)","v":0},null,{"$f":"IF($C35=M$3,1,0)","v":0},null,{"$f":"IF($C35=O$3,1,0)","v":0},null,{"$f":"IF($C35=Q$3,1,0)","v":0},null,{"$f":"IF($C35=S$3,1,0)","v":0},null,{"$f":"IF($C35=U$3,1,0)","v":0},null,{"$f":"IF($C35=W$3,1,0)","v":0},null,{"$f":"IF($C35=Y$3,1,0)","v":0},null,{"$f":"IF($C35=AA$3,1,0)","v":0},null,{"$f":"IF($C35=AC$3,1,0)","v":0},null,{"$f":"IF($C35=AE$3,1,0)","v":0},null,{"$f":"IF($C35=AG$3,1,0)","v":0},null,{"$f":"IF($C35=AI$3,1,0)","v":0},null,{"$f":"IF($C35=AK$3,1,0)","v":0},null,{"$f":"IF($C35=AM$3,1,0)","v":0},null,{"$f":"IF($C35=AO$3,1,0)","v":0},null,{"$f":"IF($C35=AQ$3,1,0)","v":0},null,{"$f":"IF($C35=AS$3,1,0)","v":0},null,{"$f":"IF($C35=AU$3,1,0)","v":0},null,{"$f":"IF($C35=AW$3,1,0)","v":0},null,{"$f":"IF($C35=AY$3,1,0)","v":0},null,{"$f":"IF($C35=BA$3,1,0)","v":0},null,{"$f":"IF($C35=BC$3,1,0)","v":0},null,{"$f":"IF($C35=BE$3,1,0)","v":0},null,{"$f":"IF($C35=BG$3,1,0)","v":0},null,{"$f":"IF($C35=BI$3,1,0)","v":0},null,{"$f":"IF($C35=BK$3,1,0)","v":0},null,{"$f":"IF($C35=BM$3,1,0)","v":0},null,{"$f":"IF($C35=BO$3,1,0)","v":0},null,{"$f":"IF($C35=BQ$3,1,0)","v":0},null,{"$f":"IF($C35=BS$3,1,0)","v":0},null,{"$f":"IF($C35=BU$3,1,0)","v":0},null,{"$f":"IF($C35=BW$3,1,0)","v":0},null,{"$f":"IF($C35=BY$3,1,0)","v":0},null,{"$f":"IF($C35=CA$3,1,0)","v":0},null,{"$f":"IF($C35=CC$3,1,0)","v":0},null,{"$f":"IF($C35=CE$3,1,0)","v":0},null,{"$f":"IF($C35=CG$3,1,0)","v":0},null,{"$f":"IF($C35=CI$3,1,0)","v":0},null,{"$f":"IF($C35=CK$3,1,0)","v":0},null,{"$f":"IF($C35=CM$3,1,0)","v":0},null,{"$f":"IF($C35=CO$3,1,0)","v":0},null,{"$f":"IF($C35=CQ$3,1,0)","v":0},null,{"$f":"IF($C35=CS$3,1,0)","v":0},null,{"$f":"IF($C35=CU$3,1,0)","v":0},null,{"$f":"IF($C35=CW$3,1,0)","v":0},null,{"$f":"IF($C35=CY$3,1,0)","v":0},null,{"$f":"IF($C35=DA$3,1,0)","v":0},null,{"$f":"IF($C35=DC$3,1,0)","v":0},null,{"$f":"IF($C35=DE$3,1,0)","v":0},null,{"$f":"IF($C35=DG$3,1,0)","v":0},null,{"$f":"IF($C35=DI$3,1,0)","v":0},null,{"$f":"IF($C35=DK$3,1,0)","v":0},null,{"$f":"IF($C35=DM$3,1,0)","v":0},null,{"$f":"IF($C35=DO$3,1,0)","v":0},null,{"$f":"IF($C35=DQ$3,1,0)","v":0},null,{"$f":"IF($C35=DS$3,1,0)","v":0},null,{"$f":"IF($C35=DU$3,1,0)","v":0},null,{"$f":"IF($C35=DW$3,1,0)","v":0}]
[null,null,3,{"$f":"HLOOKUP($C36,'Dados Gerais'!$D$5:$BK$10,6)","v":"TÉCNICO EM ELETRÔNICA (DETECÇÃO, ALARME E COMBATE A INCÊNCIO)"},null,{"$f":"HLOOKUP($C36,'Dados Gerais'!$D$5:$BK$14,10)","v":1},null,null,{"$f":"IF($C36=I$3,1,0)","v":0},{"$f":"IF($C36=J$3,1,0)","v":0},{"$f":"IF($C36=K$3,1,0)","v":0},0,{"$f":"IF($C36=M$3,1,0)","v":1},0,{"$f":"IF($C36=O$3,1,0)","v":0},0,{"$f":"IF($C36=Q$3,1,0)","v":0},0,{"$f":"IF($C36=S$3,1,0)","v":0},0,{"$f":"IF($C36=U$3,1,0)","v":0},0,{"$f":"IF($C36=W$3,1,0)","v":0},0,{"$f":"IF($C36=Y$3,1,0)","v":0},0,{"$f":"IF($C36=AA$3,1,0)","v":0},0,{"$f":"IF($C36=AC$3,1,0)","v":0},0,{"$f":"IF($C36=AE$3,1,0)","v":0},0,{"$f":"IF($C36=AG$3,1,0)","v":0},0,{"$f":"IF($C36=AI$3,1,0)","v":0},0,{"$f":"IF($C36=AK$3,1,0)","v":0},0,{"$f":"IF($C36=AM$3,1,0)","v":0},0,{"$f":"IF($C36=AO$3,1,0)","v":0},0,{"$f":"IF($C36=AQ$3,1,0)","v":0},0,{"$f":"IF($C36=AS$3,1,0)","v":0},0,{"$f":"IF($C36=AU$3,1,0)","v":0},0,{"$f":"IF($C36=AW$3,1,0)","v":0},0,{"$f":"IF($C36=AY$3,1,0)","v":0},0,{"$f":"IF($C36=BA$3,1,0)","v":0},0,{"$f":"IF($C36=BC$3,1,0)","v":0},0,{"$f":"IF($C36=BE$3,1,0)","v":0},0,{"$f":"IF($C36=BG$3,1,0)","v":0},0,{"$f":"IF($C36=BI$3,1,0)","v":0},0,{"$f":"IF($C36=BK$3,1,0)","v":0},0,{"$f":"IF($C36=BM$3,1,0)","v":0},0,{"$f":"IF($C36=BO$3,1,0)","v":0},0,{"$f":"IF($C36=BQ$3,1,0)","v":0},0,{"$f":"IF($C36=BS$3,1,0)","v":0},0,{"$f":"IF($C36=BU$3,1,0)","v":0},0,{"$f":"IF($C36=BW$3,1,0)","v":0},0,{"$f":"IF($C36=BY$3,1,0)","v":0},0,{"$f":"IF($C36=CA$3,1,0)","v":0},0,{"$f":"IF($C36=CC$3,1,0)","v":0},0,{"$f":"IF($C36=CE$3,1,0)","v":0},0,{"$f":"IF($C36=CG$3,1,0)","v":0},0,{"$f":"IF($C36=CI$3,1,0)","v":0},0,{"$f":"IF($C36=CK$3,1,0)","v":0},0,{"$f":"IF($C36=CM$3,1,0)","v":0},0,{"$f":"IF($C36=CO$3,1,0)","v":0},0,{"$f":"IF($C36=CQ$3,1,0)","v":0},0,{"$f":"IF($C36=CS$3,1,0)","v":0},0,{"$f":"IF($C36=CU$3,1,0)","v":0},0,{"$f":"IF($C36=CW$3,1,0)","v":0},0,{"$f":"IF($C36=CY$3,1,0)","v":0},0,{"$f":"IF($C36=DA$3,1,0)","v":0},0,{"$f":"IF($C36=DC$3,1,0)","v":0},0,{"$f":"IF($C36=DE$3,1,0)","v":0},0,{"$f":"IF($C36=DG$3,1,0)","v":0},0,{"$f":"IF($C36=DI$3,1,0)","v":0},0,{"$f":"IF($C36=DK$3,1,0)","v":0},0,{"$f":"IF($C36=DM$3,1,0)","v":0},0,{"$f":"IF($C36=DO$3,1,0)","v":0},0,{"$f":"IF($C36=DQ$3,1,0)","v":0},0,{"$f":"IF($C36=DS$3,1,0)","v":0},0,{"$f":"IF($C36=DU$3,1,0)","v":0},0,{"$f":"IF($C36=DW$3,1,0)","v":0},0]
[null,null,null,null,null,null,null,null,{"$f":"IF($C37=I$3,1,0)","v":0},null,0,null,0,null,0,null,0,null,0,null,0,null,0,null,0,null,0,null,0,null,{"$f":"IF($C37=AE$3,1,0)","v":0},null,0,null,0,null,0,null,0,null,0,null,0,null,0]
[]
[null,null,"ITEM","DESCRIÇÃO","QUANT ANUAL POR POSTO","VALOR"]
[]
[null,null,1,"Luva de malha tricotada em fios de algodão com acabamento em overloque e palmas pigmentadas em PVC. Ref. LEDAN",5,{"$f":"F28","v":12.4},null,null,null,{"$f":"IF(SUM(I$35:I$37)>0,$E41*$F41,0)","v":0},null,{"$f":"IF(SUM(K$35:K$37)>0,$E41*$F41,0)","v":0},null,{"$f":"IF(SUM(M$35:M$37)>0,$E41*$F41,0)","v":62},null,{"$f":"IF(SUM(O$35:O$37)>0,$E41*$F41,0)","v":0},null,{"$f":"IF(SUM(Q$35:Q$37)>0,$E41*$F41,0)","v":0},null,{"$f":"IF(SUM(S$35:S$37)>0,$E41*$F41,0)","v":0},null,{"$f":"IF(SUM(U$35:U$37)>0,$E41*$F41,0)","v":0},null,{"$f":"IF(SUM(W$35:W$37)>0,$E41*$F41,0)","v":0},null,{"$f":"IF(SUM(Y$35:Y$37)>0,$E41*$F41,0)","v":0},null,{"$f":"IF(SUM(AA$35:AA$37)>0,$E41*$F41,0)","v":0},null,{"$f":"IF(SUM(AC$35:AC$37)>0,$E41*$F41,0)","v":0},null,{"$f":"IF(SUM(AE$35:AE$37)>0,$E41*$F41,0)","v":0},null,{"$f":"IF(SUM(AG$35:AG$37)>0,$E41*$F41,0)","v":0},null,{"$f":"IF(SUM(AI$35:AI$37)>0,$E41*$F41,0)","v":0},null,{"$f":"IF(SUM(AK$35:AK$37)>0,$E41*$F41,0)","v":0},null,{"$f":"IF(SUM(AM$35:AM$37)>0,$E41*$F41,0)","v":0},null,{"$f":"IF(SUM(AO$35:AO$37)>0,$E41*$F41,0)","v":0},null,{"$f":"IF(SUM(AQ$35:AQ$37)>0,$E41*$F41,0)","v":0},null,{"$f":"IF(SUM(AS$35:AS$37)>0,$E41*$F41,0)","v":0},null,{"$f":"IF(SUM(AU$35:AU$37)>0,$E41*$F41,0)","v":0},null,{"$f":"IF(SUM(AW$35:AW$37)>0,$E41*$F41,0)","v":0},null,{"$f":"IF(SUM(AY$35:AY$37)>0,$E41*$F41,0)","v":0},null,{"$f":"IF(SUM(BA$35:BA$37)>0,$E41*$F41,0)","v":0},null,{"$f":"IF(SUM(BC$35:BC$37)>0,$E41*$F41,0)","v":0},null,{"$f":"IF(SUM(BE$35:BE$37)>0,$E41*$F41,0)","v":0},null,{"$f":"IF(SUM(BG$35:BG$37)>0,$E41*$F41,0)","v":0},null,{"$f":"IF(SUM(BI$35:BI$37)>0,$E41*$F41,0)","v":0},null,{"$f":"IF(SUM(BK$35:BK$37)>0,$E41*$F41,0)","v":0},null,{"$f":"IF(SUM(BM$35:BM$37)>0,$E41*$F41,0)","v":0},null,{"$f":"IF(SUM(BO$35:BO$37)>0,$E41*$F41,0)","v":0},null,{"$f":"IF(SUM(BQ$35:BQ$37)>0,$E41*$F41,0)","v":0},null,{"$f":"IF(SUM(BS$35:BS$37)>0,$E41*$F41,0)","v":0},null,{"$f":"IF(SUM(BU$35:BU$37)>0,$E41*$F41,0)","v":0},null,{"$f":"IF(SUM(BW$35:BW$37)>0,$E41*$F41,0)","v":0},null,{"$f":"IF(SUM(BY$35:BY$37)>0,$E41*$F41,0)","v":0},null,{"$f":"IF(SUM(CA$35:CA$37)>0,$E41*$F41,0)","v":0},null,{"$f":"IF(SUM(CC$35:CC$37)>0,$E41*$F41,0)","v":0},null,{"$f":"IF(SUM(CE$35:CE$37)>0,$E41*$F41,0)","v":0},null,{"$f":"IF(SUM(CG$35:CG$37)>0,$E41*$F41,0)","v":0},null,{"$f":"IF(SUM(CI$35:CI$37)>0,$E41*$F41,0)","v":0},null,{"$f":"IF(SUM(CK$35:CK$37)>0,$E41*$F41,0)","v":0},null,{"$f":"IF(SUM(CM$35:CM$37)>0,$E41*$F41,0)","v":0},null,{"$f":"IF(SUM(CO$35:CO$37)>0,$E41*$F41,0)","v":0},null,{"$f":"IF(SUM(CQ$35:CQ$37)>0,$E41*$F41,0)","v":0},null,{"$f":"IF(SUM(CS$35:CS$37)>0,$E41*$F41,0)","v":0},null,{"$f":"IF(SUM(CU$35:CU$37)>0,$E41*$F41,0)","v":0},null,{"$f":"IF(SUM(CW$35:CW$37)>0,$E41*$F41,0)","v":0},null,{"$f":"IF(SUM(CY$35:CY$37)>0,$E41*$F41,0)","v":0},null,{"$f":"IF(SUM(DA$35:DA$37)>0,$E41*$F41,0)","v":0},null,{"$f":"IF(SUM(DC$35:DC$37)>0,$E41*$F41,0)","v":0},null,{"$f":"IF(SUM(DE$35:DE$37)>0,$E41*$F41,0)","v":0},null,{"$f":"IF(SUM(DG$35:DG$37)>0,$E41*$F41,0)","v":0},null,{"$f":"IF(SUM(DI$35:DI$37)>0,$E41*$F41,0)","v":0},null,{"$f":"IF(SUM(DK$35:DK$37)>0,$E41*$F41,0)","v":0},null,{"$f":"IF(SUM(DM$35:DM$37)>0,$E41*$F41,0)","v":0},null,{"$f":"IF(SUM(DO$35:DO$37)>0,$E41*$F41,0)","v":0},null,{"$f":"IF(SUM(DQ$35:DQ$37)>0,$E41*$F41,0)","v":0},null,{"$f":"IF(SUM(DS$35:DS$37)>0,$E41*$F41,0)","v":0},null,{"$f":"IF(SUM(DU$35:DU$37)>0,$E41*$F41,0)","v":0},null,{"$f":"IF(SUM(DW$35:DW$37)>0,$E41*$F41,0)","v":0}]
[null,null,2,"Óculos de segurança constituídos de armação e visor confeccionados em uma única peça de policarbonato INCOLOR, anti-risco, apoio nasal de plástico maleável. Hastes emborrachadas. Ref.: 3M Virtua V4",3,{"$f":"F29","v":31.71},null,null,null,{"$f":"IF(SUM(I$35:I$37)>0,$E42*$F42,0)","v":0},null,0,null,95.13,null,0,null,0,null,0,null,0,null,0,null,0,null,0,null,0,null,0,null,0,null,0,null,0,null,0,null,0,null,0,null,0,null,0,null,0,null,0,null,0,null,0,null,0,null,0,null,0,null,0,null,0,null,0,null,0,null,0,null,0,null,0,null,0,null,0,null,0,null,0,null,0,null,0,null,0,null,0,null,0,null,0,null,0,null,0,null,0,null,0,null,0,null,0,null,0,null,0,null,0,null,0,null,0,null,0,null,0,null,0,null,0,null,0]
[null,null,3,"Capacete de segurança em polietileno de alta densidade, na cor VERMELHA, aba frontal, suspensão em tecido, com Faixa anti-suor, regulagem de tamanho com ajuste simples, com jugular ajustável. MARCA(S) DE REFERÊNCIA:Ref: MSA",1,{"$f":"F30","v":47.66},null,null,null,0,null,{"$f":"IF(SUM(K$35:K$37)>0,$E43*$F43,0)","v":0},null,47.66,null,0,null,0,null,0,null,0,null,0,null,0,null,0,null,0,null,0,null,0,null,0,null,0,null,0,null,0,null,0,null,0,null,0,null,0,null,0,null,0,null,0,null,0,null,0,null,0,null,0,null,0,null,0,null,0,null,0,null,0,null,0,null,0,null,0,null,0,null,0,null,0,null,0,null,0,null,0,null,0,null,0,null,0,null,0,null,0,null,0,null,0,null,0,null,0,null,0,null,0,null,0,null,0,null,0,null,0,null,0,null,0,null,0]
[null,null,4,"Botina de segurança, fechamento em elástico, sem componentes metálicos, confeccionada em couro curtido ao cromo, na cor preta, elásticos laterais, BIQUEIRA EM COMPOSITE ou POLIPROPILENO, solado de poliuretano bidensidade injetado diretamente ao cabedal, solado com perfil antiderrapante e sistemas de absorção de impacto. Com selo conforto. Em conformidade com as Normas de segurança da ABNT NBR ISO 20344 e 20347. Ref.: MARLUVAS.",2,{"$f":"F31","v":148.97999999999999},null,null,null,0,null,0,null,297.95999999999998,null,0,null,0,null,0,null,0,null,0,null,0,null,0,null,0,null,0,null,0,null,0,null,0,null,0,null,0,null,0,null,0,null,0,null,0,null,0,null,0,null,0,null,0,null,0,null,0,null,0,null,0,null,0,null,0,null,0,null,0,null,0,null,0,null,0,null,0,null,0,null,0,null,0,null,0,null,0,null,0,null,0,null,0,null,0,null,0,null,0,null,0,null,0,null,0,null,0,null,0,null,0,null,0,null,0,null,0,null,0,null,0,null,0]
[]
[null,null,"CATEGORIAS",null,null,"QUANTIDADE"]
[null,null,null,null,null,null,null,null,{"$f":"IF($C47=I$3,1,0)","v":0},null,{"$f":"IF($C47=K$3,1,0)","v":0},null,{"$f":"IF($C47=M$3,1,0)","v":0},null,{"$f":"IF($C47=O$3,1,0)","v":0},null,{"$f":"IF($C47=Q$3,1,0)","v":0},null,{"$f":"IF($C47=S$3,1,0)","v":0},null,{"$f":"IF($C47=U$3,1,0)","v":0},null,{"$f":"IF($C47=W$3,1,0)","v":0},null,{"$f":"IF($C47=Y$3,1,0)","v":0},null,{"$f":"IF($C47=AA$3,1,0)","v":0},null,{"$f":"IF($C47=AC$3,1,0)","v":0},null,{"$f":"IF($C47=AE$3,1,0)","v":0},null,{"$f":"IF($C47=AG$3,1,0)","v":0},null,{"$f":"IF($C47=AI$3,1,0)","v":0},null,{"$f":"IF($C47=AK$3,1,0)","v":0},null,{"$f":"IF($C47=AM$3,1,0)","v":0},null,{"$f":"IF($C47=AO$3,1,0)","v":0},null,{"$f":"IF($C47=AQ$3,1,0)","v":0},null,{"$f":"IF($C47=AS$3,1,0)","v":0}]
[null,null,4,{"$f":"HLOOKUP($C48,'Dados Gerais'!$D$5:$BK$10,6)","v":"TÉCNICO EM ELETROTÉCNICA (QUADROS DE COMANDO E AUTOMAÇÃO)"},null,{"$f":"HLOOKUP($C48,'Dados Gerais'!$D$5:$BK$14,10)","v":1},null,null,{"$f":"IF($C48=I$3,1,0)","v":0},{"$f":"IF($C48=J$3,1,0)","v":0},0,0,0,0,1,0,0,0,0,0,0,0,0,0,0,0,0,0,0,0,{"$f":"IF($C48=AE$3,1,0)","v":0},0,0,0,0,0,0,0,0,0,0,0,0,0,0,0,{"$f":"IF($C48=AU$3,1,0)","v":0},0,{"$f":"IF($C48=AW$3,1,0)","v":0},0,{"$f":"IF($C48=AY$3,1,0)","v":0},0,{"$f":"IF($C48=BA$3,1,0)","v":0},0,{"$f":"IF($C48=BC$3,1,0)","v":0},0,{"$f":"IF($C48=BE$3,1,0)","v":0},0,{"$f":"IF($C48=BG$3,1,0)","v":0},0,{"$f":"IF($C48=BI$3,1,0)","v":0},0,{"$f":"IF($C48=BK$3,1,0)","v":0},0,{"$f":"IF($C48=BM$3,1,0)","v":0},0,{"$f":"IF($C48=BO$3,1,0)","v":0},0,{"$f":"IF($C48=BQ$3,1,0)","v":0},0,{"$f":"IF($C48=BS$3,1,0)","v":0},0,{"$f":"IF($C48=BU$3,1,0)","v":0},0,{"$f":"IF($C48=BW$3,1,0)","v":0},0,{"$f":"IF($C48=BY$3,1,0)","v":0},0,{"$f":"IF($C48=CA$3,1,0)","v":0},0,{"$f":"IF($C48=CC$3,1,0)","v":0},0,{"$f":"IF($C48=CE$3,1,0)","v":0},0,{"$f":"IF($C48=CG$3,1,0)","v":0},0,{"$f":"IF($C48=CI$3,1,0)","v":0},0,{"$f":"IF($C48=CK$3,1,0)","v":0},0,{"$f":"IF($C48=CM$3,1,0)","v":0},0,{"$f":"IF($C48=CO$3,1,0)","v":0},0,{"$f":"IF($C48=CQ$3,1,0)","v":0},0,{"$f":"IF($C48=CS$3,1,0)","v":0},0,{"$f":"IF($C48=CU$3,1,0)","v":0},0,{"$f":"IF($C48=CW$3,1,0)","v":0},0,{"$f":"IF($C48=CY$3,1,0)","v":0},0,{"$f":"IF($C48=DA$3,1,0)","v":0},0,{"$f":"IF($C48=DC$3,1,0)","v":0},0,{"$f":"IF($C48=DE$3,1,0)","v":0},0,{"$f":"IF($C48=DG$3,1,0)","v":0},0,{"$f":"IF($C48=DI$3,1,0)","v":0},0,{"$f":"IF($C48=DK$3,1,0)","v":0},0,{"$f":"IF($C48=DM$3,1,0)","v":0},0,{"$f":"IF($C48=DO$3,1,0)","v":0},0,{"$f":"IF($C48=DQ$3,1,0)","v":0},0,{"$f":"IF($C48=DS$3,1,0)","v":0},0,{"$f":"IF($C48=DU$3,1,0)","v":0},0,{"$f":"IF($C48=DW$3,1,0)","v":0},0]
[null,null,null,null,null,null,null,null,{"$f":"IF($C49=I$3,1,0)","v":0},null,0,null,0,null,0,null,0,null,0,null,0,null,0,null,0,null,0,null,0,null,{"$f":"IF($C49=AE$3,1,0)","v":0},null,0,null,0,null,0,null,0,null,0,null,0,null,0]
[]
[null,null,"ITEM","DESCRIÇÃO","QUANT ANUAL POR POSTO","VALOR"]
[]
[null,null,1,"Luva de malha tricotada em fios de algodão com acabamento em overloque e palmas pigmentadas em PVC. Ref. LEDAN",5,{"$f":"F41","v":12.4},null,null,null,{"$f":"IF(SUM(I$47:I$49)>0,$E53*$F53,0)","v":0},null,{"$f":"IF(SUM(K$47:K$49)>0,$E53*$F53,0)","v":0},null,{"$f":"IF(SUM(M$47:M$49)>0,$E53*$F53,0)","v":0},null,{"$f":"IF(SUM(O$47:O$49)>0,$E53*$F53,0)","v":62},null,{"$f":"IF(SUM(Q$47:Q$49)>0,$E53*$F53,0)","v":0},null,{"$f":"IF(SUM(S$47:S$49)>0,$E53*$F53,0)","v":0},null,{"$f":"IF(SUM(U$47:U$49)>0,$E53*$F53,0)","v":0},null,{"$f":"IF(SUM(W$47:W$49)>0,$E53*$F53,0)","v":0},null,{"$f":"IF(SUM(Y$47:Y$49)>0,$E53*$F53,0)","v":0},null,{"$f":"IF(SUM(AA$47:AA$49)>0,$E53*$F53,0)","v":0},null,{"$f":"IF(SUM(AC$47:AC$49)>0,$E53*$F53,0)","v":0},null,{"$f":"IF(SUM(AE$47:AE$49)>0,$E53*$F53,0)","v":0},null,{"$f":"IF(SUM(AG$47:AG$49)>0,$E53*$F53,0)","v":0},null,{"$f":"IF(SUM(AI$47:AI$49)>0,$E53*$F53,0)","v":0},null,{"$f":"IF(SUM(AK$47:AK$49)>0,$E53*$F53,0)","v":0},null,{"$f":"IF(SUM(AM$47:AM$49)>0,$E53*$F53,0)","v":0},null,{"$f":"IF(SUM(AO$47:AO$49)>0,$E53*$F53,0)","v":0},null,{"$f":"IF(SUM(AQ$47:AQ$49)>0,$E53*$F53,0)","v":0},null,{"$f":"IF(SUM(AS$47:AS$49)>0,$E53*$F53,0)","v":0},null,{"$f":"IF(SUM(AU$47:AU$49)>0,$E53*$F53,0)","v":0},null,{"$f":"IF(SUM(AW$47:AW$49)>0,$E53*$F53,0)","v":0},null,{"$f":"IF(SUM(AY$47:AY$49)>0,$E53*$F53,0)","v":0},null,{"$f":"IF(SUM(BA$47:BA$49)>0,$E53*$F53,0)","v":0},null,{"$f":"IF(SUM(BC$47:BC$49)>0,$E53*$F53,0)","v":0},null,{"$f":"IF(SUM(BE$47:BE$49)>0,$E53*$F53,0)","v":0},null,{"$f":"IF(SUM(BG$47:BG$49)>0,$E53*$F53,0)","v":0},null,{"$f":"IF(SUM(BI$47:BI$49)>0,$E53*$F53,0)","v":0},null,{"$f":"IF(SUM(BK$47:BK$49)>0,$E53*$F53,0)","v":0},null,{"$f":"IF(SUM(BM$47:BM$49)>0,$E53*$F53,0)","v":0},null,{"$f":"IF(SUM(BO$47:BO$49)>0,$E53*$F53,0)","v":0},null,{"$f":"IF(SUM(BQ$47:BQ$49)>0,$E53*$F53,0)","v":0},null,{"$f":"IF(SUM(BS$47:BS$49)>0,$E53*$F53,0)","v":0},null,{"$f":"IF(SUM(BU$47:BU$49)>0,$E53*$F53,0)","v":0},null,{"$f":"IF(SUM(BW$47:BW$49)>0,$E53*$F53,0)","v":0},null,{"$f":"IF(SUM(BY$47:BY$49)>0,$E53*$F53,0)","v":0},null,{"$f":"IF(SUM(CA$47:CA$49)>0,$E53*$F53,0)","v":0},null,{"$f":"IF(SUM(CC$47:CC$49)>0,$E53*$F53,0)","v":0},null,{"$f":"IF(SUM(CE$47:CE$49)>0,$E53*$F53,0)","v":0},null,{"$f":"IF(SUM(CG$47:CG$49)>0,$E53*$F53,0)","v":0},null,{"$f":"IF(SUM(CI$47:CI$49)>0,$E53*$F53,0)","v":0},null,{"$f":"IF(SUM(CK$47:CK$49)>0,$E53*$F53,0)","v":0},null,{"$f":"IF(SUM(CM$47:CM$49)>0,$E53*$F53,0)","v":0},null,{"$f":"IF(SUM(CO$47:CO$49)>0,$E53*$F53,0)","v":0},null,{"$f":"IF(SUM(CQ$47:CQ$49)>0,$E53*$F53,0)","v":0},null,{"$f":"IF(SUM(CS$47:CS$49)>0,$E53*$F53,0)","v":0},null,{"$f":"IF(SUM(CU$47:CU$49)>0,$E53*$F53,0)","v":0},null,{"$f":"IF(SUM(CW$47:CW$49)>0,$E53*$F53,0)","v":0},null,{"$f":"IF(SUM(CY$47:CY$49)>0,$E53*$F53,0)","v":0},null,{"$f":"IF(SUM(DA$47:DA$49)>0,$E53*$F53,0)","v":0},null,{"$f":"IF(SUM(DC$47:DC$49)>0,$E53*$F53,0)","v":0},null,{"$f":"IF(SUM(DE$47:DE$49)>0,$E53*$F53,0)","v":0},null,{"$f":"IF(SUM(DG$47:DG$49)>0,$E53*$F53,0)","v":0},null,{"$f":"IF(SUM(DI$47:DI$49)>0,$E53*$F53,0)","v":0},null,{"$f":"IF(SUM(DK$47:DK$49)>0,$E53*$F53,0)","v":0},null,{"$f":"IF(SUM(DM$47:DM$49)>0,$E53*$F53,0)","v":0},null,{"$f":"IF(SUM(DO$47:DO$49)>0,$E53*$F53,0)","v":0},null,{"$f":"IF(SUM(DQ$47:DQ$49)>0,$E53*$F53,0)","v":0},null,{"$f":"IF(SUM(DS$47:DS$49)>0,$E53*$F53,0)","v":0},null,{"$f":"IF(SUM(DU$47:DU$49)>0,$E53*$F53,0)","v":0},null,{"$f":"IF(SUM(DW$47:DW$49)>0,$E53*$F53,0)","v":0}]
[null,null,2,"Óculos de segurança constituídos de armação e visor confeccionados em uma única peça de policarbonato INCOLOR, anti-risco, apoio nasal de plástico maleável. Hastes emborrachadas. Ref.: 3M Virtua V4",3,{"$f":"F42","v":31.71},null,null,null,{"$f":"IF(SUM(I$47:I$49)>0,$E54*$F54,0)","v":0},null,0,null,0,null,95.13,null,0,null,0,null,0,null,0,null,0,null,0,null,0,null,0,null,0,null,0,null,0,null,0,null,0,null,0,null,0,null,0,null,0,null,0,null,0,null,0,null,0,null,0,null,0,null,0,null,0,null,0,null,0,null,0,null,0,null,0,null,0,null,0,null,0,null,0,null,0,null,0,null,0,null,0,null,0,null,0,null,0,null,0,null,0,null,0,null,0,null,0,null,0,null,0,null,0,null,0,null,0,null,0,null,0,null,0,null,0,null,0]
[null,null,3,"Capacete de segurança em polietileno de alta densidade, na cor VERMELHA, aba frontal, suspensão em tecido, com Faixa anti-suor, regulagem de tamanho com ajuste simples, com jugular ajustável. MARCA(S) DE REFERÊNCIA:Ref: MSA",1,{"$f":"F43","v":47.66},null,null,null,0,null,{"$f":"IF(SUM(K$47:K$49)>0,$E55*$F55,0)","v":0},null,0,null,47.66,null,0,null,0,null,0,null,0,null,0,null,0,null,0,null,0,null,0,null,0,null,0,null,0,null,0,null,0,null,0,null,0,null,0,null,0,null,0,null,0,null,0,null,0,null,0,null,0,null,0,null,0,null,0,null,0,null,0,null,0,null,0,null,0,null,0,null,0,null,0,null,0,null,0,null,0,null,0,null,0,null,0,null,0,null,0,null,0,null,0,null,0,null,0,null,0,null,0,null,0,null,0,null,0,null,0,null,0,null,0,null,0]
[null,null,4,"Botina de segurança, fechamento em elástico, sem componentes metálicos, confeccionada em couro curtido ao cromo, na cor preta, elásticos laterais, BIQUEIRA EM COMPOSITE ou POLIPROPILENO, solado de poliuretano bidensidade injetado diretamente ao cabedal, solado com perfil antiderrapante e sistemas de absorção de impacto. Deverá possuir proteção contra risco de choques elétricos. Com selo conforto. Em conformidade com as Normas de segurança da ABNT NBR ISO 20344 e 20347. Ref.: MARLUVAS.",2,125.94,null,null,null,0,null,0,null,0,null,251.88,null,0,null,0,null,0,null,0,null,0,null,0,null,0,null,0,null,0,null,0,null,0,null,0,null,0,null,0,null,0,null,0,null,0,null,0,null,0,null,0,null,0,null,0,null,0,null,0,null,0,null,0,null,0,null,0,null,0,null,0,null,0,null,0,null,0,null,0,null,0,null,0,null,0,null,0,null,0,null,0,null,0,null,0,null,0,null,0,null,0,null,0,null,0,null,0,null,0,null,0,null,0,null,0,null,0,null,0,null,0,null,0]
[]
[null,null,"CATEGORIAS",null,null,"QUANTIDADE"]
[null,null,null,null,null,null,null,null,{"$f":"IF($C59=I$3,1,0)","v":0},null,{"$f":"IF($C59=K$3,1,0)","v":0},null,{"$f":"IF($C59=M$3,1,0)","v":0},null,{"$f":"IF($C59=O$3,1,0)","v":0},null,{"$f":"IF($C59=Q$3,1,0)","v":0},null,{"$f":"IF($C59=S$3,1,0)","v":0},null,{"$f":"IF($C59=U$3,1,0)","v":0},null,{"$f":"IF($C59=W$3,1,0)","v":0},null,{"$f":"IF($C59=Y$3,1,0)","v":0},null,{"$f":"IF($C59=AA$3,1,0)","v":0},null,{"$f":"IF($C59=AC$3,1,0)","v":0},null,{"$f":"IF($C59=AE$3,1,0)","v":0},null,{"$f":"IF($C59=AG$3,1,0)","v":0},null,{"$f":"IF($C59=AI$3,1,0)","v":0},null,{"$f":"IF($C59=AK$3,1,0)","v":0},null,{"$f":"IF($C59=AM$3,1,0)","v":0},null,{"$f":"IF($C59=AO$3,1,0)","v":0},null,{"$f":"IF($C59=AQ$3,1,0)","v":0},null,{"$f":"IF($C59=AS$3,1,0)","v":0}]
[null,null,5,{"$f":"HLOOKUP($C60,'Dados Gerais'!$D$5:$BK$10,6)","v":"OPERADOR DE CENTRAL DE DETECÇÃO E ALARME DE INCÊNDIO"},null,{"$f":"HLOOKUP($C60,'Dados Gerais'!$D$5:$BK$14,10)","v":4},null,null,{"$f":"IF($C60=I$3,1,0)","v":0},{"$f":"IF($C60=J$3,1,0)","v":0},0,0,0,0,0,0,{"$f":"IF($C60=Q$3,1,0)","v":1},0,0,0,0,0,0,0,0,0,0,0,0,0,{"$f":"IF($C60=AE$3,1,0)","v":0},0,0,0,0,0,0,0,0,0,0,0,0,0,0,0,{"$f":"IF($C60=AU$3,1,0)","v":0},0,{"$f":"IF($C60=AW$3,1,0)","v":0},0,{"$f":"IF($C60=AY$3,1,0)","v":0},0,{"$f":"IF($C60=BA$3,1,0)","v":0},0,{"$f":"IF($C60=BC$3,1,0)","v":0},0,{"$f":"IF($C60=BE$3,1,0)","v":0},0,{"$f":"IF($C60=BG$3,1,0)","v":0},0,{"$f":"IF($C60=BI$3,1,0)","v":0},0,{"$f":"IF($C60=BK$3,1,0)","v":0},0,{"$f":"IF($C60=BM$3,1,0)","v":0},0,{"$f":"IF($C60=BO$3,1,0)","v":0},0,{"$f":"IF($C60=BQ$3,1,0)","v":0},0,{"$f":"IF($C60=BS$3,1,0)","v":0},0,{"$f":"IF($C60=BU$3,1,0)","v":0},0,{"$f":"IF($C60=BW$3,1,0)","v":0},0,{"$f":"IF($C60=BY$3,1,0)","v":0},0,{"$f":"IF($C60=CA$3,1,0)","v":0},0,{"$f":"IF($C60=CC$3,1,0)","v":0},0,{"$f":"IF($C60=CE$3,1,0)","v":0},0,{"$f":"IF($C60=CG$3,1,0)","v":0},0,{"$f":"IF($C60=CI$3,1,0)","v":0},0,{"$f":"IF($C60=CK$3,1,0)","v":0},0,{"$f":"IF($C60=CM$3,1,0)","v":0},0,{"$f":"IF($C60=CO$3,1,0)","v":0},0,{"$f":"IF($C60=CQ$3,1,0)","v":0},0,{"$f":"IF($C60=CS$3,1,0)","v":0},0,{"$f":"IF($C60=CU$3,1,0)","v":0},0,{"$f":"IF($C60=CW$3,1,0)","v":0},0,{"$f":"IF($C60=CY$3,1,0)","v":0},0,{"$f":"IF($C60=DA$3,1,0)","v":0},0,{"$f":"IF($C60=DC$3,1,0)","v":0},0,{"$f":"IF($C60=DE$3,1,0)","v":0},0,{"$f":"IF($C60=DG$3,1,0)","v":0},0,{"$f":"IF($C60=DI$3,1,0)","v":0},0,{"$f":"IF($C60=DK$3,1,0)","v":0},0,{"$f":"IF($C60=DM$3,1,0)","v":0},0,{"$f":"IF($C60=DO$3,1,0)","v":0},0,{"$f":"IF($C60=DQ$3,1,0)","v":0},0,{"$f":"IF($C60=DS$3,1,0)","v":0},0,{"$f":"IF($C60=DU$3,1,0)","v":0},0,{"$f":"IF($C60=DW$3,1,0)","v":0},0]
[null,null,6,{"$f":"HLOOKUP($C61,'Dados Gerais'!$D$5:$BK$10,6)","v":"OPERADOR DE CENTRAL DE DETECÇÃO E ALARME DE INCÊNDIO (COM ADICIONAL NOTURNO)"},null,{"$f":"HLOOKUP($C61,'Dados Gerais'!$D$5:$BK$14,10)","v":4},null,null,{"$f":"IF($C61=I$3,1,0)","v":0},0,0,0,0,0,0,0,0,0,1,0,0,0,0,0,0,0,0,0,0,0,{"$f":"IF($C61=AE$3,1,0)","v":0},0,0,0,0,0,0,0,0,0,0,0,0,0,0,0,{"$f":"IF($C61=AU$3,1,0)","v":0},0,{"$f":"IF($C61=AW$3,1,0)","v":0},0,{"$f":"IF($C61=AY$3,1,0)","v":0},0,{"$f":"IF($C61=BA$3,1,0)","v":0},0,{"$f":"IF($C61=BC$3,1,0)","v":0},0,{"$f":"IF($C61=BE$3,1,0)","v":0},0,{"$f":"IF($C61=BG$3,1,0)","v":0},0,{"$f":"IF($C61=BI$3,1,0)","v":0},0,{"$f":"IF($C61=BK$3,1,0)","v":0},0,{"$f":"IF($C61=BM$3,1,0)","v":0},0,{"$f":"IF($C61=BO$3,1,0)","v":0},0,{"$f":"IF($C61=BQ$3,1,0)","v":0},0,{"$f":"IF($C61=BS$3,1,0)","v":0},0,{"$f":"IF($C61=BU$3,1,0)","v":0},0,{"$f":"IF($C61=BW$3,1,0)","v":0},0,{"$f":"IF($C61=BY$3,1,0)","v":0},0,{"$f":"IF($C61=CA$3,1,0)","v":0},0,{"$f":"IF($C61=CC$3,1,0)","v":0},0,{"$f":"IF($C61=CE$3,1,0)","v":0},0,{"$f":"IF($C61=CG$3,1,0)","v":0},0,{"$f":"IF($C61=CI$3,1,0)","v":0},0,{"$f":"IF($C61=CK$3,1,0)","v":0},0,{"$f":"IF($C61=CM$3,1,0)","v":0},0,{"$f":"IF($C61=CO$3,1,0)","v":0},0,{"$f":"IF($C61=CQ$3,1,0)","v":0},0,{"$f":"IF($C61=CS$3,1,0)","v":0},0,{"$f":"IF($C61=CU$3,1,0)","v":0},0,{"$f":"IF($C61=CW$3,1,0)","v":0},0,{"$f":"IF($C61=CY$3,1,0)","v":0},0,{"$f":"IF($C61=DA$3,1,0)","v":0},0,{"$f":"IF($C61=DC$3,1,0)","v":0},0,{"$f":"IF($C61=DE$3,1,0)","v":0},0,{"$f":"IF($C61=DG$3,1,0)","v":0},0,{"$f":"IF($C61=DI$3,1,0)","v":0},0,{"$f":"IF($C61=DK$3,1,0)","v":0},0,{"$f":"IF($C61=DM$3,1,0)","v":0},0,{"$f":"IF($C61=DO$3,1,0)","v":0},0,{"$f":"IF($C61=DQ$3,1,0)","v":0},0,{"$f":"IF($C61=DS$3,1,0)","v":0},0,{"$f":"IF($C61=DU$3,1,0)","v":0},0,{"$f":"IF($C61=DW$3,1,0)","v":0},0]
[null,null,null,null,null,null,null,null,{"$f":"IF($C62=I$3,1,0)","v":0},null,0,null,0,null,0,null,0,null,0,null,0,null,0,null,0,null,0,null,0,null,{"$f":"IF($C62=AE$3,1,0)","v":0},null,0,null,0,null,0,null,0,null,0,null,0,null,0]
[]
[null,null,"ITEM","DESCRIÇÃO","QUANT ANUAL POR POSTO","VALOR"]
[]
[null,null,1,"Sapato social de segurança, na cor preta, confeccionado em couro curtido ao cromo, colarinho acolchoado, fechamento em elástico, palmilha de montagem em poliester, solado de PU monodensidade injetado diretamente ao cabedal. Ref.: Marluvas 20S29 S. CA: 41864",8,176.73,null,null,null,{"$f":"IF(SUM(I$59:I$62)>0,$E66*$F66,0)","v":0},null,{"$f":"IF(SUM(K$59:K$62)>0,$E66*$F66,0)","v":0},null,{"$f":"IF(SUM(M$59:M$62)>0,$E66*$F66,0)","v":0},null,{"$f":"IF(SUM(O$59:O$62)>0,$E66*$F66,0)","v":0},null,{"$f":"IF(SUM(Q$59:Q$62)>0,$E66*$F66,0)","v":1413.84},null,{"$f":"IF(SUM(S$59:S$62)>0,$E66*$F66,0)","v":1413.84},null,{"$f":"IF(SUM(U$59:U$62)>0,$E66*$F66,0)","v":0},null,{"$f":"IF(SUM(W$59:W$62)>0,$E66*$F66,0)","v":0},null,{"$f":"IF(SUM(Y$59:Y$62)>0,$E66*$F66,0)","v":0},null,{"$f":"IF(SUM(AA$59:AA$62)>0,$E66*$F66,0)","v":0},null,{"$f":"IF(SUM(AC$59:AC$62)>0,$E66*$F66,0)","v":0},null,{"$f":"IF(SUM(AE$59:AE$62)>0,$E66*$F66,0)","v":0},null,{"$f":"IF(SUM(AG$59:AG$62)>0,$E66*$F66,0)","v":0},null,{"$f":"IF(SUM(AI$59:AI$62)>0,$E66*$F66,0)","v":0},null,{"$f":"IF(SUM(AK$59:AK$62)>0,$E66*$F66,0)","v":0},null,{"$f":"IF(SUM(AM$59:AM$62)>0,$E66*$F66,0)","v":0},null,{"$f":"IF(SUM(AO$59:AO$62)>0,$E66*$F66,0)","v":0},null,{"$f":"IF(SUM(AQ$59:AQ$62)>0,$E66*$F66,0)","v":0},null,{"$f":"IF(SUM(AS$59:AS$62)>0,$E66*$F66,0)","v":0},null,{"$f":"IF(SUM(AU$59:AU$62)>0,$E66*$F66,0)","v":0},null,{"$f":"IF(SUM(AW$59:AW$62)>0,$E66*$F66,0)","v":0},null,{"$f":"IF(SUM(AY$59:AY$62)>0,$E66*$F66,0)","v":0},null,{"$f":"IF(SUM(BA$59:BA$62)>0,$E66*$F66,0)","v":0},null,{"$f":"IF(SUM(BC$59:BC$62)>0,$E66*$F66,0)","v":0},null,{"$f":"IF(SUM(BE$59:BE$62)>0,$E66*$F66,0)","v":0},null,{"$f":"IF(SUM(BG$59:BG$62)>0,$E66*$F66,0)","v":0},null,{"$f":"IF(SUM(BI$59:BI$62)>0,$E66*$F66,0)","v":0},null,{"$f":"IF(SUM(BK$59:BK$62)>0,$E66*$F66,0)","v":0},null,{"$f":"IF(SUM(BM$59:BM$62)>0,$E66*$F66,0)","v":0},null,{"$f":"IF(SUM(BO$59:BO$62)>0,$E66*$F66,0)","v":0},null,{"$f":"IF(SUM(BQ$59:BQ$62)>0,$E66*$F66,0)","v":0},null,{"$f":"IF(SUM(BS$59:BS$62)>0,$E66*$F66,0)","v":0},null,{"$f":"IF(SUM(BU$59:BU$62)>0,$E66*$F66,0)","v":0},null,{"$f":"IF(SUM(BW$59:BW$62)>0,$E66*$F66,0)","v":0},null,{"$f":"IF(SUM(BY$59:BY$62)>0,$E66*$F66,0)","v":0},null,{"$f":"IF(SUM(CA$59:CA$62)>0,$E66*$F66,0)","v":0},null,{"$f":"IF(SUM(CC$59:CC$62)>0,$E66*$F66,0)","v":0},null,{"$f":"IF(SUM(CE$59:CE$62)>0,$E66*$F66,0)","v":0},null,{"$f":"IF(SUM(CG$59:CG$62)>0,$E66*$F66,0)","v":0},null,{"$f":"IF(SUM(CI$59:CI$62)>0,$E66*$F66,0)","v":0},null,{"$f":"IF(SUM(CK$59:CK$62)>0,$E66*$F66,0)","v":0},null,{"$f":"IF(SUM(CM$59:CM$62)>0,$E66*$F66,0)","v":0},null,{"$f":"IF(SUM(CO$59:CO$62)>0,$E66*$F66,0)","v":0},null,{"$f":"IF(SUM(CQ$59:CQ$62)>0,$E66*$F66,0)","v":0},null,{"$f":"IF(SUM(CS$59:CS$62)>0,$E66*$F66,0)","v":0},null,{"$f":"IF(SUM(CU$59:CU$62)>0,$E66*$F66,0)","v":0},null,{"$f":"IF(SUM(CW$59:CW$62)>0,$E66*$F66,0)","v":0},null,{"$f":"IF(SUM(CY$59:CY$62)>0,$E66*$F66,0)","v":0},null,{"$f":"IF(SUM(DA$59:DA$62)>0,$E66*$F66,0)","v":0},null,{"$f":"IF(SUM(DC$59:DC$62)>0,$E66*$F66,0)","v":0},null,{"$f":"IF(SUM(DE$59:DE$62)>0,$E66*$F66,0)","v":0},null,{"$f":"IF(SUM(DG$59:DG$62)>0,$E66*$F66,0)","v":0},null,{"$f":"IF(SUM(DI$59:DI$62)>0,$E66*$F66,0)","v":0},null,{"$f":"IF(SUM(DK$59:DK$62)>0,$E66*$F66,0)","v":0},null,{"$f":"IF(SUM(DM$59:DM$62)>0,$E66*$F66,0)","v":0},null,{"$f":"IF(SUM(DO$59:DO$62)>0,$E66*$F66,0)","v":0},null,{"$f":"IF(SUM(DQ$59:DQ$62)>0,$E66*$F66,0)","v":0},null,{"$f":"IF(SUM(DS$59:DS$62)>0,$E66*$F66,0)","v":0},null,{"$f":"IF(SUM(DU$59:DU$62)>0,$E66*$F66,0)","v":0},null,{"$f":"IF(SUM(DW$59:DW$62)>0,$E66*$F66,0)","v":0}]

{"sheet":"Equip Rel","index":21,"n_rows":80,"n_cols":136,"rows_kept":80,"cut":false,"hidden":true,"merged":[[9,1,9,3],[10,1,10,14]]}
[null,null,"CÂMARA DOS DEPUTADOS"]
[null,null,"DEPARTAMENTO TÉCNICO"]
[null,null,"Coordenação de Planejamento e Gestão"]
[]
[null,null,"Data:",{"$f":"'Dados Gerais'!#REF!","v":{"$error":"#REF!"}}]
[null,null,"Processo:",{"$f":"'Dados Gerais'!#REF!","v":{"$error":"#REF!"}}]
[null,null,"Objeto:",{"$f":"'Dados Gerais'!#REF!","v":{"$error":"#REF!"}}]
[]
[]
[]
[null,"EQUIPAMENTOS RELACIONADOS AO POSTO - PAGAMENTO DA DEPRECIAÇÃO / MANUTENÇÃO",null,null,null,null,null,null,null,null,null,null,null,null,null,null,1,null,{"$f":"Q11+1","v":2},null,{"$f":"S11+1","v":3},null,{"$f":"U11+1","v":4},null,{"$f":"W11+1","v":5},null,{"$f":"Y11+1","v":6},null,{"$f":"AA11+1","v":7},null,{"$f":"AC11+1","v":8},null,{"$f":"AE11+1","v":9},null,{"$f":"AG11+1","v":10},null,{"$f":"AI11+1","v":11},null,{"$f":"AK11+1","v":12},null,{"$f":"AM11+1","v":13},null,{"$f":"AO11+1","v":14},null,{"$f":"AQ11+1","v":15},null,{"$f":"AS11+1","v":16},null,{"$f":"AU11+1","v":17},null,{"$f":"AW11+1","v":18},null,{"$f":"AY11+1","v":19},null,{"$f":"BA11+1","v":20},null,{"$f":"BC11+1","v":21},null,{"$f":"BE11+1","v":22},null,{"$f":"BG11+1","v":23},null,{"$f":"BI11+1","v":24},null,{"$f":"BK11+1","v":25},null,{"$f":"BM11+1","v":26},null,{"$f":"BO11+1","v":27},null,{"$f":"BQ11+1","v":28},null,{"$f":"BS11+1","v":29},null,{"$f":"BU11+1","v":30},null,{"$f":"BW11+1","v":31},null,{"$f":"BY11+1","v":32},null,{"$f":"CA11+1","v":33},null,{"$f":"CC11+1","v":34},null,{"$f":"CE11+1","v":35},null,{"$f":"CG11+1","v":36},null,{"$f":"CI11+1","v":37},null,{"$f":"CK11+1","v":38},null,{"$f":"CM11+1","v":39},null,{"$f":"CO11+1","v":40},null,{"$f":"CQ11+1","v":41},null,{"$f":"CS11+1","v":42},null,{"$f":"CU11+1","v":43},null,{"$f":"CW11+1","v":44},null,{"$f":"CY11+1","v":45},null,{"$f":"DA11+1","v":46},null,{"$f":"DC11+1","v":47},null,{"$f":"DE11+1","v":48},null,{"$f":"DG11+1","v":49},null,{"$f":"DI11+1","v":50},null,{"$f":"DK11+1","v":51},null,{"$f":"DM11+1","v":52},null,{"$f":"DO11+1","v":53},null,{"$f":"DQ11+1","v":54},null,{"$f":"DS11+1","v":55},null,{"$f":"DU11+1","v":56},null,{"$f":"DW11+1","v":57},null,{"$f":"DY11+1","v":58},null,{"$f":"EA11+1","v":59},null,{"$f":"EC11+1","v":60}]
[]
[null,null,null,null,null,null,null,null,null,null,null,null,null,null,null,null,{"$f":"SUM(R12:R61)","v":0},null,{"$f":"SUM(T12:T61)","v":0},null,{"$f":"SUM(V12:V61)","v":0},null,{"$f":"SUM(X12:X61)","v":0},null,{"$f":"SUM(Z12:Z61)","v":0},null,{"$f":"SUM(AB12:AB61)","v":0},null,{"$f":"SUM(AD12:AD61)","v":0},null,{"$f":"SUM(AF12:AF61)","v":0},null,{"$f":"SUM(AH12:AH61)","v":0},null,{"$f":"SUM(AJ12:AJ61)","v":0},null,{"$f":"SUM(AL12:AL61)","v":0},null,{"$f":"SUM(AN12:AN61)","v":0},null,{"$f":"SUM(AP12:AP61)","v":0},null,{"$f":"SUM(AR12:AR61)","v":0},null,{"$f":"SUM(AT12:AT61)","v":0},null,{"$f":"SUM(AV12:AV61)","v":0},null,{"$f":"SUM(AX12:AX61)","v":0},null,{"$f":"SUM(AZ12:AZ61)","v":0},null,{"$f":"SUM(BB12:BB61)","v":0},null,{"$f":"SUM(BD12:BD61)","v":0},null,{"$f":"SUM(BF12:BF61)","v":0},null,{"$f":"SUM(BH12:BH61)","v":0},null,{"$f":"SUM(BJ12:BJ61)","v":0},null,{"$f":"SUM(BL12:BL61)","v":0},null,{"$f":"SUM(BN12:BN61)","v":0},null,{"$f":"SUM(BP12:BP61)","v":0},null,{"$f":"SUM(BR12:BR61)","v":0},null,{"$f":"SUM(BT12:BT61)","v":0},null,{"$f":"SUM(BV12:BV61)","v":0},null,{"$f":"SUM(BX12:BX61)","v":0},null,{"$f":"SUM(BZ12:BZ61)","v":0},null,{"$f":"SUM(CB12:CB61)","v":0},null,{"$f":"SUM(CD12:CD61)","v":0},null,{"$f":"SUM(CF12:CF61)","v":0},null,{"$f":"SUM(CH12:CH61)","v":0},null,{"$f":"SUM(CJ12:CJ61)","v":0},null,{"$f":"SUM(CL12:CL61)","v":0},null,{"$f":"SUM(CN12:CN61)","v":0},null,{"$f":"SUM(CP12:CP61)","v":0},null,{"$f":"SUM(CR12:CR61)","v":0},null,{"$f":"SUM(CT12:CT61)","v":0},null,{"$f":"SUM(CV12:CV61)","v":0},null,{"$f":"SUM(CX12:CX61)","v":0},null,{"$f":"SUM(CZ12:CZ61)","v":0},null,{"$f":"SUM(DB12:DB61)","v":0},null,{"$f":"SUM(DD12:DD61)","v":0},null,{"$f":"SUM(DF12:DF61)","v":0},null,{"$f":"SUM(DH12:DH61)","v":0},null,{"$f":"SUM(DJ12:DJ61)","v":0},null,{"$f":"SUM(DL12:DL61)","v":0},null,{"$f":"SUM(DN12:DN61)","v":0},null,{"$f":"SUM(DP12:DP61)","v":0},null,{"$f":"SUM(DR12:DR61)","v":0},null,{"$f":"SUM(DT12:DT61)","v":0},null,{"$f":"SUM(DV12:DV61)","v":0},null,{"$f":"SUM(DX12:DX61)","v":0},null,{"$f":"SUM(DZ12:DZ61)","v":0},null,{"$f":"SUM(EB12:EB61)","v":0},null,{"$f":"SUM(ED12:ED61)","v":0},null,{"$f":"SUM(EF12:EF61)","v":0}]
[null,null,"CATEGORIAS",null,"QUANTIDADE"]
[null,null,null,null,null,null,null,null,null,null,null,null,null,null,null,null,{"$f":"IF($C15=Q$11,1,0)","v":0},null,{"$f":"IF($C15=S$11,1,0)","v":0},null,{"$f":"IF($C15=U$11,1,0)","v":0},null,{"$f":"IF($C15=W$11,1,0)","v":0},null,{"$f":"IF($C15=Y$11,1,0)","v":0},null,{"$f":"IF($C15=AA$11,1,0)","v":0},null,{"$f":"IF($C15=AC$11,1,0)","v":0},null,{"$f":"IF($C15=AE$11,1,0)","v":0},null,{"$f":"IF($C15=AG$11,1,0)","v":0},null,{"$f":"IF($C15=AI$11,1,0)","v":0},null,{"$f":"IF($C15=AK$11,1,0)","v":0},null,{"$f":"IF($C15=AM$11,1,0)","v":0},null,{"$f":"IF($C15=AO$11,1,0)","v":0},null,{"$f":"IF($C15=AQ$11,1,0)","v":0},null,{"$f":"IF($C15=AS$11,1,0)","v":0},null,{"$f":"IF($C15=AU$11,1,0)","v":0},null,{"$f":"IF($C15=AW$11,1,0)","v":0},null,{"$f":"IF($C15=AY$11,1,0)","v":0},null,{"$f":"IF($C15=BA$11,1,0)","v":0},null,{"$f":"IF($C15=BC$11,1,0)","v":0},null,{"$f":"IF($C15=BE$11,1,0)","v":0},null,{"$f":"IF($C15=BG$11,1,0)","v":0},null,{"$f":"IF($C15=BI$11,1,0)","v":0},null,{"$f":"IF($C15=BK$11,1,0)","v":0},null,{"$f":"IF($C15=BM$11,1,0)","v":0},null,{"$f":"IF($C15=BO$11,1,0)","v":0},null,{"$f":"IF($C15=BQ$11,1,0)","v":0},null,{"$f":"IF($C15=BS$11,1,0)","v":0},null,{"$f":"IF($C15=BU$11,1,0)","v":0},null,{"$f":"IF($C15=BW$11,1,0)","v":0},null,{"$f":"IF($C15=BY$11,1,0)","v":0},null,{"$f":"IF($C15=CA$11,1,0)","v":0},null,{"$f":"IF($C15=CC$11,1,0)","v":0},null,{"$f":"IF($C15=CE$11,1,0)","v":0},null,{"$f":"IF($C15=CG$11,1,0)","v":0},null,{"$f":"IF($C15=CI$11,1,0)","v":0},null,{"$f":"IF($C15=CK$11,1,0)","v":0},null,{"$f":"IF($C15=CM$11,1,0)","v":0},null,{"$f":"IF($C15=CO$11,1,0)","v":0},null,{"$f":"IF($C15=CQ$11,1,0)","v":0},null,{"$f":"IF($C15=CS$11,1,0)","v":0},null,{"$f":"IF($C15=CU$11,1,0)","v":0},null,{"$f":"IF($C15=CW$11,1,0)","v":0},null,{"$f":"IF($C15=CY$11,1,0)","v":0},null,{"$f":"IF($C15=DA$11,1,0)","v":0},null,{"$f":"IF($C15=DC$11,1,0)","v":0},null,{"$f":"IF($C15=DE$11,1,0)","v":0},null,{"$f":"IF($C15=DG$11,1,0)","v":0},null,{"$f":"IF($C15=DI$11,1,0)","v":0},null,{"$f":"IF($C15=DK$11,1,0)","v":0},null,{"$f":"IF($C15=DM$11,1,0)","v":0},null,{"$f":"IF($C15=DO$11,1,0)","v":0},null,{"$f":"IF($C15=DQ$11,1,0)","v":0},null,{"$f":"IF($C15=DS$11,1,0)","v":0},null,{"$f":"IF($C15=DU$11,1,0)","v":0},null,{"$f":"IF($C15=DW$11,1,0)","v":0},null,{"$f":"IF($C15=DY$11,1,0)","v":0},null,{"$f":"IF($C15=EA$11,1,0)","v":0},null,{"$f":"IF($C15=EC$11,1,0)","v":0},null,{"$f":"IF($C15=EE$11,1,0)","v":0}]
[null,null,null,{"$f":"HLOOKUP($C16,'Dados Gerais'!$D$5:$BK$10,6)","v":{"$error":"#N/A"}},{"$f":"HLOOKUP($C16,'Dados Gerais'!$D$5:$BK$14,10)","v":{"$error":"#N/A"}},null,null,null,null,null,null,null,null,null,null,null,{"$f":"IF($C16=Q$11,1,0)","v":0},null,{"$f":"IF($C16=S$11,1,0)","v":0},null,{"$f":"IF($C16=U$11,1,0)","v":0},null,{"$f":"IF($C16=W$11,1,0)","v":0},null,{"$f":"IF($C16=Y$11,1,0)","v":0},null,{"$f":"IF($C16=AA$11,1,0)","v":0},null,{"$f":"IF($C16=AC$11,1,0)","v":0},null,{"$f":"IF($C16=AE$11,1,0)","v":0},null,{"$f":"IF($C16=AG$11,1,0)","v":0},null,{"$f":"IF($C16=AI$11,1,0)","v":0},null,{"$f":"IF($C16=AK$11,1,0)","v":0},null,{"$f":"IF($C16=AM$11,1,0)","v":0},null,{"$f":"IF($C16=AO$11,1,0)","v":0},null,{"$f":"IF($C16=AQ$11,1,0)","v":0},null,{"$f":"IF($C16=AS$11,1,0)","v":0},null,{"$f":"IF($C16=AU$11,1,0)","v":0},null,{"$f":"IF($C16=AW$11,1,0)","v":0},null,{"$f":"IF($C16=AY$11,1,0)","v":0},null,{"$f":"IF($C16=BA$11,1,0)","v":0},null,{"$f":"IF($C16=BC$11,1,0)","v":0},null,{"$f":"IF($C16=BE$11,1,0)","v":0},null,{"$f":"IF($C16=BG$11,1,0)","v":0},null,{"$f":"IF($C16=BI$11,1,0)","v":0},null,{"$f":"IF($C16=BK$11,1,0)","v":0},null,{"$f":"IF($C16=BM$11,1,0)","v":0},null,{"$f":"IF($C16=BO$11,1,0)","v":0},null,{"$f":"IF($C16=BQ$11,1,0)","v":0},null,{"$f":"IF($C16=BS$11,1,0)","v":0},null,{"$f":"IF($C16=BU$11,1,0)","v":0},null,{"$f":"IF($C16=BW$11,1,0)","v":0},null,{"$f":"IF($C16=BY$11,1,0)","v":0},null,{"$f":"IF($C16=CA$11,1,0)","v":0},null,{"$f":"IF($C16=CC$11,1,0)","v":0},null,{"$f":"IF($C16=CE$11,1,0)","v":0},null,{"$f":"IF($C16=CG$11,1,0)","v":0},null,{"$f":"IF($C16=CI$11,1,0)","v":0},null,{"$f":"IF($C16=CK$11,1,0)","v":0},null,{"$f":"IF($C16=CM$11,1,0)","v":0},null,{"$f":"IF($C16=CO$11,1,0)","v":0},null,{"$f":"IF($C16=CQ$11,1,0)","v":0},null,{"$f":"IF($C16=CS$11,1,0)","v":0},null,{"$f":"IF($C16=CU$11,1,0)","v":0},null,{"$f":"IF($C16=CW$11,1,0)","v":0},null,{"$f":"IF($C16=CY$11,1,0)","v":0},null,{"$f":"IF($C16=DA$11,1,0)","v":0},null,{"$f":"IF($C16=DC$11,1,0)","v":0},null,{"$f":"IF($C16=DE$11,1,0)","v":0},null,{"$f":"IF($C16=DG$11,1,0)","v":0},null,{"$f":"IF($C16=DI$11,1,0)","v":0},null,{"$f":"IF($C16=DK$11,1,0)","v":0},null,{"$f":"IF($C16=DM$11,1,0)","v":0},null,{"$f":"IF($C16=DO$11,1,0)","v":0},null,{"$f":"IF($C16=DQ$11,1,0)","v":0},null,{"$f":"IF($C16=DS$11,1,0)","v":0},null,{"$f":"IF($C16=DU$11,1,0)","v":0},null,{"$f":"IF($C16=DW$11,1,0)","v":0},null,{"$f":"IF($C16=DY$11,1,0)","v":0},null,{"$f":"IF($C16=EA$11,1,0)","v":0},null,{"$f":"IF($C16=EC$11,1,0)","v":0},null,{"$f":"IF($C16=EE$11,1,0)","v":0}]
[null,null,null,null,null,null,null,null,null,null,null,null,null,null,null,null,{"$f":"IF($C17=Q$11,1,0)","v":0},null,{"$f":"IF($C17=S$11,1,0)","v":0},null,{"$f":"IF($C17=U$11,1,0)","v":0},null,{"$f":"IF($C17=W$11,1,0)","v":0},null,{"$f":"IF($C17=Y$11,1,0)","v":0},null,{"$f":"IF($C17=AA$11,1,0)","v":0},null,{"$f":"IF($C17=AC$11,1,0)","v":0},null,{"$f":"IF($C17=AE$11,1,0)","v":0},null,{"$f":"IF($C17=AG$11,1,0)","v":0},null,{"$f":"IF($C17=AI$11,1,0)","v":0},null,{"$f":"IF($C17=AK$11,1,0)","v":0},null,{"$f":"IF($C17=AM$11,1,0)","v":0},null,{"$f":"IF($C17=AO$11,1,0)","v":0},null,{"$f":"IF($C17=AQ$11,1,0)","v":0},null,{"$f":"IF($C17=AS$11,1,0)","v":0},null,{"$f":"IF($C17=AU$11,1,0)","v":0},null,{"$f":"IF($C17=AW$11,1,0)","v":0},null,{"$f":"IF($C17=AY$11,1,0)","v":0},null,{"$f":"IF($C17=BA$11,1,0)","v":0},null,{"$f":"IF($C17=BC$11,1,0)","v":0},null,{"$f":"IF($C17=BE$11,1,0)","v":0},null,{"$f":"IF($C17=BG$11,1,0)","v":0},null,{"$f":"IF($C17=BI$11,1,0)","v":0},null,{"$f":"IF($C17=BK$11,1,0)","v":0},null,{"$f":"IF($C17=BM$11,1,0)","v":0},null,{"$f":"IF($C17=BO$11,1,0)","v":0},null,{"$f":"IF($C17=BQ$11,1,0)","v":0},null,{"$f":"IF($C17=BS$11,1,0)","v":0},null,{"$f":"IF($C17=BU$11,1,0)","v":0},null,{"$f":"IF($C17=BW$11,1,0)","v":0},null,{"$f":"IF($C17=BY$11,1,0)","v":0},null,{"$f":"IF($C17=CA$11,1,0)","v":0},null,{"$f":"IF($C17=CC$11,1,0)","v":0},null,{"$f":"IF($C17=CE$11,1,0)","v":0},null,{"$f":"IF($C17=CG$11,1,0)","v":0},null,{"$f":"IF($C17=CI$11,1,0)","v":0},null,{"$f":"IF($C17=CK$11,1,0)","v":0},null,{"$f":"IF($C17=CM$11,1,0)","v":0},null,{"$f":"IF($C17=CO$11,1,0)","v":0},null,{"$f":"IF($C17=CQ$11,1,0)","v":0},null,{"$f":"IF($C17=CS$11,1,0)","v":0},null,{"$f":"IF($C17=CU$11,1,0)","v":0},null,{"$f":"IF($C17=CW$11,1,0)","v":0},null,{"$f":"IF($C17=CY$11,1,0)","v":0},null,{"$f":"IF($C17=DA$11,1,0)","v":0},null,{"$f":"IF($C17=DC$11,1,0)","v":0},null,{"$f":"IF($C17=DE$11,1,0)","v":0},null,{"$f":"IF($C17=DG$11,1,0)","v":0},null,{"$f":"IF($C17=DI$11,1,0)","v":0},null,{"$f":"IF($C17=DK$11,1,0)","v":0},null,{"$f":"IF($C17=DM$11,1,0)","v":0},null,{"$f":"IF($C17=DO$11,1,0)","v":0},null,{"$f":"IF($C17=DQ$11,1,0)","v":0},null,{"$f":"IF($C17=DS$11,1,0)","v":0},null,{"$f":"IF($C17=DU$11,1,0)","v":0},null,{"$f":"IF($C17=DW$11,1,0)","v":0},null,{"$f":"IF($C17=DY$11,1,0)","v":0},null,{"$f":"IF($C17=EA$11,1,0)","v":0},null,{"$f":"IF($C17=EC$11,1,0)","v":0},null,{"$f":"IF($C17=EE$11,1,0)","v":0}]
[]
[null,null,"PAGAMENTO DA DEPRECIAÇÃO"]
[null,null,"ITEM","DESCRIÇÃO","QUANT ANUAL","CONTA SIAFI","VALOR DE AQ.","% RESIDUAL","VIDA ÚTIL","DEP. MENSAL","CUSTO TOTAL","BDI (%)","PREÇO TOTAL","FONTE","REFERÊNCIA"]
[]
[null,null,null,null,null,null,null,null,null,{"$f":"G22*(1-H22)/(I22*12)","v":{"$error":"#DIV/0!"}},{"$f":"J22*E22","v":{"$error":"#DIV/0!"}},{"$f":"BDI!E26","v":0.26939999999999997},{"$f":"ROUND(K22*(1+L22),2)","v":{"$error":"#DIV/0!"}},"COTAÇÃO"]
[]
[]
[null,null,"PAGAMENTO DA MANUTENÇÃO"]
[null,null,"ITEM","DESCRIÇÃO",null,null,null,"K (calculado)","MENSAL DEPR.","% MAN X DEP","MENSAL MAN.","BDI (%)","PREÇO TOTAL"]
[]
[null,null,null,null,null,null,null,{"$f":"H35","v":0.23950080000000007},{"$f":"M22","v":{"$error":"#DIV/0!"}},{"$f":"H28","v":0.23950080000000007},{"$f":"I28*H28","v":{"$error":"#DIV/0!"}},{"$f":"L22","v":0.26939999999999997},{"$f":"ROUND(K28*(1+L28),2)","v":{"$error":"#DIV/0!"}}]
[]
[null,null,null,null,"K1","K2","K3","K4"]
[null,null,null,null,1,1,0.8,0.8]
[null,null,null,null,"K5","K6","K7","K8"]
[null,null,null,null,1,0.6,0.5,1.1000000000000001]
[null,null,null,null,"K9","K10","K11","RESULTADO"]
[null,null,null,"* a descrição de cada coeficiente segue abaixo",0.9,0.9,1.4,{"$f":"E31*F31*G31*H31*E33*F33*G33*H33*E35*F35*G35","v":0.23950080000000007}]
[]
[]
[null,null,"MATERIAL DE CONSUMO ASSOCIADO"]
[null,null,"ITEM","DESCRIÇÃO",null,null,null,"QUANTID/ANO","UNIDADE","VALOR DE AQ.","MENSAL MAT","BDI (%)","PREÇO TOTAL"]
[]
[null,null,null,null,null,null,null,null,null,null,{"$f":"J41*H41/12","v":0},{"$f":"L28","v":0.26939999999999997},{"$f":"ROUND(K41*(1+L41),2)","v":0}]
[]
[]
[null,null,"MATERIAL DE CONSUMO ASSOCIADO"]
[null,null,"ITEM","DESCRIÇÃO",null,null,null,null,null,null,null,null,"PREÇO TOTAL"]
[]
[null,null,1,"Componente DEPRECIAÇÃO - POR POSTO",null,null,null,null,null,null,null,null,{"$f":"M22","v":{"$error":"#DIV/0!"}}]
[null,null,2,"Componente MANUTENÇÃO - POR POSTO",null,null,null,null,null,null,null,null,{"$f":"M28","v":{"$error":"#DIV/0!"}}]
[null,null,3,"Componente MATERIAL DE CONSUMO ASSOCIADO - POR POSTO",null,null,null,null,null,null,null,null,{"$f":"M41","v":0}]
[]
[null,null,null,null,null,null,null,null,null,null,null,"SOMATÓRIO TOTAL MENSAL - POR POSTO",{"$f":"SUM(M46:M50)","v":{"$error":"#DIV/0!"}},null,null,null,null,{"$f":"IF(SUM(Q$15:Q$17)>0,$M51,0)","v":0},null,{"$f":"IF(SUM(S$15:S$17)>0,$M51,0)","v":0},null,{"$f":"IF(SUM(U$15:U$17)>0,$M51,0)","v":0},null,{"$f":"IF(SUM(W$15:W$17)>0,$M51,0)","v":0},null,{"$f":"IF(SUM(Y$15:Y$17)>0,$M51,0)","v":0},null,{"$f":"IF(SUM(AA$15:AA$17)>0,$M51,0)","v":0},null,{"$f":"IF(SUM(AC$15:AC$17)>0,$M51,0)","v":0},null,{"$f":"IF(SUM(AE$15:AE$17)>0,$M51,0)","v":0},null,{"$f":"IF(SUM(AG$15:AG$17)>0,$M51,0)","v":0},null,{"$f":"IF(SUM(AI$15:AI$17)>0,$M51,0)","v":0},null,{"$f":"IF(SUM(AK$15:AK$17)>0,$M51,0)","v":0},null,{"$f":"IF(SUM(AM$15:AM$17)>0,$M51,0)","v":0},null,{"$f":"IF(SUM(AO$15:AO$17)>0,$M51,0)","v":0},null,{"$f":"IF(SUM(AQ$15:AQ$17)>0,$M51,0)","v":0},null,{"$f":"IF(SUM(AS$15:AS$17)>0,$M51,0)","v":0},null,{"$f":"IF(SUM(AU$15:AU$17)>0,$M51,0)","v":0},null,{"$f":"IF(SUM(AW$15:AW$17)>0,$M51,0)","v":0},null,{"$f":"IF(SUM(AY$15:AY$17)>0,$M51,0)","v":0},null,{"$f":"IF(SUM(BA$15:BA$17)>0,$M51,0)","v":0},null,{"$f":"IF(SUM(BC$15:BC$17)>0,$M51,0)","v":0},null,{"$f":"IF(SUM(BE$15:BE$17)>0,$M51,0)","v":0},null,{"$f":"IF(SUM(BG$15:BG$17)>0,$M51,0)","v":0},null,{"$f":"IF(SUM(BI$15:BI$17)>0,$M51,0)","v":0},null,{"$f":"IF(SUM(BK$15:BK$17)>0,$M51,0)","v":0},null,{"$f":"IF(SUM(BM$15:BM$17)>0,$M51,0)","v":0},null,{"$f":"IF(SUM(BO$15:BO$17)>0,$M51,0)","v":0},null,{"$f":"IF(SUM(BQ$15:BQ$17)>0,$M51,0)","v":0},null,{"$f":"IF(SUM(BS$15:BS$17)>0,$M51,0)","v":0},null,{"$f":"IF(SUM(BU$15:BU$17)>0,$M51,0)","v":0},null,{"$f":"IF(SUM(BW$15:BW$17)>0,$M51,0)","v":0},null,{"$f":"IF(SUM(BY$15:BY$17)>0,$M51,0)","v":0},null,{"$f":"IF(SUM(CA$15:CA$17)>0,$M51,0)","v":0},null,{"$f":"IF(SUM(CC$15:CC$17)>0,$M51,0)","v":0},null,{"$f":"IF(SUM(CE$15:CE$17)>0,$M51,0)","v":0},null,{"$f":"IF(SUM(CG$15:CG$17)>0,$M51,0)","v":0},null,{"$f":"IF(SUM(CI$15:CI$17)>0,$M51,0)","v":0},null,{"$f":"IF(SUM(CK$15:CK$17)>0,$M51,0)","v":0},null,{"$f":"IF(SUM(CM$15:CM$17)>0,$M51,0)","v":0},null,{"$f":"IF(SUM(CO$15:CO$17)>0,$M51,0)","v":0},null,{"$f":"IF(SUM(CQ$15:CQ$17)>0,$M51,0)","v":0},null,{"$f":"IF(SUM(CS$15:CS$17)>0,$M51,0)","v":0},null,{"$f":"IF(SUM(CU$15:CU$17)>0,$M51,0)","v":0},null,{"$f":"IF(SUM(CW$15:CW$17)>0,$M51,0)","v":0},null,{"$f":"IF(SUM(CY$15:CY$17)>0,$M51,0)","v":0},null,{"$f":"IF(SUM(DA$15:DA$17)>0,$M51,0)","v":0},null,{"$f":"IF(SUM(DC$15:DC$17)>0,$M51,0)","v":0},null,{"$f":"IF(SUM(DE$15:DE$17)>0,$M51,0)","v":0},null,{"$f":"IF(SUM(DG$15:DG$17)>0,$M51,0)","v":0},null,{"$f":"IF(SUM(DI$15:DI$17)>0,$M51,0)","v":0},null,{"$f":"IF(SUM(DK$15:DK$17)>0,$M51,0)","v":0},null,{"$f":"IF(SUM(DM$15:DM$17)>0,$M51,0)","v":0},null,{"$f":"IF(SUM(DO$15:DO$17)>0,$M51,0)","v":0},null,{"$f":"IF(SUM(DQ$15:DQ$17)>0,$M51,0)","v":0},null,{"$f":"IF(SUM(DS$15:DS$17)>0,$M51,0)","v":0},null,{"$f":"IF(SUM(DU$15:DU$17)>0,$M51,0)","v":0},null,{"$f":"IF(SUM(DW$15:DW$17)>0,$M51,0)","v":0},null,{"$f":"IF(SUM(DY$15:DY$17)>0,$M51,0)","v":0},null,{"$f":"IF(SUM(EA$15:EA$17)>0,$M51,0)","v":0},null,{"$f":"IF(SUM(EC$15:EC$17)>0,$M51,0)","v":0},null,{"$f":"IF(SUM(EE$15:EE$17)>0,$M51,0)","v":0}]
[null,null,null,null,null,null,null,null,null,null,null,"SOMATÓRIO TOTAL ANUAL - POR POSTO",{"$f":"M51*12","v":{"$error":"#DIV/0!"}}]
[]
[]
[null,null,"MATERIAL DE CONSUMO ASSOCIADO"]
[null,null,"MEMÓRIA DE CÁLCULO DO COEFICIENTE DE CORRELAÇÃO MANUTENÇÃO X DEPRECIAÇÃO (K)"]
[]
[null,null,"JUSTIFICATIVAS",null,"TIPO","K1",null,"Condições de Trab","K4",null,"Tempo Vida (anos)","K6",null,"Temperatura","K8"]
[null,null,null,null,"Guindaste",0.5,null,"Em espera",0.4,null,1,0.6,null,"Muito quente (> 40º C)",1.3]
[null,null,"K1","Arbitrado 1","Caminhão-comum",0.8,null,"Leves",0.8,null,2,0.7,null,"Quente (30º a 40º C)",1.1000000000000001]
[null,null,"K2","Considerado o operador médio","Fora-de-estrada",1,null,"Médias",1,null,3,0.8,null,"Médio (10º a 30º C)",1]
[null,null,"K3","Consideradas ferramentas de primeira qualidade","Carregadeira",1,null,"Pesadas",1.4,null,4,0.9,null,"Frio (< 10º C)",1.2]
[null,null,"K4","Consições leves","Escavadeira",1.4,null,"Severas",2,null,5,1]
[null,null,"K5","Considerando manutenção normal","Motoescrêiper",1.1000000000000001,null,null,null,null,6,1,null,"Ritmo de Trabalho","K9"]
[null,null,"K6","Equipamentos novos","Trator de esteira",1.2,null,"Manutenção","K5",null,7,1,null,"Folgado",0.9]
[null,null,"K7","220h por mês, 252 dias por ano",null,null,null,"Excelente",0.6,null,8,1.2,null,"Médio ",1]
[null,null,"K8","Clima quente, acima de 30º C","Qualid do Operador","K2",null,"Boa",0.8,null,9,1.3,null,"Com pressa",1.5]
[null,null,"K9","Ritmo de trabalho usualmente folgado","Excelente",0.8,null,"Média",1,null,10,1.4]
[null,null,"K10","Considerado o operador médio","Boa",0.9,null,"Ruim ",1.5,null,11,2,null,"Conh do Serviço","K10"]
[null,null,"K11","Foi considerada a opção de aluguel a terceiros, ainda que a simulação seja dos custos do contratado, contudo a execução dos serviços é em local de terceiros","Média",1,null,"Inexistente",3,null,15,2,null,"Grande ",0.8]
[null,null,null,null,"Ruim",1.2,null,null,null,null,null,null,null,"Médio     ",0.9]
[null,null,null,null,"Péssima",2,null,"Horas de Uso ","K7",6000,1,null,null,"Pouco ",1]
[null,null,null,null,null,null,null,1000,0.5,8000,1.3]
[null,null,null,null,"Qualidade do Equip","K3",null,2000,0.5,10000,1.6,null,null,"Tipo do Serviço","K11"]
[null,null,null,null,"De primeira",0.8,null,3000,0.6,12000,1.9,null,null,"Mina ou Pedreira",0.8]
[null,null,null,null,"Média",1,null,4000,0.7,15000,2.2999999999999998,null,null,"Construção Geral",1]
[null,null,null,null,"Ruim",1.5,null,5000,0.9,20000,3,null,null,"Aluguel a Terceiros",1.4]
[]
[null,null,null,null,"Fonte: "]
[null,null,null,null,"MATTOS, Aldo Dórea. Como preparar orçamentos de obras. São Paulo: Pini, 2006. 281 p., il"]

{"sheet":"Mat Cons","index":22,"n_rows":28,"n_cols":128,"rows_kept":28,"cut":false,"hidden":true,"merged":[[9,1,9,3],[10,1,10,5]]}
[null,null,"CÂMARA DOS DEPUTADOS"]
[null,null,"DEPARTAMENTO TÉCNICO"]
[null,null,"Coordenação de Planejamento e Gestão"]
[]
[null,null,"Data:",{"$f":"'Dados Gerais'!#REF!","v":{"$error":"#REF!"}}]
[null,null,"Processo:",{"$f":"'Dados Gerais'!#REF!","v":{"$error":"#REF!"}}]
[null,null,"Objeto:",{"$f":"'Dados Gerais'!#REF!","v":{"$error":"#REF!"}}]
[]
[]
[]
[null,"MATERIAIS DE CONSUMO RELACIONADOS AO POSTO - AQUISIÇÃO",null,null,null,null,null,null,1,null,{"$f":"I11+1","v":2},null,{"$f":"K11+1","v":3},null,{"$f":"M11+1","v":4},null,{"$f":"O11+1","v":5},null,{"$f":"Q11+1","v":6},null,{"$f":"S11+1","v":7},null,{"$f":"U11+1","v":8},null,{"$f":"W11+1","v":9},null,{"$f":"Y11+1","v":10},null,{"$f":"AA11+1","v":11},null,{"$f":"AC11+1","v":12},null,{"$f":"AE11+1","v":13},null,{"$f":"AG11+1","v":14},null,{"$f":"AI11+1","v":15},null,{"$f":"AK11+1","v":16},null,{"$f":"AM11+1","v":17},null,{"$f":"AO11+1","v":18},null,{"$f":"AQ11+1","v":19},null,{"$f":"AS11+1","v":20},null,{"$f":"AU11+1","v":21},null,{"$f":"AW11+1","v":22},null,{"$f":"AY11+1","v":23},null,{"$f":"BA11+1","v":24},null,{"$f":"BC11+1","v":25},null,{"$f":"BE11+1","v":26},null,{"$f":"BG11+1","v":27},null,{"$f":"BI11+1","v":28},null,{"$f":"BK11+1","v":29},null,{"$f":"BM11+1","v":30},null,{"$f":"BO11+1","v":31},null,{"$f":"BQ11+1","v":32},null,{"$f":"BS11+1","v":33},null,{"$f":"BU11+1","v":34},null,{"$f":"BW11+1","v":35},null,{"$f":"BY11+1","v":36},null,{"$f":"CA11+1","v":37},null,{"$f":"CC11+1","v":38},null,{"$f":"CE11+1","v":39},null,{"$f":"CG11+1","v":40},null,{"$f":"CI11+1","v":41},null,{"$f":"CK11+1","v":42},null,{"$f":"CM11+1","v":43},null,{"$f":"CO11+1","v":44},null,{"$f":"CQ11+1","v":45},null,{"$f":"CS11+1","v":46},null,{"$f":"CU11+1","v":47},null,{"$f":"CW11+1","v":48},null,{"$f":"CY11+1","v":49},null,{"$f":"DA11+1","v":50},null,{"$f":"DC11+1","v":51},null,{"$f":"DE11+1","v":52},null,{"$f":"DG11+1","v":53},null,{"$f":"DI11+1","v":54},null,{"$f":"DK11+1","v":55},null,{"$f":"DM11+1","v":56},null,{"$f":"DO11+1","v":57},null,{"$f":"DQ11+1","v":58},null,{"$f":"DS11+1","v":59},null,{"$f":"DU11+1","v":60}]
[]
[null,null,null,null,null,null,null,null,{"$f":"ROUND(SUM(J12:J65),2)","v":0},null,{"$f":"ROUND(SUM(L12:L65),2)","v":0},null,{"$f":"ROUND(SUM(N12:N65),2)","v":0},null,{"$f":"ROUND(SUM(P12:P65),2)","v":0},null,{"$f":"ROUND(SUM(R12:R65),2)","v":0},null,{"$f":"ROUND(SUM(T12:T65),2)","v":0},null,{"$f":"ROUND(SUM(V12:V65),2)","v":0},null,{"$f":"ROUND(SUM(X12:X65),2)","v":0},null,{"$f":"ROUND(SUM(Z12:Z65),2)","v":0},null,{"$f":"ROUND(SUM(AB12:AB65),2)","v":0},null,{"$f":"ROUND(SUM(AD12:AD65),2)","v":0},null,{"$f":"ROUND(SUM(AF12:AF65),2)","v":0},null,{"$f":"ROUND(SUM(AH12:AH65),2)","v":0},null,{"$f":"ROUND(SUM(AJ12:AJ65),2)","v":0},null,{"$f":"ROUND(SUM(AL12:AL65),2)","v":0},null,{"$f":"ROUND(SUM(AN12:AN65),2)","v":0},null,{"$f":"ROUND(SUM(AP12:AP65),2)","v":0},null,{"$f":"ROUND(SUM(AR12:AR65),2)","v":0},null,{"$f":"ROUND(SUM(AT12:AT65),2)","v":0},null,{"$f":"ROUND(SUM(AV12:AV65),2)","v":0},null,{"$f":"ROUND(SUM(AX12:AX65),2)","v":0},null,{"$f":"ROUND(SUM(AZ12:AZ65),2)","v":0},null,{"$f":"ROUND(SUM(BB12:BB65),2)","v":0},null,{"$f":"ROUND(SUM(BD12:BD65),2)","v":0},null,{"$f":"ROUND(SUM(BF12:BF65),2)","v":0},null,{"$f":"ROUND(SUM(BH12:BH65),2)","v":0},null,{"$f":"ROUND(SUM(BJ12:BJ65),2)","v":0},null,{"$f":"ROUND(SUM(BL12:BL65),2)","v":0},null,{"$f":"ROUND(SUM(BN12:BN65),2)","v":0},null,{"$f":"ROUND(SUM(BP12:BP65),2)","v":0},null,{"$f":"ROUND(SUM(BR12:BR65),2)","v":0},null,{"$f":"ROUND(SUM(BT12:BT65),2)","v":0},null,{"$f":"ROUND(SUM(BV12:BV65),2)","v":0},null,{"$f":"ROUND(SUM(BX12:BX65),2)","v":0},null,{"$f":"ROUND(SUM(BZ12:BZ65),2)","v":0},null,{"$f":"ROUND(SUM(CB12:CB65),2)","v":0},null,{"$f":"ROUND(SUM(CD12:CD65),2)","v":0},null,{"$f":"ROUND(SUM(CF12:CF65),2)","v":0},null,{"$f":"ROUND(SUM(CH12:CH65),2)","v":0},null,{"$f":"ROUND(SUM(CJ12:CJ65),2)","v":0},null,{"$f":"ROUND(SUM(CL12:CL65),2)","v":0},null,{"$f":"ROUND(SUM(CN12:CN65),2)","v":0},null,{"$f":"ROUND(SUM(CP12:CP65),2)","v":0},null,{"$f":"ROUND(SUM(CR12:CR65),2)","v":0},null,{"$f":"ROUND(SUM(CT12:CT65),2)","v":0},null,{"$f":"ROUND(SUM(CV12:CV65),2)","v":0},null,{"$f":"ROUND(SUM(CX12:CX65),2)","v":0},null,{"$f":"ROUND(SUM(CZ12:CZ65),2)","v":0},null,{"$f":"ROUND(SUM(DB12:DB65),2)","v":0},null,{"$f":"ROUND(SUM(DD12:DD65),2)","v":0},null,{"$f":"ROUND(SUM(DF12:DF65),2)","v":0},null,{"$f":"ROUND(SUM(DH12:DH65),2)","v":0},null,{"$f":"ROUND(SUM(DJ12:DJ65),2)","v":0},null,{"$f":"ROUND(SUM(DL12:DL65),2)","v":0},null,{"$f":"ROUND(SUM(DN12:DN65),2)","v":0},null,{"$f":"ROUND(SUM(DP12:DP65),2)","v":0},null,{"$f":"ROUND(SUM(DR12:DR65),2)","v":0},null,{"$f":"ROUND(SUM(DT12:DT65),2)","v":0},null,{"$f":"ROUND(SUM(DV12:DV65),2)","v":0},null,{"$f":"ROUND(SUM(DX12:DX65),2)","v":0}]
[null,null,"CATEGORIAS",null,null,"QUANTIDADE"]
[null,null,null,null,null,null,null,null,{"$f":"IF($C15=I$11,1,0)","v":0}]
[null,null,null,null,null,null,null,null,0,null,{"$f":"IF($C16=K$11,1,0)","v":0},null,{"$f":"IF($C16=M$11,1,0)","v":0},null,{"$f":"IF($C16=O$11,1,0)","v":0},null,{"$f":"IF($C16=Q$11,1,0)","v":0},null,{"$f":"IF($C16=S$11,1,0)","v":0},null,{"$f":"IF($C16=U$11,1,0)","v":0},null,{"$f":"IF($C16=W$11,1,0)","v":0},null,{"$f":"IF($C16=Y$11,1,0)","v":0},null,{"$f":"IF($C16=AA$11,1,0)","v":0},null,{"$f":"IF($C16=AC$11,1,0)","v":0},null,{"$f":"IF($C16=AE$11,1,0)","v":0},null,{"$f":"IF($C16=AG$11,1,0)","v":0},null,{"$f":"IF($C16=AI$11,1,0)","v":0},null,{"$f":"IF($C16=AK$11,1,0)","v":0},null,{"$f":"IF($C16=AM$11,1,0)","v":0},null,{"$f":"IF($C16=AO$11,1,0)","v":0},null,{"$f":"IF($C16=AQ$11,1,0)","v":0},null,{"$f":"IF($C16=AS$11,1,0)","v":0},null,{"$f":"IF($C16=AU$11,1,0)","v":0},null,{"$f":"IF($C16=AW$11,1,0)","v":0},null,{"$f":"IF($C16=AY$11,1,0)","v":0},null,{"$f":"IF($C16=BA$11,1,0)","v":0},null,{"$f":"IF($C16=BC$11,1,0)","v":0},null,{"$f":"IF($C16=BE$11,1,0)","v":0},null,{"$f":"IF($C16=BG$11,1,0)","v":0},null,{"$f":"IF($C16=BI$11,1,0)","v":0},null,{"$f":"IF($C16=BK$11,1,0)","v":0},null,{"$f":"IF($C16=BM$11,1,0)","v":0},null,{"$f":"IF($C16=BO$11,1,0)","v":0},null,{"$f":"IF($C16=BQ$11,1,0)","v":0},null,{"$f":"IF($C16=BS$11,1,0)","v":0},null,{"$f":"IF($C16=BU$11,1,0)","v":0},null,{"$f":"IF($C16=BW$11,1,0)","v":0},null,{"$f":"IF($C16=BY$11,1,0)","v":0},null,{"$f":"IF($C16=CA$11,1,0)","v":0},null,{"$f":"IF($C16=CC$11,1,0)","v":0},null,{"$f":"IF($C16=CE$11,1,0)","v":0},null,{"$f":"IF($C16=CG$11,1,0)","v":0},null,{"$f":"IF($C16=CI$11,1,0)","v":0},null,{"$f":"IF($C16=CK$11,1,0)","v":0},null,{"$f":"IF($C16=CM$11,1,0)","v":0},null,{"$f":"IF($C16=CO$11,1,0)","v":0},null,{"$f":"IF($C16=CQ$11,1,0)","v":0},null,{"$f":"IF($C16=CS$11,1,0)","v":0},null,{"$f":"IF($C16=CU$11,1,0)","v":0},null,{"$f":"IF($C16=CW$11,1,0)","v":0},null,{"$f":"IF($C16=CY$11,1,0)","v":0},null,{"$f":"IF($C16=DA$11,1,0)","v":0},null,{"$f":"IF($C16=DC$11,1,0)","v":0},null,{"$f":"IF($C16=DE$11,1,0)","v":0},null,{"$f":"IF($C16=DG$11,1,0)","v":0},null,{"$f":"IF($C16=DI$11,1,0)","v":0},null,{"$f":"IF($C16=DK$11,1,0)","v":0},null,{"$f":"IF($C16=DM$11,1,0)","v":0},null,{"$f":"IF($C16=DO$11,1,0)","v":0},null,{"$f":"IF($C16=DQ$11,1,0)","v":0},null,{"$f":"IF($C16=DS$11,1,0)","v":0},null,{"$f":"IF($C16=DU$11,1,0)","v":0},null,{"$f":"IF($C16=DW$11,1,0)","v":0}]
[null,null,null,null,null,null,null,null,0,null,0,null,0,null,0,null,0,null,0,null,0,null,0,null,0,null,0,null,0,null,0,null,0,null,0,null,0,null,0,null,0,null,0,null,0,null,0,null,0,null,0,null,0,null,0,null,0,null,0,null,0,null,0,null,0,null,0,null,0,null,0,null,0,null,0,null,0,null,0,null,0,null,0,null,0,null,0,null,0,null,0,null,0,null,0,null,0,null,0,null,0,null,0,null,0,null,0,null,0,null,0,null,0,null,0,null,0,null,0,null,0,null,0,null,0,null,0]
[null,null,null,null,null,null,null,null,0,null,0,null,0,null,0,null,0,null,0,null,0,null,0,null,0,null,0,null,0,null,0,null,0,null,0,null,0,null,0,null,0,null,0,null,0,null,0,null,0,null,0,null,0,null,0,null,0,null,0,null,0,null,0,null,0,null,0,null,0,null,0,null,0,null,0,null,0,null,0,null,0,null,0,null,0,null,0,null,0,null,0,null,0,null,0,null,0,null,0,null,0,null,0,null,0,null,0,null,0,null,0,null,0,null,0,null,0,null,0,null,0,null,0,null,0,null,0]
[null,null,null,null,null,null,null,null,0,null,0,null,0,null,0,null,0,null,0,null,0,null,0,null,0,null,0,null,0,null,0,null,0,null,0,null,0,null,0,null,0,null,0,null,0,null,0,null,0,null,0,null,0,null,0,null,0,null,0,null,0,null,0,null,0,null,0,null,0,null,0,null,0,null,0,null,0,null,0,null,0,null,0,null,0,null,0,null,0,null,0,null,0,null,0,null,0,null,0,null,0,null,0,null,0,null,0,null,0,null,0,null,0,null,0,null,0,null,0,null,0,null,0,null,0,null,0]
[null,null,null,null,null,null,null,null,0,null,0,null,0,null,0,null,0,null,0,null,0,null,0,null,0,null,0,null,0,null,0,null,0,null,0,null,0,null,0,null,0,null,0,null,0,null,0,null,0,null,0,null,0,null,0,null,0,null,0,null,0,null,0,null,0,null,0,null,0,null,0,null,0,null,0,null,0,null,0,null,0,null,0,null,0,null,0,null,0,null,0,null,0,null,0,null,0,null,0,null,0,null,0,null,0,null,0,null,0,null,0,null,0,null,0,null,0,null,0,null,0,null,0,null,0,null,0]
[null,null,null,null,null,null,null,null,0,null,0,null,0,null,0,null,0,null,0,null,0,null,0,null,0,null,0,null,0,null,0,null,0,null,0,null,0,null,0,null,0,null,0,null,0,null,0,null,0,null,0,null,0,null,0,null,0,null,0,null,0,null,0,null,0,null,0,null,0,null,0,null,0,null,0,null,0,null,0,null,0,null,0,null,0,null,0,null,0,null,0,null,0,null,0,null,0,null,0,null,0,null,0,null,0,null,0,null,0,null,0,null,0,null,0,null,0,null,0,null,0,null,0,null,0,null,0]
[null,null,null,null,null,null,null,null,0]
[]
[null,null,"ITEM","DESCRIÇÃO","QUANT ANUAL","VALOR"]
[null,null,null,null,null,null,null,null,null,{"$f":"IF(SUM(I$15:I$22)>0,$E25*$F25,0)","v":0},null,{"$f":"IF(SUM(K$15:K$22)>0,$E25*$F25,0)","v":0},null,{"$f":"IF(SUM(M$15:M$22)>0,$E25*$F25,0)","v":0},null,{"$f":"IF(SUM(O$15:O$22)>0,$E25*$F25,0)","v":0},null,{"$f":"IF(SUM(Q$15:Q$22)>0,$E25*$F25,0)","v":0},null,{"$f":"IF(SUM(S$15:S$22)>0,$E25*$F25,0)","v":0},null,{"$f":"IF(SUM(U$15:U$22)>0,$E25*$F25,0)","v":0},null,{"$f":"IF(SUM(W$15:W$22)>0,$E25*$F25,0)","v":0},null,{"$f":"IF(SUM(Y$15:Y$22)>0,$E25*$F25,0)","v":0},null,{"$f":"IF(SUM(AA$15:AA$22)>0,$E25*$F25,0)","v":0},null,{"$f":"IF(SUM(AC$15:AC$22)>0,$E25*$F25,0)","v":0},null,{"$f":"IF(SUM(AE$15:AE$22)>0,$E25*$F25,0)","v":0},null,{"$f":"IF(SUM(AG$15:AG$22)>0,$E25*$F25,0)","v":0},null,{"$f":"IF(SUM(AI$15:AI$22)>0,$E25*$F25,0)","v":0},null,{"$f":"IF(SUM(AK$15:AK$22)>0,$E25*$F25,0)","v":0},null,{"$f":"IF(SUM(AM$15:AM$22)>0,$E25*$F25,0)","v":0},null,{"$f":"IF(SUM(AO$15:AO$22)>0,$E25*$F25,0)","v":0},null,{"$f":"IF(SUM(AQ$15:AQ$22)>0,$E25*$F25,0)","v":0},null,{"$f":"IF(SUM(AS$15:AS$22)>0,$E25*$F25,0)","v":0},null,{"$f":"IF(SUM(AU$15:AU$22)>0,$E25*$F25,0)","v":0},null,{"$f":"IF(SUM(AW$15:AW$22)>0,$E25*$F25,0)","v":0},null,{"$f":"IF(SUM(AY$15:AY$22)>0,$E25*$F25,0)","v":0},null,{"$f":"IF(SUM(BA$15:BA$22)>0,$E25*$F25,0)","v":0},null,{"$f":"IF(SUM(BC$15:BC$22)>0,$E25*$F25,0)","v":0},null,{"$f":"IF(SUM(BE$15:BE$22)>0,$E25*$F25,0)","v":0},null,{"$f":"IF(SUM(BG$15:BG$22)>0,$E25*$F25,0)","v":0},null,{"$f":"IF(SUM(BI$15:BI$22)>0,$E25*$F25,0)","v":0},null,{"$f":"IF(SUM(BK$15:BK$22)>0,$E25*$F25,0)","v":0},null,{"$f":"IF(SUM(BM$15:BM$22)>0,$E25*$F25,0)","v":0},null,{"$f":"IF(SUM(BO$15:BO$22)>0,$E25*$F25,0)","v":0},null,{"$f":"IF(SUM(BQ$15:BQ$22)>0,$E25*$F25,0)","v":0},null,{"$f":"IF(SUM(BS$15:BS$22)>0,$E25*$F25,0)","v":0},null,{"$f":"IF(SUM(BU$15:BU$22)>0,$E25*$F25,0)","v":0},null,{"$f":"IF(SUM(BW$15:BW$22)>0,$E25*$F25,0)","v":0},null,{"$f":"IF(SUM(BY$15:BY$22)>0,$E25*$F25,0)","v":0},null,{"$f":"IF(SUM(CA$15:CA$22)>0,$E25*$F25,0)","v":0},null,{"$f":"IF(SUM(CC$15:CC$22)>0,$E25*$F25,0)","v":0},null,{"$f":"IF(SUM(CE$15:CE$22)>0,$E25*$F25,0)","v":0},null,{"$f":"IF(SUM(CG$15:CG$22)>0,$E25*$F25,0)","v":0},null,{"$f":"IF(SUM(CI$15:CI$22)>0,$E25*$F25,0)","v":0},null,{"$f":"IF(SUM(CK$15:CK$22)>0,$E25*$F25,0)","v":0},null,{"$f":"IF(SUM(CM$15:CM$22)>0,$E25*$F25,0)","v":0},null,{"$f":"IF(SUM(CO$15:CO$22)>0,$E25*$F25,0)","v":0},null,{"$f":"IF(SUM(CQ$15:CQ$22)>0,$E25*$F25,0)","v":0},null,{"$f":"IF(SUM(CS$15:CS$22)>0,$E25*$F25,0)","v":0},null,{"$f":"IF(SUM(CU$15:CU$22)>0,$E25*$F25,0)","v":0},null,{"$f":"IF(SUM(CW$15:CW$22)>0,$E25*$F25,0)","v":0},null,{"$f":"IF(SUM(CY$15:CY$22)>0,$E25*$F25,0)","v":0},null,{"$f":"IF(SUM(DA$15:DA$22)>0,$E25*$F25,0)","v":0},null,{"$f":"IF(SUM(DC$15:DC$22)>0,$E25*$F25,0)","v":0},null,{"$f":"IF(SUM(DE$15:DE$22)>0,$E25*$F25,0)","v":0},null,{"$f":"IF(SUM(DG$15:DG$22)>0,$E25*$F25,0)","v":0},null,{"$f":"IF(SUM(DI$15:DI$22)>0,$E25*$F25,0)","v":0},null,{"$f":"IF(SUM(DK$15:DK$22)>0,$E25*$F25,0)","v":0},null,{"$f":"IF(SUM(DM$15:DM$22)>0,$E25*$F25,0)","v":0},null,{"$f":"IF(SUM(DO$15:DO$22)>0,$E25*$F25,0)","v":0},null,{"$f":"IF(SUM(DQ$15:DQ$22)>0,$E25*$F25,0)","v":0},null,{"$f":"IF(SUM(DS$15:DS$22)>0,$E25*$F25,0)","v":0},null,{"$f":"IF(SUM(DU$15:DU$22)>0,$E25*$F25,0)","v":0},null,{"$f":"IF(SUM(DW$15:DW$22)>0,$E25*$F25,0)","v":0}]
[null,null,null,null,null,null,null,null,null,{"$f":"IF(SUM(I$15:I$22)>0,$E26*$F26,0)","v":0},null,{"$f":"IF(SUM(K$15:K$22)>0,$E26*$F26,0)","v":0},null,{"$f":"IF(SUM(M$15:M$22)>0,$E26*$F26,0)","v":0},null,{"$f":"IF(SUM(O$15:O$22)>0,$E26*$F26,0)","v":0},null,{"$f":"IF(SUM(Q$15:Q$22)>0,$E26*$F26,0)","v":0},null,{"$f":"IF(SUM(S$15:S$22)>0,$E26*$F26,0)","v":0},null,{"$f":"IF(SUM(U$15:U$22)>0,$E26*$F26,0)","v":0},null,{"$f":"IF(SUM(W$15:W$22)>0,$E26*$F26,0)","v":0},null,{"$f":"IF(SUM(Y$15:Y$22)>0,$E26*$F26,0)","v":0},null,{"$f":"IF(SUM(AA$15:AA$22)>0,$E26*$F26,0)","v":0},null,{"$f":"IF(SUM(AC$15:AC$22)>0,$E26*$F26,0)","v":0},null,{"$f":"IF(SUM(AE$15:AE$22)>0,$E26*$F26,0)","v":0},null,{"$f":"IF(SUM(AG$15:AG$22)>0,$E26*$F26,0)","v":0},null,{"$f":"IF(SUM(AI$15:AI$22)>0,$E26*$F26,0)","v":0},null,{"$f":"IF(SUM(AK$15:AK$22)>0,$E26*$F26,0)","v":0},null,{"$f":"IF(SUM(AM$15:AM$22)>0,$E26*$F26,0)","v":0},null,{"$f":"IF(SUM(AO$15:AO$22)>0,$E26*$F26,0)","v":0},null,{"$f":"IF(SUM(AQ$15:AQ$22)>0,$E26*$F26,0)","v":0},null,{"$f":"IF(SUM(AS$15:AS$22)>0,$E26*$F26,0)","v":0},null,{"$f":"IF(SUM(AU$15:AU$22)>0,$E26*$F26,0)","v":0},null,{"$f":"IF(SUM(AW$15:AW$22)>0,$E26*$F26,0)","v":0},null,{"$f":"IF(SUM(AY$15:AY$22)>0,$E26*$F26,0)","v":0},null,{"$f":"IF(SUM(BA$15:BA$22)>0,$E26*$F26,0)","v":0},null,{"$f":"IF(SUM(BC$15:BC$22)>0,$E26*$F26,0)","v":0},null,{"$f":"IF(SUM(BE$15:BE$22)>0,$E26*$F26,0)","v":0},null,{"$f":"IF(SUM(BG$15:BG$22)>0,$E26*$F26,0)","v":0},null,{"$f":"IF(SUM(BI$15:BI$22)>0,$E26*$F26,0)","v":0},null,{"$f":"IF(SUM(BK$15:BK$22)>0,$E26*$F26,0)","v":0},null,{"$f":"IF(SUM(BM$15:BM$22)>0,$E26*$F26,0)","v":0},null,{"$f":"IF(SUM(BO$15:BO$22)>0,$E26*$F26,0)","v":0},null,{"$f":"IF(SUM(BQ$15:BQ$22)>0,$E26*$F26,0)","v":0},null,{"$f":"IF(SUM(BS$15:BS$22)>0,$E26*$F26,0)","v":0},null,{"$f":"IF(SUM(BU$15:BU$22)>0,$E26*$F26,0)","v":0},null,{"$f":"IF(SUM(BW$15:BW$22)>0,$E26*$F26,0)","v":0},null,{"$f":"IF(SUM(BY$15:BY$22)>0,$E26*$F26,0)","v":0},null,{"$f":"IF(SUM(CA$15:CA$22)>0,$E26*$F26,0)","v":0},null,{"$f":"IF(SUM(CC$15:CC$22)>0,$E26*$F26,0)","v":0},null,{"$f":"IF(SUM(CE$15:CE$22)>0,$E26*$F26,0)","v":0},null,{"$f":"IF(SUM(CG$15:CG$22)>0,$E26*$F26,0)","v":0},null,{"$f":"IF(SUM(CI$15:CI$22)>0,$E26*$F26,0)","v":0},null,{"$f":"IF(SUM(CK$15:CK$22)>0,$E26*$F26,0)","v":0},null,{"$f":"IF(SUM(CM$15:CM$22)>0,$E26*$F26,0)","v":0},null,{"$f":"IF(SUM(CO$15:CO$22)>0,$E26*$F26,0)","v":0},null,{"$f":"IF(SUM(CQ$15:CQ$22)>0,$E26*$F26,0)","v":0},null,{"$f":"IF(SUM(CS$15:CS$22)>0,$E26*$F26,0)","v":0},null,{"$f":"IF(SUM(CU$15:CU$22)>0,$E26*$F26,0)","v":0},null,{"$f":"IF(SUM(CW$15:CW$22)>0,$E26*$F26,0)","v":0},null,{"$f":"IF(SUM(CY$15:CY$22)>0,$E26*$F26,0)","v":0},null,{"$f":"IF(SUM(DA$15:DA$22)>0,$E26*$F26,0)","v":0},null,{"$f":"IF(SUM(DC$15:DC$22)>0,$E26*$F26,0)","v":0},null,{"$f":"IF(SUM(DE$15:DE$22)>0,$E26*$F26,0)","v":0},null,{"$f":"IF(SUM(DG$15:DG$22)>0,$E26*$F26,0)","v":0},null,{"$f":"IF(SUM(DI$15:DI$22)>0,$E26*$F26,0)","v":0},null,{"$f":"IF(SUM(DK$15:DK$22)>0,$E26*$F26,0)","v":0},null,{"$f":"IF(SUM(DM$15:DM$22)>0,$E26*$F26,0)","v":0},null,{"$f":"IF(SUM(DO$15:DO$22)>0,$E26*$F26,0)","v":0},null,{"$f":"IF(SUM(DQ$15:DQ$22)>0,$E26*$F26,0)","v":0},null,{"$f":"IF(SUM(DS$15:DS$22)>0,$E26*$F26,0)","v":0},null,{"$f":"IF(SUM(DU$15:DU$22)>0,$E26*$F26,0)","v":0},null,{"$f":"IF(SUM(DW$15:DW$22)>0,$E26*$F26,0)","v":0}]
[null,null,null,null,null,null,null,null,null,{"$f":"IF(SUM(I$15:I$22)>0,$E27*$F27,0)","v":0},null,{"$f":"IF(SUM(K$15:K$22)>0,$E27*$F27,0)","v":0},null,{"$f":"IF(SUM(M$15:M$22)>0,$E27*$F27,0)","v":0},null,{"$f":"IF(SUM(O$15:O$22)>0,$E27*$F27,0)","v":0},null,{"$f":"IF(SUM(Q$15:Q$22)>0,$E27*$F27,0)","v":0},null,{"$f":"IF(SUM(S$15:S$22)>0,$E27*$F27,0)","v":0},null,{"$f":"IF(SUM(U$15:U$22)>0,$E27*$F27,0)","v":0},null,{"$f":"IF(SUM(W$15:W$22)>0,$E27*$F27,0)","v":0},null,{"$f":"IF(SUM(Y$15:Y$22)>0,$E27*$F27,0)","v":0},null,{"$f":"IF(SUM(AA$15:AA$22)>0,$E27*$F27,0)","v":0},null,{"$f":"IF(SUM(AC$15:AC$22)>0,$E27*$F27,0)","v":0},null,{"$f":"IF(SUM(AE$15:AE$22)>0,$E27*$F27,0)","v":0},null,{"$f":"IF(SUM(AG$15:AG$22)>0,$E27*$F27,0)","v":0},null,{"$f":"IF(SUM(AI$15:AI$22)>0,$E27*$F27,0)","v":0},null,{"$f":"IF(SUM(AK$15:AK$22)>0,$E27*$F27,0)","v":0},null,{"$f":"IF(SUM(AM$15:AM$22)>0,$E27*$F27,0)","v":0},null,{"$f":"IF(SUM(AO$15:AO$22)>0,$E27*$F27,0)","v":0},null,{"$f":"IF(SUM(AQ$15:AQ$22)>0,$E27*$F27,0)","v":0},null,{"$f":"IF(SUM(AS$15:AS$22)>0,$E27*$F27,0)","v":0},null,{"$f":"IF(SUM(AU$15:AU$22)>0,$E27*$F27,0)","v":0},null,{"$f":"IF(SUM(AW$15:AW$22)>0,$E27*$F27,0)","v":0},null,{"$f":"IF(SUM(AY$15:AY$22)>0,$E27*$F27,0)","v":0},null,{"$f":"IF(SUM(BA$15:BA$22)>0,$E27*$F27,0)","v":0},null,{"$f":"IF(SUM(BC$15:BC$22)>0,$E27*$F27,0)","v":0},null,{"$f":"IF(SUM(BE$15:BE$22)>0,$E27*$F27,0)","v":0},null,{"$f":"IF(SUM(BG$15:BG$22)>0,$E27*$F27,0)","v":0},null,{"$f":"IF(SUM(BI$15:BI$22)>0,$E27*$F27,0)","v":0},null,{"$f":"IF(SUM(BK$15:BK$22)>0,$E27*$F27,0)","v":0},null,{"$f":"IF(SUM(BM$15:BM$22)>0,$E27*$F27,0)","v":0},null,{"$f":"IF(SUM(BO$15:BO$22)>0,$E27*$F27,0)","v":0},null,{"$f":"IF(SUM(BQ$15:BQ$22)>0,$E27*$F27,0)","v":0},null,{"$f":"IF(SUM(BS$15:BS$22)>0,$E27*$F27,0)","v":0},null,{"$f":"IF(SUM(BU$15:BU$22)>0,$E27*$F27,0)","v":0},null,{"$f":"IF(SUM(BW$15:BW$22)>0,$E27*$F27,0)","v":0},null,{"$f":"IF(SUM(BY$15:BY$22)>0,$E27*$F27,0)","v":0},null,{"$f":"IF(SUM(CA$15:CA$22)>0,$E27*$F27,0)","v":0},null,{"$f":"IF(SUM(CC$15:CC$22)>0,$E27*$F27,0)","v":0},null,{"$f":"IF(SUM(CE$15:CE$22)>0,$E27*$F27,0)","v":0},null,{"$f":"IF(SUM(CG$15:CG$22)>0,$E27*$F27,0)","v":0},null,{"$f":"IF(SUM(CI$15:CI$22)>0,$E27*$F27,0)","v":0},null,{"$f":"IF(SUM(CK$15:CK$22)>0,$E27*$F27,0)","v":0},null,{"$f":"IF(SUM(CM$15:CM$22)>0,$E27*$F27,0)","v":0},null,{"$f":"IF(SUM(CO$15:CO$22)>0,$E27*$F27,0)","v":0},null,{"$f":"IF(SUM(CQ$15:CQ$22)>0,$E27*$F27,0)","v":0},null,{"$f":"IF(SUM(CS$15:CS$22)>0,$E27*$F27,0)","v":0},null,{"$f":"IF(SUM(CU$15:CU$22)>0,$E27*$F27,0)","v":0},null,{"$f":"IF(SUM(CW$15:CW$22)>0,$E27*$F27,0)","v":0},null,{"$f":"IF(SUM(CY$15:CY$22)>0,$E27*$F27,0)","v":0},null,{"$f":"IF(SUM(DA$15:DA$22)>0,$E27*$F27,0)","v":0},null,{"$f":"IF(SUM(DC$15:DC$22)>0,$E27*$F27,0)","v":0},null,{"$f":"IF(SUM(DE$15:DE$22)>0,$E27*$F27,0)","v":0},null,{"$f":"IF(SUM(DG$15:DG$22)>0,$E27*$F27,0)","v":0},null,{"$f":"IF(SUM(DI$15:DI$22)>0,$E27*$F27,0)","v":0},null,{"$f":"IF(SUM(DK$15:DK$22)>0,$E27*$F27,0)","v":0},null,{"$f":"IF(SUM(DM$15:DM$22)>0,$E27*$F27,0)","v":0},null,{"$f":"IF(SUM(DO$15:DO$22)>0,$E27*$F27,0)","v":0},null,{"$f":"IF(SUM(DQ$15:DQ$22)>0,$E27*$F27,0)","v":0},null,{"$f":"IF(SUM(DS$15:DS$22)>0,$E27*$F27,0)","v":0},null,{"$f":"IF(SUM(DU$15:DU$22)>0,$E27*$F27,0)","v":0},null,{"$f":"IF(SUM(DW$15:DW$22)>0,$E27*$F27,0)","v":0}]
[null,null,null,null,null,null,null,null,null,{"$f":"IF(SUM(I$15:I$22)>0,$E28*$F28,0)","v":0},null,{"$f":"IF(SUM(K$15:K$22)>0,$E28*$F28,0)","v":0},null,{"$f":"IF(SUM(M$15:M$22)>0,$E28*$F28,0)","v":0},null,{"$f":"IF(SUM(O$15:O$22)>0,$E28*$F28,0)","v":0},null,{"$f":"IF(SUM(Q$15:Q$22)>0,$E28*$F28,0)","v":0},null,{"$f":"IF(SUM(S$15:S$22)>0,$E28*$F28,0)","v":0},null,{"$f":"IF(SUM(U$15:U$22)>0,$E28*$F28,0)","v":0},null,{"$f":"IF(SUM(W$15:W$22)>0,$E28*$F28,0)","v":0},null,{"$f":"IF(SUM(Y$15:Y$22)>0,$E28*$F28,0)","v":0},null,{"$f":"IF(SUM(AA$15:AA$22)>0,$E28*$F28,0)","v":0},null,{"$f":"IF(SUM(AC$15:AC$22)>0,$E28*$F28,0)","v":0},null,{"$f":"IF(SUM(AE$15:AE$22)>0,$E28*$F28,0)","v":0},null,{"$f":"IF(SUM(AG$15:AG$22)>0,$E28*$F28,0)","v":0},null,{"$f":"IF(SUM(AI$15:AI$22)>0,$E28*$F28,0)","v":0},null,{"$f":"IF(SUM(AK$15:AK$22)>0,$E28*$F28,0)","v":0},null,{"$f":"IF(SUM(AM$15:AM$22)>0,$E28*$F28,0)","v":0},null,{"$f":"IF(SUM(AO$15:AO$22)>0,$E28*$F28,0)","v":0},null,{"$f":"IF(SUM(AQ$15:AQ$22)>0,$E28*$F28,0)","v":0},null,{"$f":"IF(SUM(AS$15:AS$22)>0,$E28*$F28,0)","v":0},null,{"$f":"IF(SUM(AU$15:AU$22)>0,$E28*$F28,0)","v":0},null,{"$f":"IF(SUM(AW$15:AW$22)>0,$E28*$F28,0)","v":0},null,{"$f":"IF(SUM(AY$15:AY$22)>0,$E28*$F28,0)","v":0},null,{"$f":"IF(SUM(BA$15:BA$22)>0,$E28*$F28,0)","v":0},null,{"$f":"IF(SUM(BC$15:BC$22)>0,$E28*$F28,0)","v":0},null,{"$f":"IF(SUM(BE$15:BE$22)>0,$E28*$F28,0)","v":0},null,{"$f":"IF(SUM(BG$15:BG$22)>0,$E28*$F28,0)","v":0},null,{"$f":"IF(SUM(BI$15:BI$22)>0,$E28*$F28,0)","v":0},null,{"$f":"IF(SUM(BK$15:BK$22)>0,$E28*$F28,0)","v":0},null,{"$f":"IF(SUM(BM$15:BM$22)>0,$E28*$F28,0)","v":0},null,{"$f":"IF(SUM(BO$15:BO$22)>0,$E28*$F28,0)","v":0},null,{"$f":"IF(SUM(BQ$15:BQ$22)>0,$E28*$F28,0)","v":0},null,{"$f":"IF(SUM(BS$15:BS$22)>0,$E28*$F28,0)","v":0},null,{"$f":"IF(SUM(BU$15:BU$22)>0,$E28*$F28,0)","v":0},null,{"$f":"IF(SUM(BW$15:BW$22)>0,$E28*$F28,0)","v":0},null,{"$f":"IF(SUM(BY$15:BY$22)>0,$E28*$F28,0)","v":0},null,{"$f":"IF(SUM(CA$15:CA$22)>0,$E28*$F28,0)","v":0},null,{"$f":"IF(SUM(CC$15:CC$22)>0,$E28*$F28,0)","v":0},null,{"$f":"IF(SUM(CE$15:CE$22)>0,$E28*$F28,0)","v":0},null,{"$f":"IF(SUM(CG$15:CG$22)>0,$E28*$F28,0)","v":0},null,{"$f":"IF(SUM(CI$15:CI$22)>0,$E28*$F28,0)","v":0},null,{"$f":"IF(SUM(CK$15:CK$22)>0,$E28*$F28,0)","v":0},null,{"$f":"IF(SUM(CM$15:CM$22)>0,$E28*$F28,0)","v":0},null,{"$f":"IF(SUM(CO$15:CO$22)>0,$E28*$F28,0)","v":0},null,{"$f":"IF(SUM(CQ$15:CQ$22)>0,$E28*$F28,0)","v":0},null,{"$f":"IF(SUM(CS$15:CS$22)>0,$E28*$F28,0)","v":0},null,{"$f":"IF(SUM(CU$15:CU$22)>0,$E28*$F28,0)","v":0},null,{"$f":"IF(SUM(CW$15:CW$22)>0,$E28*$F28,0)","v":0},null,{"$f":"IF(SUM(CY$15:CY$22)>0,$E28*$F28,0)","v":0},null,{"$f":"IF(SUM(DA$15:DA$22)>0,$E28*$F28,0)","v":0},null,{"$f":"IF(SUM(DC$15:DC$22)>0,$E28*$F28,0)","v":0},null,{"$f":"IF(SUM(DE$15:DE$22)>0,$E28*$F28,0)","v":0},null,{"$f":"IF(SUM(DG$15:DG$22)>0,$E28*$F28,0)","v":0},null,{"$f":"IF(SUM(DI$15:DI$22)>0,$E28*$F28,0)","v":0},null,{"$f":"IF(SUM(DK$15:DK$22)>0,$E28*$F28,0)","v":0},null,{"$f":"IF(SUM(DM$15:DM$22)>0,$E28*$F28,0)","v":0},null,{"$f":"IF(SUM(DO$15:DO$22)>0,$E28*$F28,0)","v":0},null,{"$f":"IF(SUM(DQ$15:DQ$22)>0,$E28*$F28,0)","v":0},null,{"$f":"IF(SUM(DS$15:DS$22)>0,$E28*$F28,0)","v":0},null,{"$f":"IF(SUM(DU$15:DU$22)>0,$E28*$F28,0)","v":0},null,{"$f":"IF(SUM(DW$15:DW$22)>0,$E28*$F28,0)","v":0}]

{"sheet":"Mat Perm","index":23,"n_rows":113,"n_cols":136,"rows_kept":113,"cut":false,"hidden":true,"merged":[[9,1,9,3],[10,1,10,14]]}
[null,null,"CÂMARA DOS DEPUTADOS"]
[null,null,"DEPARTAMENTO TÉCNICO"]
[null,null,"Coordenação de Planejamento e Gestão"]
[]
[null,null,"Data:",{"$f":"'Dados Gerais'!#REF!","v":{"$error":"#REF!"}}]
[null,null,"Processo:",{"$f":"'Dados Gerais'!#REF!","v":{"$error":"#REF!"}}]
[null,null,"Objeto:",{"$f":"'Dados Gerais'!#REF!","v":{"$error":"#REF!"}}]
[]
[]
[]
[null,"MATERIAIS PERMANENTES RELACIONADOS AO POSTO - PAGAMENTO DA DEPRECIAÇÃO / MANUTENÇÃO",null,null,null,null,null,null,null,null,null,null,null,null,null,null,1,null,{"$f":"Q11+1","v":2},null,{"$f":"S11+1","v":3},null,{"$f":"U11+1","v":4},null,{"$f":"W11+1","v":5},null,{"$f":"Y11+1","v":6},null,{"$f":"AA11+1","v":7},null,{"$f":"AC11+1","v":8},null,{"$f":"AE11+1","v":9},null,{"$f":"AG11+1","v":10},null,{"$f":"AI11+1","v":11},null,{"$f":"AK11+1","v":12},null,{"$f":"AM11+1","v":13},null,{"$f":"AO11+1","v":14},null,{"$f":"AQ11+1","v":15},null,{"$f":"AS11+1","v":16},null,{"$f":"AU11+1","v":17},null,{"$f":"AW11+1","v":18},null,{"$f":"AY11+1","v":19},null,{"$f":"BA11+1","v":20},null,{"$f":"BC11+1","v":21},null,{"$f":"BE11+1","v":22},null,{"$f":"BG11+1","v":23},null,{"$f":"BI11+1","v":24},null,{"$f":"BK11+1","v":25},null,{"$f":"BM11+1","v":26},null,{"$f":"BO11+1","v":27},null,{"$f":"BQ11+1","v":28},null,{"$f":"BS11+1","v":29},null,{"$f":"BU11+1","v":30},null,{"$f":"BW11+1","v":31},null,{"$f":"BY11+1","v":32},null,{"$f":"CA11+1","v":33},null,{"$f":"CC11+1","v":34},null,{"$f":"CE11+1","v":35},null,{"$f":"CG11+1","v":36},null,{"$f":"CI11+1","v":37},null,{"$f":"CK11+1","v":38},null,{"$f":"CM11+1","v":39},null,{"$f":"CO11+1","v":40},null,{"$f":"CQ11+1","v":41},null,{"$f":"CS11+1","v":42},null,{"$f":"CU11+1","v":43},null,{"$f":"CW11+1","v":44},null,{"$f":"CY11+1","v":45},null,{"$f":"DA11+1","v":46},null,{"$f":"DC11+1","v":47},null,{"$f":"DE11+1","v":48},null,{"$f":"DG11+1","v":49},null,{"$f":"DI11+1","v":50},null,{"$f":"DK11+1","v":51},null,{"$f":"DM11+1","v":52},null,{"$f":"DO11+1","v":53},null,{"$f":"DQ11+1","v":54},null,{"$f":"DS11+1","v":55},null,{"$f":"DU11+1","v":56},null,{"$f":"DW11+1","v":57},null,{"$f":"DY11+1","v":58},null,{"$f":"EA11+1","v":59},null,{"$f":"EC11+1","v":60}]
[]
[null,null,null,null,null,null,null,null,null,null,null,null,null,null,null,null,{"$f":"SUM(R12:R94)","v":0},null,{"$f":"SUM(T12:T94)","v":0},null,{"$f":"SUM(V12:V94)","v":0},null,{"$f":"SUM(X12:X94)","v":0},null,{"$f":"SUM(Z12:Z94)","v":0},null,{"$f":"SUM(AB12:AB94)","v":0},null,{"$f":"SUM(AD12:AD94)","v":0},null,{"$f":"SUM(AF12:AF94)","v":0},null,{"$f":"SUM(AH12:AH94)","v":0},null,{"$f":"SUM(AJ12:AJ94)","v":0},null,{"$f":"SUM(AL12:AL94)","v":0},null,{"$f":"SUM(AN12:AN94)","v":0},null,{"$f":"SUM(AP12:AP94)","v":0},null,{"$f":"SUM(AR12:AR94)","v":0},null,{"$f":"SUM(AT12:AT94)","v":0},null,{"$f":"SUM(AV12:AV94)","v":0},null,{"$f":"SUM(AX12:AX94)","v":0},null,{"$f":"SUM(AZ12:AZ94)","v":0},null,{"$f":"SUM(BB12:BB94)","v":0},null,{"$f":"SUM(BD12:BD94)","v":0},null,{"$f":"SUM(BF12:BF94)","v":0},null,{"$f":"SUM(BH12:BH94)","v":0},null,{"$f":"SUM(BJ12:BJ94)","v":0},null,{"$f":"SUM(BL12:BL94)","v":0},null,{"$f":"SUM(BN12:BN94)","v":0},null,{"$f":"SUM(BP12:BP94)","v":0},null,{"$f":"SUM(BR12:BR94)","v":0},null,{"$f":"SUM(BT12:BT94)","v":0},null,{"$f":"SUM(BV12:BV94)","v":0},null,{"$f":"SUM(BX12:BX94)","v":0},null,{"$f":"SUM(BZ12:BZ94)","v":0},null,{"$f":"SUM(CB12:CB94)","v":0},null,{"$f":"SUM(CD12:CD94)","v":0},null,{"$f":"SUM(CF12:CF94)","v":0},null,{"$f":"SUM(CH12:CH94)","v":0},null,{"$f":"SUM(CJ12:CJ94)","v":0},null,{"$f":"SUM(CL12:CL94)","v":0},null,{"$f":"SUM(CN12:CN94)","v":0},null,{"$f":"SUM(CP12:CP94)","v":0},null,{"$f":"SUM(CR12:CR94)","v":0},null,{"$f":"SUM(CT12:CT94)","v":0},null,{"$f":"SUM(CV12:CV94)","v":0},null,{"$f":"SUM(CX12:CX94)","v":0},null,{"$f":"SUM(CZ12:CZ94)","v":0},null,{"$f":"SUM(DB12:DB94)","v":0},null,{"$f":"SUM(DD12:DD94)","v":0},null,{"$f":"SUM(DF12:DF94)","v":0},null,{"$f":"SUM(DH12:DH94)","v":0},null,{"$f":"SUM(DJ12:DJ94)","v":0},null,{"$f":"SUM(DL12:DL94)","v":0},null,{"$f":"SUM(DN12:DN94)","v":0},null,{"$f":"SUM(DP12:DP94)","v":0},null,{"$f":"SUM(DR12:DR94)","v":0},null,{"$f":"SUM(DT12:DT94)","v":0},null,{"$f":"SUM(DV12:DV94)","v":0},null,{"$f":"SUM(DX12:DX94)","v":0},null,{"$f":"SUM(DZ12:DZ94)","v":0},null,{"$f":"SUM(EB12:EB94)","v":0},null,{"$f":"SUM(ED12:ED94)","v":0},null,{"$f":"SUM(EF12:EF94)","v":0}]
[null,null,"CATEGORIAS",null,"QUANTIDADE"]
[null,null,null,null,null,null,null,null,null,null,null,null,null,null,null,null,{"$f":"IF($C15=Q$11,1,0)","v":0},null,{"$f":"IF($C15=S$11,1,0)","v":0},null,{"$f":"IF($C15=U$11,1,0)","v":0},null,{"$f":"IF($C15=W$11,1,0)","v":0},null,{"$f":"IF($C15=Y$11,1,0)","v":0},null,{"$f":"IF($C15=AA$11,1,0)","v":0},null,{"$f":"IF($C15=AC$11,1,0)","v":0},null,{"$f":"IF($C15=AE$11,1,0)","v":0},null,{"$f":"IF($C15=AG$11,1,0)","v":0},null,{"$f":"IF($C15=AI$11,1,0)","v":0},null,{"$f":"IF($C15=AK$11,1,0)","v":0},null,{"$f":"IF($C15=AM$11,1,0)","v":0},null,{"$f":"IF($C15=AO$11,1,0)","v":0},null,{"$f":"IF($C15=AQ$11,1,0)","v":0},null,{"$f":"IF($C15=AS$11,1,0)","v":0},null,{"$f":"IF($C15=AU$11,1,0)","v":0},null,{"$f":"IF($C15=AW$11,1,0)","v":0},null,{"$f":"IF($C15=AY$11,1,0)","v":0},null,{"$f":"IF($C15=BA$11,1,0)","v":0},null,{"$f":"IF($C15=BC$11,1,0)","v":0},null,{"$f":"IF($C15=BE$11,1,0)","v":0},null,{"$f":"IF($C15=BG$11,1,0)","v":0},null,{"$f":"IF($C15=BI$11,1,0)","v":0},null,{"$f":"IF($C15=BK$11,1,0)","v":0},null,{"$f":"IF($C15=BM$11,1,0)","v":0},null,{"$f":"IF($C15=BO$11,1,0)","v":0},null,{"$f":"IF($C15=BQ$11,1,0)","v":0},null,{"$f":"IF($C15=BS$11,1,0)","v":0},null,{"$f":"IF($C15=BU$11,1,0)","v":0},null,{"$f":"IF($C15=BW$11,1,0)","v":0},null,{"$f":"IF($C15=BY$11,1,0)","v":0},null,{"$f":"IF($C15=CA$11,1,0)","v":0},null,{"$f":"IF($C15=CC$11,1,0)","v":0},null,{"$f":"IF($C15=CE$11,1,0)","v":0},null,{"$f":"IF($C15=CG$11,1,0)","v":0},null,{"$f":"IF($C15=CI$11,1,0)","v":0},null,{"$f":"IF($C15=CK$11,1,0)","v":0},null,{"$f":"IF($C15=CM$11,1,0)","v":0},null,{"$f":"IF($C15=CO$11,1,0)","v":0},null,{"$f":"IF($C15=CQ$11,1,0)","v":0},null,{"$f":"IF($C15=CS$11,1,0)","v":0},null,{"$f":"IF($C15=CU$11,1,0)","v":0},null,{"$f":"IF($C15=CW$11,1,0)","v":0},null,{"$f":"IF($C15=CY$11,1,0)","v":0},null,{"$f":"IF($C15=DA$11,1,0)","v":0},null,{"$f":"IF($C15=DC$11,1,0)","v":0},null,{"$f":"IF($C15=DE$11,1,0)","v":0},null,{"$f":"IF($C15=DG$11,1,0)","v":0},null,{"$f":"IF($C15=DI$11,1,0)","v":0},null,{"$f":"IF($C15=DK$11,1,0)","v":0},null,{"$f":"IF($C15=DM$11,1,0)","v":0},null,{"$f":"IF($C15=DO$11,1,0)","v":0},null,{"$f":"IF($C15=DQ$11,1,0)","v":0},null,{"$f":"IF($C15=DS$11,1,0)","v":0},null,{"$f":"IF($C15=DU$11,1,0)","v":0},null,{"$f":"IF($C15=DW$11,1,0)","v":0},null,{"$f":"IF($C15=DY$11,1,0)","v":0},null,{"$f":"IF($C15=EA$11,1,0)","v":0},null,{"$f":"IF($C15=EC$11,1,0)","v":0},null,{"$f":"IF($C15=EE$11,1,0)","v":0}]
[null,null,null,{"$f":"HLOOKUP($C16,'Dados Gerais'!$D$5:$BK$10,6)","v":{"$error":"#N/A"}},{"$f":"HLOOKUP($C16,'Dados Gerais'!$D$5:$BK$14,10)","v":{"$error":"#N/A"}},null,null,null,null,null,null,null,null,null,null,null,0,null,0,null,0,null,0,null,0,null,0,null,0,null,0,null,0,null,0,null,0,null,0,null,0,null,0,null,0,null,0,null,0,null,0,null,0,null,0,null,0,null,0,null,0,null,0,null,0,null,0,null,0,null,0,null,0,null,0,null,0,null,0,null,0,null,0,null,0,null,0,null,0,null,0,null,0,null,0,null,0,null,0,null,0,null,0,null,0,null,0,null,0,null,0,null,0,null,0,null,0,null,0,null,0,null,0,null,0,null,0,null,0,null,0,null,0,null,0]
[null,null,null,{"$f":"HLOOKUP($C17,'Dados Gerais'!$D$5:$BK$10,6)","v":{"$error":"#N/A"}},{"$f":"HLOOKUP($C17,'Dados Gerais'!$D$5:$BK$14,10)","v":{"$error":"#N/A"}},null,null,null,null,null,null,null,null,null,null,null,0,null,0,null,0,null,0,null,0,null,0,null,0,null,0,null,0,null,0,null,0,null,0,null,0,null,0,null,0,null,0,null,0,null,0,null,0,null,0,null,0,null,0,null,0,null,0,null,0,null,0,null,0,null,0,null,0,null,0,null,0,null,0,null,0,null,0,null,0,null,0,null,0,null,0,null,0,null,0,null,0,null,0,null,0,null,0,null,0,null,0,null,0,null,0,null,0,null,0,null,0,null,0,null,0,null,0,null,0,null,0,null,0,null,0,null,0,null,0]
[null,null,null,{"$f":"HLOOKUP($C18,'Dados Gerais'!$D$5:$BK$10,6)","v":{"$error":"#N/A"}},{"$f":"HLOOKUP($C18,'Dados Gerais'!$D$5:$BK$14,10)","v":{"$error":"#N/A"}},null,null,null,null,null,null,null,null,null,null,null,0,null,0,null,0,null,0,null,0,null,0,null,0,null,0,null,0,null,0,null,0,null,0,null,0,null,0,null,0,null,0,null,0,null,0,null,0,null,0,null,0,null,0,null,0,null,0,null,0,null,0,null,0,null,0,null,0,null,0,null,0,null,0,null,0,null,0,null,0,null,0,null,0,null,0,null,0,null,0,null,0,null,0,null,0,null,0,null,0,null,0,null,0,null,0,null,0,null,0,null,0,null,0,null,0,null,0,null,0,null,0,null,0,null,0,null,0,null,0]
[null,null,null,{"$f":"HLOOKUP($C19,'Dados Gerais'!$D$5:$BK$10,6)","v":{"$error":"#N/A"}},{"$f":"HLOOKUP($C19,'Dados Gerais'!$D$5:$BK$14,10)","v":{"$error":"#N/A"}},null,null,null,null,null,null,null,null,null,null,null,0,null,0,null,0,null,0,null,0,null,0,null,0,null,0,null,0,null,0,null,0,null,0,null,0,null,0,null,0,null,0,null,0,null,0,null,0,null,0,null,0,null,0,null,0,null,0,null,0,null,0,null,0,null,0,null,0,null,0,null,0,null,0,null,0,null,0,null,0,null,0,null,0,null,0,null,0,null,0,null,0,null,0,null,0,null,0,null,0,null,0,null,0,null,0,null,0,null,0,null,0,null,0,null,0,null,0,null,0,null,0,null,0,null,0,null,0,null,0]
[null,null,null,{"$f":"HLOOKUP($C20,'Dados Gerais'!$D$5:$BK$10,6)","v":{"$error":"#N/A"}},{"$f":"HLOOKUP($C20,'Dados Gerais'!$D$5:$BK$14,10)","v":{"$error":"#N/A"}},null,null,null,null,null,null,null,null,null,null,null,0,null,0,null,0,null,0,null,0,null,0,null,0,null,0,null,0,null,0,null,0,null,0,null,0,null,0,null,0,null,0,null,0,null,0,null,0,null,0,null,0,null,0,null,0,null,0,null,0,null,0,null,0,null,0,null,0,null,0,null,0,null,0,null,0,null,0,null,0,null,0,null,0,null,0,null,0,null,0,null,0,null,0,null,0,null,0,null,0,null,0,null,0,null,0,null,0,null,0,null,0,null,0,null,0,null,0,null,0,null,0,null,0,null,0,null,0,null,0]
[null,null,null,{"$f":"HLOOKUP($C21,'Dados Gerais'!$D$5:$BK$10,6)","v":{"$error":"#N/A"}},{"$f":"HLOOKUP($C21,'Dados Gerais'!$D$5:$BK$14,10)","v":{"$error":"#N/A"}},null,null,null,null,null,null,null,null,null,null,null,0,null,0,null,0,null,0,null,0,null,0,null,0,null,0,null,0,null,0,null,0,null,0,null,0,null,0,null,0,null,0,null,0,null,0,null,0,null,0,null,0,null,0,null,0,null,0,null,0,null,0,null,0,null,0,null,0,null,0,null,0,null,0,null,0,null,0,null,0,null,0,null,0,null,0,null,0,null,0,null,0,null,0,null,0,null,0,null,0,null,0,null,0,null,0,null,0,null,0,null,0,null,0,null,0,null,0,null,0,null,0,null,0,null,0,null,0,null,0]
[null,null,null,null,null,null,null,null,null,null,null,null,null,null,null,null,0,null,0,null,0,null,0,null,0,null,0,null,0,null,0,null,0,null,0,null,0,null,0,null,0,null,0,null,0,null,0,null,0,null,0,null,0,null,0,null,0,null,0,null,0,null,0,null,0,null,0,null,0,null,0,null,0,null,0,null,0,null,0,null,0,null,0,null,0,null,0,null,0,null,0,null,0,null,0,null,0,null,0,null,0,null,0,null,0,null,0,null,0,null,0,null,0,null,0,null,0,null,0,null,0,null,0,null,0,null,0,null,0,null,0,null,0,null,0]
[]
[null,null,"PAGAMENTO DA DEPRECIAÇÃO"]
[null,null,"ITEM","DESCRIÇÃO","QUANT ANUAL","CONTA SIAFI","VALOR DE AQ.","% RESIDUAL","VIDA ÚTIL","DEP. MENSAL","CUSTO TOTAL","BDI (%)","PREÇO TOTAL","FONTE","REFERÊNCIA"]
[]
[null,null,null,null,null,"12311.01.09",89.34,0.1,10,{"$f":"G27*(1-H27)/(I27*12)","v":0.67005000000000003},{"$f":"J27*E27","v":0},{"$f":"BDI!$E$26","v":0.26939999999999997},{"$f":"ROUND(K27*(1+L27),2)","v":0},"COTAÇÃO"]
[null,null,null,null,null,"12311.01.09",39,0.1,10,{"$f":"G28*(1-H28)/(I28*12)","v":0.29250000000000004},{"$f":"J28*E28","v":0},{"$f":"BDI!$E$26","v":0.26939999999999997},{"$f":"ROUND(K28*(1+L28),2)","v":0},"COTAÇÃO"]
[null,null,null,null,null,"12311.01.09",22.08,0.1,10,0.1656,0,{"$f":"BDI!$E$26","v":0.26939999999999997},0,"COTAÇÃO"]
[null,null,null,null,null,"12311.01.09",8.02,0.1,10,6.0150000000000002E-2,0,{"$f":"BDI!$E$26","v":0.26939999999999997},0,"COTAÇÃO"]
[null,null,null,null,null,"12311.01.09",15.64,0.1,10,0.1173,0,{"$f":"BDI!$E$26","v":0.26939999999999997},0,"COTAÇÃO"]
[null,null,null,null,null,"12311.01.09",7.63,0.1,10,5.7224999999999998E-2,0,{"$f":"BDI!$E$26","v":0.26939999999999997},0,"COTAÇÃO"]
[null,null,null,null,null,"12311.01.09",21.48,0.1,10,0.16109999999999999,0,{"$f":"BDI!$E$26","v":0.26939999999999997},0,"COTAÇÃO"]
[null,null,null,null,null,"12311.01.09",7.87,0.1,10,5.9025000000000001E-2,0,{"$f":"BDI!$E$26","v":0.26939999999999997},0,"COTAÇÃO"]
[null,null,null,null,null,"12311.01.09",6.73,0.1,10,5.0475000000000006E-2,0,{"$f":"BDI!$E$26","v":0.26939999999999997},0,"COTAÇÃO"]
[null,null,null,null,null,"12311.01.09",15.35,0.1,10,0.11512499999999999,0,{"$f":"BDI!$E$26","v":0.26939999999999997},0,"COTAÇÃO"]
[null,null,null,null,null,"12311.01.09",12.86,0.1,10,9.6449999999999994E-2,0,{"$f":"BDI!$E$26","v":0.26939999999999997},0,"COTAÇÃO"]
[null,null,null,null,null,"12311.01.09",10.119999999999999,0.1,10,7.5899999999999995E-2,0,{"$f":"BDI!$E$26","v":0.26939999999999997},0,"COTAÇÃO"]
[null,null,null,null,null,"12311.01.09",61.31,0.1,10,0.45982500000000004,0,{"$f":"BDI!$E$26","v":0.26939999999999997},0,"COTAÇÃO"]
[null,null,null,null,null,"12311.01.09",40.409999999999997,0.1,10,0.30307499999999998,0,{"$f":"BDI!$E$26","v":0.26939999999999997},0,"COTAÇÃO"]
[null,null,null,null,null,"12311.01.09",120.53,0.1,10,0.90397500000000008,0,{"$f":"BDI!$E$26","v":0.26939999999999997},0,"COTAÇÃO"]
[null,null,null,null,null,"12311.01.09",31.48,0.1,10,0.2361,0,{"$f":"BDI!$E$26","v":0.26939999999999997},0,"COTAÇÃO"]
[null,null,null,null,null,"12311.01.09",191.93,0.1,10,1.4394750000000003,0,{"$f":"BDI!$E$26","v":0.26939999999999997},0,"COTAÇÃO"]
[null,null,null,null,null,"12311.01.09",92.78,0.1,10,0.69585000000000008,0,{"$f":"BDI!$E$26","v":0.26939999999999997},0,"COTAÇÃO"]
[null,null,null,null,null,"12311.01.09",36.01,0.1,10,0.27007500000000001,0,{"$f":"BDI!$E$26","v":0.26939999999999997},0,"COTAÇÃO"]
[null,null,null,null,null,"12311.01.09",16.579999999999998,0.1,10,0.12434999999999999,0,{"$f":"BDI!$E$26","v":0.26939999999999997},0,"COTAÇÃO"]
[null,null,null,null,null,"12311.01.09",57.93,0.1,10,0.434475,0,{"$f":"BDI!$E$26","v":0.26939999999999997},0,"COTAÇÃO"]
[null,null,null,null,null,"12311.01.09",47.81,0.1,10,0.35857500000000003,0,{"$f":"BDI!$E$26","v":0.26939999999999997},0,"COTAÇÃO"]
[null,null,null,null,null,"12311.01.09",31.18,0.1,10,0.23385,0,{"$f":"BDI!$E$26","v":0.26939999999999997},0,"COTAÇÃO"]
[null,null,null,null,null,"12311.01.09",23.95,0.1,10,0.17962500000000001,0,{"$f":"BDI!$E$26","v":0.26939999999999997},0,"COTAÇÃO"]
[null,null,null,null,null,"12311.01.09",35.04,0.1,10,0.26280000000000003,0,{"$f":"BDI!$E$26","v":0.26939999999999997},0,"COTAÇÃO"]
[null,null,null,null,null,"12311.01.09",200.31,0.1,10,1.5023249999999999,0,{"$f":"BDI!$E$26","v":0.26939999999999997},0,"COTAÇÃO"]
[null,null,null,null,null,"12311.01.09",79.59,0.1,10,0.59692500000000004,0,{"$f":"BDI!$E$26","v":0.26939999999999997},0,"COTAÇÃO"]
[null,null,null,null,null,"12311.01.09",227.75,0.1,10,1.7081249999999999,0,{"$f":"BDI!$E$26","v":0.26939999999999997},0,"COTAÇÃO"]
[null,null,null,null,null,"12311.01.09",127.59,0.1,10,0.95692500000000003,0,{"$f":"BDI!$E$26","v":0.26939999999999997},0,"COTAÇÃO"]
[]
[]
[null,null,"PAGAMENTO DA MANUTENÇÃO"]
[null,null,"ITEM","DESCRIÇÃO",null,null,null,"K (calculado)","MENSAL DEPR.","% MAN X DEP","MENSAL MAN.","BDI (%)","PREÇO TOTAL"]
[]
[null,null,null,null,null,null,null,{"$f":"H68","v":0.42411600000000005},{"$f":"SUM(M27:M55)","v":0},{"$f":"H61","v":0.42411600000000005},{"$f":"I61*H61","v":0},{"$f":"L27","v":0.26939999999999997},{"$f":"ROUND(K61*(1+L61),2)","v":0}]
[]
[null,null,null,null,"K1","K2","K3","K4"]
[null,null,null,null,0.85,1,0.8,1]
[null,null,null,null,"K5","K6","K7","K8"]
[null,null,null,null,1,0.6,0.5,1.1000000000000001]
[null,null,null,null,"K9","K10","K11","RESULTADO"]
[null,null,null,"* a descrição de cada coeficiente segue abaixo",1.5,0.9,1.4,{"$f":"E64*F64*G64*H64*E66*F66*G66*H66*E68*F68*G68","v":0.42411600000000005}]
[]
[]
[null,null,"MATERIAL DE CONSUMO ASSOCIADO"]
[null,null,"ITEM","DESCRIÇÃO",null,null,null,"QUANTID/ANO","UNIDADE","VALOR DE AQ.","MENSAL MAT","BDI (%)","PREÇO TOTAL"]
[]
[null,null,null,null,null,null,null,null,null,null,{"$f":"J74*H74/12","v":0},{"$f":"L61","v":0.26939999999999997},{"$f":"ROUND(K74*(1+L74),2)","v":0}]
[]
[]
[null,null,"MATERIAL DE CONSUMO ASSOCIADO"]
[null,null,"ITEM","DESCRIÇÃO",null,null,null,null,null,null,null,null,"PREÇO TOTAL"]
[]
[null,null,1,"Componente DEPRECIAÇÃO - POR POSTO",null,null,null,null,null,null,null,null,{"$f":"I61","v":0}]
[null,null,2,"Componente MANUTENÇÃO - POR POSTO",null,null,null,null,null,null,null,null,{"$f":"M61","v":0}]
[null,null,3,"Componente MATERIAL DE CONSUMO ASSOCIADO - POR POSTO",null,null,null,null,null,null,null,null,{"$f":"M74","v":0}]
[]
[null,null,null,null,null,null,null,null,null,null,null,"SOMATÓRIO TOTAL MENSAL - POR POSTO",{"$f":"SUM(M79:M83)","v":0},null,null,null,null,{"$f":"IF(SUM(Q$15:Q$22)>0,$M84,0)","v":0},null,{"$f":"IF(SUM(S$15:S$22)>0,$M84,0)","v":0},null,{"$f":"IF(SUM(U$15:U$22)>0,$M84,0)","v":0},null,{"$f":"IF(SUM(W$15:W$22)>0,$M84,0)","v":0},null,{"$f":"IF(SUM(Y$15:Y$22)>0,$M84,0)","v":0},null,{"$f":"IF(SUM(AA$15:AA$22)>0,$M84,0)","v":0},null,{"$f":"IF(SUM(AC$15:AC$22)>0,$M84,0)","v":0},null,{"$f":"IF(SUM(AE$15:AE$22)>0,$M84,0)","v":0},null,{"$f":"IF(SUM(AG$15:AG$22)>0,$M84,0)","v":0},null,{"$f":"IF(SUM(AI$15:AI$22)>0,$M84,0)","v":0},null,{"$f":"IF(SUM(AK$15:AK$22)>0,$M84,0)","v":0},null,{"$f":"IF(SUM(AM$15:AM$22)>0,$M84,0)","v":0},null,{"$f":"IF(SUM(AO$15:AO$22)>0,$M84,0)","v":0},null,{"$f":"IF(SUM(AQ$15:AQ$22)>0,$M84,0)","v":0},null,{"$f":"IF(SUM(AS$15:AS$22)>0,$M84,0)","v":0},null,{"$f":"IF(SUM(AU$15:AU$22)>0,$M84,0)","v":0},null,{"$f":"IF(SUM(AW$15:AW$22)>0,$M84,0)","v":0},null,{"$f":"IF(SUM(AY$15:AY$22)>0,$M84,0)","v":0},null,{"$f":"IF(SUM(BA$15:BA$22)>0,$M84,0)","v":0},null,{"$f":"IF(SUM(BC$15:BC$22)>0,$M84,0)","v":0},null,{"$f":"IF(SUM(BE$15:BE$22)>0,$M84,0)","v":0},null,{"$f":"IF(SUM(BG$15:BG$22)>0,$M84,0)","v":0},null,{"$f":"IF(SUM(BI$15:BI$22)>0,$M84,0)","v":0},null,{"$f":"IF(SUM(BK$15:BK$22)>0,$M84,0)","v":0},null,{"$f":"IF(SUM(BM$15:BM$22)>0,$M84,0)","v":0},null,{"$f":"IF(SUM(BO$15:BO$22)>0,$M84,0)","v":0},null,{"$f":"IF(SUM(BQ$15:BQ$22)>0,$M84,0)","v":0},null,{"$f":"IF(SUM(BS$15:BS$22)>0,$M84,0)","v":0},null,{"$f":"IF(SUM(BU$15:BU$22)>0,$M84,0)","v":0},null,{"$f":"IF(SUM(BW$15:BW$22)>0,$M84,0)","v":0},null,{"$f":"IF(SUM(BY$15:BY$22)>0,$M84,0)","v":0},null,{"$f":"IF(SUM(CA$15:CA$22)>0,$M84,0)","v":0},null,{"$f":"IF(SUM(CC$15:CC$22)>0,$M84,0)","v":0},null,{"$f":"IF(SUM(CE$15:CE$22)>0,$M84,0)","v":0},null,{"$f":"IF(SUM(CG$15:CG$22)>0,$M84,0)","v":0},null,{"$f":"IF(SUM(CI$15:CI$22)>0,$M84,0)","v":0},null,{"$f":"IF(SUM(CK$15:CK$22)>0,$M84,0)","v":0},null,{"$f":"IF(SUM(CM$15:CM$22)>0,$M84,0)","v":0},null,{"$f":"IF(SUM(CO$15:CO$22)>0,$M84,0)","v":0},null,{"$f":"IF(SUM(CQ$15:CQ$22)>0,$M84,0)","v":0},null,{"$f":"IF(SUM(CS$15:CS$22)>0,$M84,0)","v":0},null,{"$f":"IF(SUM(CU$15:CU$22)>0,$M84,0)","v":0},null,{"$f":"IF(SUM(CW$15:CW$22)>0,$M84,0)","v":0},null,{"$f":"IF(SUM(CY$15:CY$22)>0,$M84,0)","v":0},null,{"$f":"IF(SUM(DA$15:DA$22)>0,$M84,0)","v":0},null,{"$f":"IF(SUM(DC$15:DC$22)>0,$M84,0)","v":0},null,{"$f":"IF(SUM(DE$15:DE$22)>0,$M84,0)","v":0},null,{"$f":"IF(SUM(DG$15:DG$22)>0,$M84,0)","v":0},null,{"$f":"IF(SUM(DI$15:DI$22)>0,$M84,0)","v":0},null,{"$f":"IF(SUM(DK$15:DK$22)>0,$M84,0)","v":0},null,{"$f":"IF(SUM(DM$15:DM$22)>0,$M84,0)","v":0},null,{"$f":"IF(SUM(DO$15:DO$22)>0,$M84,0)","v":0},null,{"$f":"IF(SUM(DQ$15:DQ$22)>0,$M84,0)","v":0},null,{"$f":"IF(SUM(DS$15:DS$22)>0,$M84,0)","v":0},null,{"$f":"IF(SUM(DU$15:DU$22)>0,$M84,0)","v":0},null,{"$f":"IF(SUM(DW$15:DW$22)>0,$M84,0)","v":0},null,{"$f":"IF(SUM(DY$15:DY$22)>0,$M84,0)","v":0},null,{"$f":"IF(SUM(EA$15:EA$22)>0,$M84,0)","v":0},null,{"$f":"IF(SUM(EC$15:EC$22)>0,$M84,0)","v":0},null,{"$f":"IF(SUM(EE$15:EE$22)>0,$M84,0)","v":0}]
[null,null,null,null,null,null,null,null,null,null,null,"SOMATÓRIO TOTAL ANUAL - POR POSTO",{"$f":"M84*12","v":0}]
[]
[]
[null,null,"MATERIAL DE CONSUMO ASSOCIADO"]
[null,null,"MEMÓRIA DE CÁLCULO DO COEFICIENTE DE CORRELAÇÃO MANUTENÇÃO X DEPRECIAÇÃO (K)"]
[]
[null,null,"JUSTIFICATIVAS",null,"TIPO","K1",null,"Condições de Trab","K4",null,"Tempo Vida (anos)","K6",null,"Temperatura","K8"]
[null,null,null,null,"Guindaste",0.5,null,"Em espera",0.4,null,1,0.6,null,"Muito quente (> 40º C)",1.3]
[null,null,"K1","Considerado o valor médio de 0,85","Caminhão-comum",0.8,null,"Leves",0.8,null,2,0.7,null,"Quente (30º a 40º C)",1.1000000000000001]
[null,null,"K2","Considerado o operador médio","Fora-de-estrada",1,null,"Médias",1,null,3,0.8,null,"Médio (10º a 30º C)",1]
[null,null,"K3","Consideradas ferramentas de primeira qualidade","Carregadeira",1,null,"Pesadas",1.4,null,4,0.9,null,"Frio (< 10º C)",1.2]
[null,null,"K4","Há todo o tipo de trabalho, foi considerado o valor médio","Escavadeira",1.4,null,"Severas",2,null,5,1]
[null,null,"K5","Considerando manutenção normal","Motoescrêiper",1.1000000000000001,null,null,null,null,6,1,null,"Ritmo de Trabalho","K9"]
[null,null,"K6","Equipamentos novos","Trator de esteira",1.2,null,"Manutenção","K5",null,7,1,null,"Folgado",0.9]
[null,null,"K7","220h por mês, 252 dias por ano",null,null,null,"Excelente",0.6,null,8,1.2,null,"Médio ",1]
[null,null,"K8","Clima quente, acima de 30º C","Qualid do Operador","K2",null,"Boa",0.8,null,9,1.3,null,"Com pressa",1.5]
[null,null,"K9","Ritmo de trabalho usualmente com pressa","Excelente",0.8,null,"Média",1,null,10,1.4]
[null,null,"K10","Considerado o operador médio","Boa",0.9,null,"Ruim ",1.5,null,11,2,null,"Conh do Serviço","K10"]
[null,null,"K11","Foi considerada a opção de aluguel a terceiros, ainda que a simulação seja dos custos do contratado, contudo a execução dos serviços é em local de terceiros","Média",1,null,"Inexistente",3,null,15,2,null,"Grande ",0.8]
[null,null,null,null,"Ruim",1.2,null,null,null,null,null,null,null,"Médio     ",0.9]
[null,null,null,null,"Péssima",2,null,"Horas de Uso ","K7",6000,1,null,null,"Pouco ",1]
[null,null,null,null,null,null,null,1000,0.5,8000,1.3]
[null,null,null,null,"Qualidade do Equip","K3",null,2000,0.5,10000,1.6,null,null,"Tipo do Serviço","K11"]
[null,null,null,null,"De primeira",0.8,null,3000,0.6,12000,1.9,null,null,"Mina ou Pedreira",0.8]
[null,null,null,null,"Média",1,null,4000,0.7,15000,2.2999999999999998,null,null,"Construção Geral",1]
[null,null,null,null,"Ruim",1.5,null,5000,0.9,20000,3,null,null,"Aluguel a Terceiros",1.4]
[]
[null,null,null,null,"Fonte: "]
[null,null,null,null,"MATTOS, Aldo Dórea. Como preparar orçamentos de obras. São Paulo: Pini, 2006. 281 p., il"]

{"sheet":"SREP","index":24,"n_rows":74,"n_cols":15,"rows_kept":74,"cut":false,"hidden":false,"merged":[[1,1,1,3],[2,1,2,14]]}
[]
[]
[null,"SISTEMA DE REGISTRO ELETRÔNICO DE PRESENÇA - SREP"]
[]
[]
[null,null,"PAGAMENTO DA DEPRECIAÇÃO"]
[null,null,"ITEM","DESCRIÇÃO","QUANT ANUAL","CONTA SIAFI","VALOR DE AQ.","% RESIDUAL","VIDA ÚTIL","DEP. MENSAL","CUSTO TOTAL","BDI (%)","PREÇO TOTAL","FONTE","REFERÊNCIA"]
[]
[null,null,1,"Equipamento de Registro Eletrônico de Ponto, de parede, com teclado externo e leitor biométrico, em conformidade com a Portaria 1.510/2009 do MT",1,"12311.01.24\n(máquinas e equip\neletrônicos)",1661.4,0.1,10,{"$f":"G9*(1-H9)/(I9*12)","v":12.460500000000001},{"$f":"J9*E9","v":12.460500000000001},{"$f":"BDI!E26","v":0.26939999999999997},{"$f":"ROUND(K9*(1+L9),2)","v":15.82},"COTAÇÃO"]
[]
[]
[null,null,"PAGAMENTO DA MANUTENÇÃO"]
[null,null,"ITEM","DESCRIÇÃO",null,null,null,"K (calculado)","MENSAL DEPR.","% MAN X DEP","MENSAL MAN.","BDI (%)","PREÇO TOTAL"]
[]
[null,null,2,"Todos os itens",null,null,null,{"$f":"H22","v":1.9000396799999999},{"$f":"K9","v":12.460500000000001},{"$f":"H15","v":1.9000396799999999},{"$f":"I15*H15","v":23.675444432640003},{"$f":"L9","v":0.26939999999999997},{"$f":"ROUND(K15*(1+L15),2)","v":30.05}]
[]
[null,null,null,null,"K1","K2","K3","K4"]
[null,null,null,null,0.85,1,0.8,1.4]
[null,null,null,null,"K5","K6","K7","K8"]
[null,null,null,null,1,0.6,1.6,1.1000000000000001]
[null,null,null,null,"K9","K10","K11","RESULTADO"]
[null,null,null,"* a descrição de cada coeficiente segue abaixo",1.5,0.9,1.4,{"$f":"E18*F18*G18*H18*E20*F20*G20*H20*E22*F22*G22","v":1.9000396799999999}]
[]
[]
[null,null,"PAGAMENTO DO SOFTWARE"]
[null,null,"ITEM","DESCRIÇÃO",null,null,null,"QUANTIDADE","UNIDADE","VALOR DE AQ.","UNIT. MENSAL","BDI (%)","PREÇO TOTAL"]
[]
[null,null,3,"Software Ponto Secullum 4 - manutenção e suporte técnico com backup - Web Nuvem - Mensalidade 12 usuários",null,null,null,1,"Licença/mês",452.25,{"$f":"J28*H28","v":452.25},{"$f":"L34","v":0.26939999999999997},{"$f":"ROUND(K28*(1+L28),2)","v":574.09},"COTAÇÃO"]
[]
[]
[null,null,"MATERIAL DE CONSUMO ASSOCIADO"]
[null,null,"ITEM","DESCRIÇÃO",null,null,null,"QUANTID/ANO","UNIDADE","VALOR DE AQ.","MENSAL MAT","BDI (%)","PREÇO TOTAL"]
[]
[null,null,4,"Bobina térmica específica para o registrador eletrônico de ponto, com papel termossensível, superfície de impressão externa ao rolo, durabilidade de impressão mínima de 5 anos e comprimento mínimo de 300m","* estimado um gasto anual de 3 bobinas",null,null,{"$f":"ROUNDUP(12*4*22*12*0.05/300,0)","v":3},"Bobina",31.37,{"$f":"J34*H34/12","v":7.8425000000000002},{"$f":"L15","v":0.26939999999999997},{"$f":"ROUND(K34*(1+L34),2)","v":9.9600000000000009},"COTAÇÃO"]
[]
[]
[null,null,"MATERIAL DE CONSUMO ASSOCIADO"]
[null,null,"ITEM","DESCRIÇÃO",null,null,null,null,null,null,null,null,"PREÇO TOTAL"]
[]
[null,null,1,"Componente DEPRECIAÇÃO",null,null,null,null,null,null,null,null,{"$f":"M9","v":15.82}]
[null,null,2,"Componente MANUTENÇÃO",null,null,null,null,null,null,null,null,{"$f":"M15","v":30.05}]
[null,null,3,"Componente SOFTWARE",null,null,null,null,null,null,null,null,{"$f":"M28","v":574.09}]
[null,null,4,"Componente MATERIAL DE CONSUMO ASSOCIADO",null,null,null,null,null,null,null,null,{"$f":"M34","v":9.9600000000000009}]
[]
[null,null,null,null,null,null,null,null,null,null,null,"SOMATÓRIO TOTAL MENSAL",{"$f":"SUM(M39:M44)","v":629.92000000000007}]
[null,null,null,null,null,null,null,null,null,null,null,"SOMATÓRIO TOTAL ANUAL",{"$f":"M45*12","v":7559.0400000000009}]
[]
[]
[null,null,"MATERIAL DE CONSUMO ASSOCIADO"]
[null,null,"MEMÓRIA DE CÁLCULO DO COEFICIENTE DE CORRELAÇÃO MANUTENÇÃO X DEPRECIAÇÃO (K)"]
[]
[null,null,"JUSTIFICATIVAS",null,"TIPO","K1",null,"Condições de Trab","K4",null,"Tempo Vida (anos)","K6",null,"Temperatura","K8"]
[null,null,null,null,"Guindaste",0.5,null,"Em espera",0.4,null,1,0.6,null,"Muito quente (> 40º C)",1.3]
[null,null,"K1","Considerado o valor médio de 0,85","Caminhão-comum",0.8,null,"Leves",0.8,null,2,0.7,null,"Quente (30º a 40º C)",1.1000000000000001]
[null,null,"K2","Considerado o operador médio","Fora-de-estrada",1,null,"Médias",1,null,3,0.8,null,"Médio (10º a 30º C)",1]
[null,null,"K3","Consideradas ferramentas de primeira qualidade","Carregadeira",1,null,"Pesadas",1.4,null,4,0.9,null,"Frio (< 10º C)",1.2]
[null,null,"K4","Há todo o tipo de trabalho, foi considerado condições pesadas","Escavadeira",1.4,null,"Severas",2,null,5,1]
[null,null,"K5","Considerando manutenção normal","Motoescrêiper",1.1000000000000001,null,null,null,null,6,1,null,"Ritmo de Trabalho","K9"]
[null,null,"K6","Equipamentos novos","Trator de esteira",1.2,null,"Manutenção","K5",null,7,1,null,"Folgado",0.9]
[null,null,"K7","44h por dia, 252 dias por ano",null,null,null,"Excelente",0.6,null,8,1.2,null,"Médio ",1]
[null,null,"K8","Clima quente, acima de 30º C","Qualid do Operador","K2",null,"Boa",0.8,null,9,1.3,null,"Com pressa",1.5]
[null,null,"K9","Ritmo de trabalho usualmente com pressa","Excelente",0.8,null,"Média",1,null,10,1.4]
[null,null,"K10","Considerado o operador médio","Boa",0.9,null,"Ruim ",1.5,null,11,2,null,"Conh do Serviço","K10"]
[null,null,"K11","Foi considerada a opção de aluguel a terceiros, ainda que a simulação seja dos custos do contratado, contudo a execução dos serviços é em local de terceiros","Média",1,null,"Inexistente",3,null,15,2,null,"Grande ",0.8]
[null,null,null,null,"Ruim",1.2,null,null,null,null,null,null,null,"Médio     ",0.9]
[null,null,null,null,"Péssima",2,null,"Horas de Uso ","K7",6000,1,null,null,"Pouco ",1]
[null,null,null,null,null,null,null,1000,0.5,8000,1.3]
[null,null,null,null,"Qualidade do Equip","K3",null,2000,0.5,10000,1.6,null,null,"Tipo do Serviço","K11"]
[null,null,null,null,"De primeira",0.8,null,3000,0.6,12000,1.9,null,null,"Mina ou Pedreira",0.8]
[null,null,null,null,"Média",1,null,4000,0.7,15000,2.2999999999999998,null,null,"Construção Geral",1]
[null,null,null,null,"Ruim",1.5,null,5000,0.9,20000,3,null,null,"Aluguel a Terceiros",1.4]
[]
[null,null,null,null,"Fonte: "]
[null,null,null,null,"MATTOS, Aldo Dórea. Como preparar orçamentos de obras. São Paulo: Pini, 2006. 281 p., il"]

{"sheet":"Não Rel - EPI","index":25,"n_rows":16,"n_cols":15,"rows_kept":16,"cut":false,"hidden":false,"merged":[[1,1,1,4],[2,1,2,11]]}
[]
[]
[null,"EPIS NÃO RELACIONADOS DIRETAMENTE A UM POSTO DE TRABALHO - AQUISIÇÃO"]
[]
[]
[null,null,null,"ITEM","DESCRIÇÃO","QUANT ANUAL","UNIDADE","CUSTO UNITÁRIO","CUSTO ANUAL","BDI (%)","PREÇO TOTAL","FONTE"]
[]
[null,null,null,1,"Cinto de segurança, tipo paraquedista, produzido em material sintético, com 2 pontos de ancoragem - Frontal e dorsal - ajuste nas pernas e cintura. Acompanhado de talabarte duplo (comprimento aproximado de 1,5m) e absorvedor de energia do mesmo fabricante do cinto. Ref.: Gulin",2,"UND",313.52,{"$f":"H8*F8","v":627.04},{"$f":"BDI!$E$26","v":0.26939999999999997},{"$f":"ROUND(I8*(1+J8),2)","v":795.96},"COTAÇÃO"]
[null,null,null,2,"Bota em PVC, impermeável, forrada internamente, cano médio. Ref. PEGA FORTE. ",2,"PARES",{"$f":"EPI!F18","v":47.93},95.86,{"$f":"BDI!$E$26","v":0.26939999999999997},121.68,"COTAÇÃO"]
[null,null,null,3,"Capacete de segurança em polietileno de alta densidade, na cor VERMELHA, aba frontal, suspensão em tecido, com Faixa anti-suor, regulagem de tamanho com ajuste simples, com jugular ajustável. MARCA(S) DE REFERÊNCIA:Ref: MSA",1,"UND",{"$f":"EPI!F16","v":47.66},47.66,{"$f":"BDI!$E$26","v":0.26939999999999997},60.5,"COTAÇÃO"]
[null,null,null,4,"Boné tipo Touca Árabe confeccionado em helanca com viés na aba, elástico interno traseiro para ajuste de tamanho, fechamento da saia em velcro. ",2,"UND",{"$f":"EPI!F19","v":12.58},25.16,{"$f":"BDI!$E$26","v":0.26939999999999997},31.94,"COTAÇÃO"]
[null,null,null,5,"Respirador purificador de ar tipo, peça semifacial filtrante para partículas (PFF2), com formato dobrável, solda ultrassônica em todo o seu perímetro. Fita elástica branca fixada nas laterais externas do respirador, perfazendo uma alça na para fixação na parte superior da cabeça e a outra na parte inferior, para fixação na altura da nuca do usuário. A parte superior externa da peça possui tira de material metálico moldável, utilizada para ajuste no septo nasal. Na face lateral do respirador existe um dispositivo de material plástico, dotado internamente de uma válvula de exalação. DEVERÁ APRESENTAR O SELO DE APROVAÇÃO DO INMETRO. Ref. 3M",20,"UND",2.5299999999999998,50.599999999999994,{"$f":"BDI!$E$26","v":0.26939999999999997},64.23,"COTAÇÃO"]
[null,null,null,6,"Capa de chuva com capuz e manga, confeccionada em PVC laminado transparente cristal com fechamento frontal através de botões plásticos de pressão e costura através de solda eletrônica marca ref. Ledan .",3,"UND",27.22,81.66,{"$f":"BDI!$E$26","v":0.26939999999999997},103.66,"COTAÇÃO"]
[]
[null,null,null,null,null,null,null,null,null,"SOMATÓRIO TOTAL MENSAL",{"$f":"K16/12","v":98.164166666666688}]
[null,null,null,null,null,null,null,null,null,"SOMATÓRIO TOTAL ANUAL",{"$f":"SUM(K7:K14)","v":1177.9700000000003},null,null,{"$f":"SUM($I$8:$I$13)","v":927.9799999999999},"por ano sem bdi"]

{"sheet":"Não Rel - Uniformes","index":26,"n_rows":31,"n_cols":15,"rows_kept":31,"cut":false,"hidden":true,"merged":[[9,1,9,4],[10,1,10,11],[15,2,15,11],[23,2,23,11]]}
[null,null,"CÂMARA DOS DEPUTADOS"]
[null,null,"DEPARTAMENTO TÉCNICO"]
[null,null,"Coordenação de Planejamento e Gestão"]
[]
[null,null,"Data:",{"$f":"'Dados Gerais'!#REF!","v":{"$error":"#REF!"}}]
[null,null,"Processo:",{"$f":"'Dados Gerais'!#REF!","v":{"$error":"#REF!"}}]
[null,null,"Objeto:",{"$f":"'Dados Gerais'!#REF!","v":{"$error":"#REF!"}}]
[]
[]
[]
[null,"UNIFORMES NÃO RELACIONADOS DIRETAMENTE A UM POSTO DE TRABALHO - AQUISIÇÃO"]
[]
[]
[null,null,null,"ITEM","DESCRIÇÃO","QUANT ANUAL","UNIDADE","CUSTO UNITÁRIO","CUSTO ANUAL","BDI (%)","PREÇO TOTAL","FONTE"]
[]
[null,null,"ANALISTA DE INFRAESTRUTURA DE TI SÊNIOR E MASTER"]
[null,null,null,1,null,null,"UND",null,{"$f":"H17*F17","v":0},{"$f":"BDI!$E$26","v":0.26939999999999997},{"$f":"ROUND(I17*(1+J17),2)","v":0},"COTAÇÃO"]
[null,null,null,2,null,null,"UND",null,{"$f":"H18*F18","v":0},{"$f":"BDI!$E$26","v":0.26939999999999997},0,"COTAÇÃO"]
[null,null,null,3,null,null,"UND",null,0,{"$f":"BDI!$E$26","v":0.26939999999999997},0,"COTAÇÃO"]
[null,null,null,4,null,null,"UND",null,0,{"$f":"BDI!$E$26","v":0.26939999999999997},0,"COTAÇÃO"]
[null,null,null,5,null,null,"UND",null,0,{"$f":"BDI!$E$26","v":0.26939999999999997},0,"COTAÇÃO"]
[null,null,null,6,null,null,"UND",null,0,{"$f":"BDI!$E$26","v":0.26939999999999997},0,"COTAÇÃO"]
[]
[null,null,"TÉCNICO INSTALADOR DE CABEAMENTO E TÉCNICO DE MANUTENÇÃO DE INFRAESTRUTURA DE REDE"]
[null,null,null,1,null,null,"UND",null,{"$f":"H25*F25","v":0},{"$f":"BDI!$E$26","v":0.26939999999999997},{"$f":"ROUND(I25*(1+J25),2)","v":0},"COTAÇÃO"]
[null,null,null,2,null,null,"UND",null,0,{"$f":"BDI!$E$26","v":0.26939999999999997},{"$f":"ROUND(I26*(1+J26),2)","v":0},"COTAÇÃO"]
[null,null,null,3,null,null,"UND",null,0,{"$f":"BDI!$E$26","v":0.26939999999999997},{"$f":"ROUND(I27*(1+J27),2)","v":0},"COTAÇÃO"]
[null,null,null,4,null,null,"UND",null,0,{"$f":"BDI!$E$26","v":0.26939999999999997},{"$f":"ROUND(I28*(1+J28),2)","v":0},"COTAÇÃO"]
[]
[null,null,null,null,null,null,null,null,null,"SOMATÓRIO TOTAL MENSAL",{"$f":"K31/12","v":0}]
[null,null,null,null,null,null,null,null,null,"SOMATÓRIO TOTAL ANUAL",{"$f":"SUM(K15:K29)","v":0},null,null,{"$f":"SUM($I$17:$I$28)","v":0},"por ano sem bdi"]

{"sheet":"Não Rel - Depr","index":27,"n_rows":91,"n_cols":15,"rows_kept":91,"cut":false,"hidden":false,"merged":[[1,1,1,3],[2,1,2,14]]}
[]
[]
[null,"EQUIPAMENTOS NÃO RELACIONADOS DIRETAMENTE A UM POSTO DE TRABALHO - PAGAMENTO DA DEPRECIAÇÃO / MANUTENÇÃO"]
[]
[]
[null,null,"PAGAMENTO DA DEPRECIAÇÃO"]
[null,null,"ITEM","DESCRIÇÃO","QUANT ANUAL","CONTA SIAFI","VALOR DE AQ.","% RESIDUAL","VIDA ÚTIL","DEP. MENSAL","CUSTO TOTAL","BDI (%)","PREÇO TOTAL","FONTE","REFERÊNCIA"]
[]
[null,null,1,"Balança eletrônica de 0 a 25 Kg",1,"12311.01.25",752.34666666666669,0.1,10,{"$f":"G9*(1-H9)/(I9*12)","v":5.6426000000000007},{"$f":"J9*E9","v":5.6426000000000007},{"$f":"BDI!$E$26","v":0.26939999999999997},{"$f":"ROUND(K9*(1+L9),2)","v":7.16},"COTAÇÃO"]
[null,null,2,"Caixa de ferramentas",1,"12311.01.25",187.70499999999998,0.1,10,1.4077875,1.4077875,{"$f":"BDI!$E$26","v":0.26939999999999997},1.79,"COTAÇÃO"]
[null,null,3,"Alicate de pressão 10\"",1,"12311.01.25",42.995000000000005,0.1,10,0.32246250000000004,0.32246250000000004,{"$f":"BDI!$E$26","v":0.26939999999999997},0.41,"COTAÇÃO"]
[null,null,4,"Chave de grifo n.º 12",1,"12311.01.25",57.424999999999997,0.1,10,0.4306875,0.4306875,{"$f":"BDI!$E$26","v":0.26939999999999997},0.55000000000000004,"COTAÇÃO"]
[null,null,5,"Chave de grifo n.º 24",1,"12311.01.25",190.69499999999999,0.1,10,1.4302124999999999,1.4302124999999999,{"$f":"BDI!$E$26","v":0.26939999999999997},1.82,"COTAÇÃO"]
[null,null,6,"Chave de grifo n.º 36",1,"12311.01.25",297.54499999999996,0.1,10,2.2315874999999994,2.2315874999999994,{"$f":"BDI!$E$26","v":0.26939999999999997},2.83,"COTAÇÃO"]
[null,null,7,"Jogo de chave de fenda e chave philips",1,"12311.01.25",96.330000000000013,0.1,10,0.72247500000000009,0.72247500000000009,{"$f":"BDI!$E$26","v":0.26939999999999997},0.92,"COTAÇÃO"]
[null,null,8,"Chave inglesa n.º 8",1,"12311.01.25",53.266666666666673,0.1,10,0.39950000000000002,0.39950000000000002,{"$f":"BDI!$E$26","v":0.26939999999999997},0.51,"COTAÇÃO"]
[null,null,9,"Chave inglesa n.º 12",1,"12311.01.25",98.723333333333343,0.1,10,0.74042500000000011,0.74042500000000011,{"$f":"BDI!$E$26","v":0.26939999999999997},0.94,"COTAÇÃO"]
[null,null,10,"Chave inglesa n.º 24",1,"12311.01.25",360.4,0.1,10,2.7030000000000003,2.7030000000000003,{"$f":"BDI!$E$26","v":0.26939999999999997},3.43,"COTAÇÃO"]
[null,null,11,"Jogo de chave combinada de boca e chave estria 1/4\" a 1 1/2\"",1,"12311.01.25",506.995,0.1,10,3.8024624999999999,3.8024624999999999,{"$f":"BDI!$E$26","v":0.26939999999999997},4.83,"COTAÇÃO"]
[null,null,12,"Multiteste digital",1,"12311.01.25",48.594999999999999,0.1,10,{"$f":"G20*(1-H20)/(I20*12)","v":0.36446250000000002},{"$f":"J20*E20","v":0.36446250000000002},{"$f":"BDI!$E$26","v":0.26939999999999997},{"$f":"ROUND(K20*(1+L20),2)","v":0.46},"COTAÇÃO"]
[null,null,13,"Multímetro tipo alicate para medições de corrente até 750 A, voltagem e resistência ôhmica",1,"12311.01.25",535.95000000000005,0.1,10,4.0196250000000004,4.0196250000000004,{"$f":"BDI!$E$26","v":0.26939999999999997},5.0999999999999996,"COTAÇÃO"]
[null,null,14,"Soprador térmico para manutenção de detectores termovelocímétricos",1,"12311.01.25",183,0.1,10,1.3725000000000001,1.3725000000000001,{"$f":"BDI!$E$26","v":0.26939999999999997},1.74,"COTAÇÃO"]
[null,null,15,"Furadeira de impacto, ref. GSB 16RE, marca BOSH",1,"12311.01.25",592.54500000000007,0.1,10,4.4440875000000002,4.4440875000000002,{"$f":"BDI!$E$26","v":0.26939999999999997},5.64,"COTAÇÃO"]
[null,null,16,"Alicate universal 8 pol.",1,"12311.01.25",40.633333333333333,0.1,10,0.30475000000000002,0.30475000000000002,{"$f":"BDI!$E$26","v":0.26939999999999997},0.39,"COTAÇÃO"]
[null,null,17,"Alicate de bico meia cana 6 pol.",1,"12311.01.25",34.335000000000001,0.1,10,0.25751250000000003,0.25751250000000003,{"$f":"BDI!$E$26","v":0.26939999999999997},0.33,"COTAÇÃO"]
[null,null,18,"Alicate de corte diagonal 6 pol.",1,"12311.01.25",47.45,0.1,10,0.35587500000000005,0.35587500000000005,{"$f":"BDI!$E$26","v":0.26939999999999997},0.45,"COTAÇÃO"]
[null,null,19,"Jogo de chaves de fenda  tamanhos incluindo p/ borne",1,"12311.01.25",63.430000000000007,0.1,10,0.47572500000000006,0.47572500000000006,{"$f":"BDI!$E$26","v":0.26939999999999997},0.6,"COTAÇÃO"]
[null,null,20,"Jogo de chaves philips 3 tamanhos",1,"12311.01.25",59.344999999999999,0.1,10,0.44508749999999997,0.44508749999999997,{"$f":"BDI!$E$26","v":0.26939999999999997},0.56000000000000005,"COTAÇÃO"]
[null,null,21,"Jogo de chaves combinadas boca e estria de 7 a 27 mm",1,"12311.01.25",397.94499999999999,0.1,10,2.9845875000000004,2.9845875000000004,{"$f":"BDI!$E$26","v":0.26939999999999997},3.79,"COTAÇÃO"]
[null,null,22,"Jogo de chaves soquete de 10 a 32 mm Belzer, Gedore ou Tramontina Pro.",1,"12311.01.25",211.29,0.1,10,1.5846750000000001,1.5846750000000001,{"$f":"BDI!$E$26","v":0.26939999999999997},2.0099999999999998,"COTAÇÃO"]
[null,null,23,"Lanterna Led foco ajustável",2,"12311.01.25",67.444999999999993,0.1,10,0.50583749999999994,1.0116749999999999,{"$f":"BDI!$E$26","v":0.26939999999999997},1.28,"COTAÇÃO"]
[null,null,24,"Martelo bola de 500g",1,"12311.01.25",47.763333333333328,0.1,10,0.35822499999999996,0.35822499999999996,{"$f":"BDI!$E$26","v":0.26939999999999997},0.45,"COTAÇÃO"]
[null,null,25,"Escada alumínio de 5 degraus",1,"12311.01.25",174.495,0.1,10,1.3087124999999999,1.3087124999999999,{"$f":"BDI!$E$26","v":0.26939999999999997},1.66,"COTAÇÃO"]
[]
[]
[null,null,"PAGAMENTO DA MANUTENÇÃO"]
[null,null,"ITEM","DESCRIÇÃO",null,null,null,"K (calculado)","MENSAL DEPR.","% MAN X DEP","MENSAL MAN.","BDI (%)","PREÇO TOTAL"]
[]
[null,null,null,"Todos os itens",null,null,null,{"$f":"H46","v":0.38170440000000005},{"$f":"SUM(M9:M33)","v":49.650000000000006},{"$f":"H39","v":0.38170440000000005},{"$f":"I39*H39","v":18.951623460000004},{"$f":"BDI!E26","v":0.26939999999999997},{"$f":"ROUND(K39*(1+L39),2)","v":24.06}]
[]
[null,null,null,null,"K1","K2","K3","K4"]
[null,null,null,null,0.85,0.9,0.8,1]
[null,null,null,null,"K5","K6","K7","K8"]
[null,null,null,null,1,0.6,0.5,1.1000000000000001]
[null,null,null,null,"K9","K10","K11","RESULTADO"]
[null,null,null,"* a descrição de cada coeficiente segue abaixo",1.5,0.9,1.4,{"$f":"E42*F42*G42*H42*E44*F44*G44*H44*E46*F46*G46","v":0.38170440000000005}]
[]
[]
[null,null,"MATERIAL DE CONSUMO ASSOCIADO"]
[null,null,"ITEM","DESCRIÇÃO",null,null,null,"QUANTID/ANO","UNIDADE","VALOR DE AQ.","MENSAL MAT","BDI (%)","PREÇO TOTAL"]
[]
[null,null,null,null,null,null,null,null,null,null,{"$f":"J52*H52/12","v":0},{"$f":"BDI!E26","v":0.26939999999999997},{"$f":"ROUND(K52*(1+L52),2)","v":0}]
[]
[]
[null,null,"MATERIAL DE CONSUMO ASSOCIADO"]
[null,null,"ITEM","DESCRIÇÃO",null,null,null,null,null,null,null,null,"PREÇO TOTAL"]
[]
[null,null,1,"Componente DEPRECIAÇÃO",null,null,null,null,null,null,null,null,{"$f":"I39","v":49.650000000000006}]
[null,null,2,"Componente MANUTENÇÃO",null,null,null,null,null,null,null,null,{"$f":"M39","v":24.06}]
[null,null,3,"Componente MATERIAL DE CONSUMO ASSOCIADO",null,null,null,null,null,null,null,null,{"$f":"M52","v":0}]
[]
[null,null,null,null,null,null,null,null,null,null,null,"SOMATÓRIO TOTAL MENSAL",{"$f":"SUM(M57:M61)","v":73.710000000000008}]
[null,null,null,null,null,null,null,null,null,null,null,"SOMATÓRIO TOTAL ANUAL",{"$f":"M62*12","v":884.5200000000001}]
[]
[]
[null,null,"MATERIAL DE CONSUMO ASSOCIADO"]
[null,null,"MEMÓRIA DE CÁLCULO DO COEFICIENTE DE CORRELAÇÃO MANUTENÇÃO X DEPRECIAÇÃO (K)"]
[]
[null,null,"JUSTIFICATIVAS",null,"TIPO","K1",null,"Condições de Trab","K4",null,"Tempo Vida (anos)","K6",null,"Temperatura","K8"]
[null,null,null,null,"Guindaste",0.5,null,"Em espera",0.4,null,1,0.6,null,"Muito quente (> 40º C)",1.3]
[null,null,"K1","Considerado o valor médio de 0,85","Caminhão-comum",0.8,null,"Leves",0.8,null,2,0.7,null,"Quente (30º a 40º C)",1.1000000000000001]
[null,null,"K2","Considerado o operador bom","Fora-de-estrada",1,null,"Médias",1,null,3,0.8,null,"Médio (10º a 30º C)",1]
[null,null,"K3","Consideradas ferramentas de primeira qualidade","Carregadeira",1,null,"Pesadas",1.4,null,4,0.9,null,"Frio (< 10º C)",1.2]
[null,null,"K4","Há todo o tipo de trabalho, foi considerado o valor médio","Escavadeira",1.4,null,"Severas",2,null,5,1]
[null,null,"K5","Considerando manutenção normal","Motoescrêiper",1.1000000000000001,null,null,null,null,6,1,null,"Ritmo de Trabalho","K9"]
[null,null,"K6","Equipamentos novos","Trator de esteira",1.2,null,"Manutenção","K5",null,7,1,null,"Folgado",0.9]
[null,null,"K7","220h por mês, 252 dias por ano",null,null,null,"Excelente",0.6,null,8,1.2,null,"Médio ",1]
[null,null,"K8","Clima quente, acima de 30º C","Qualid do Operador","K2",null,"Boa",0.8,null,9,1.3,null,"Com pressa",1.5]
[null,null,"K9","Ritmo de trabalho usualmente com pressa","Excelente",0.8,null,"Média",1,null,10,1.4]
[null,null,"K10","Considerado o operador médio","Boa",0.9,null,"Ruim ",1.5,null,11,2,null,"Conh do Serviço","K10"]
[null,null,"K11","Foi considerada a opção de aluguel a terceiros, ainda que a simulação seja dos custos do contratado, contudo a execução dos serviços é em local de terceiros","Média",1,null,"Inexistente",3,null,15,2,null,"Grande ",0.8]
[null,null,null,null,"Ruim",1.2,null,null,null,null,null,null,null,"Médio     ",0.9]
[null,null,null,null,"Péssima",2,null,"Horas de Uso ","K7",6000,1,null,null,"Pouco ",1]
[null,null,null,null,null,null,null,1000,0.5,8000,1.3]
[null,null,null,null,"Qualidade do Equip","K3",null,2000,0.5,10000,1.6,null,null,"Tipo do Serviço","K11"]
[null,null,null,null,"De primeira",0.8,null,3000,0.6,12000,1.9,null,null,"Mina ou Pedreira",0.8]
[null,null,null,null,"Média",1,null,4000,0.7,15000,2.2999999999999998,null,null,"Construção Geral",1]
[null,null,null,null,"Ruim",1.5,null,5000,0.9,20000,3,null,null,"Aluguel a Terceiros",1.4]
[]
[null,null,null,null,"Fonte: "]
[null,null,null,null,"MATTOS, Aldo Dórea. Como preparar orçamentos de obras. São Paulo: Pini, 2006. 281 p., il"]

{"sheet":"Not. Demanda","index":28,"n_rows":57,"n_cols":8,"rows_kept":57,"cut":false,"hidden":true,"merged":[[9,1,9,3],[10,1,10,7],[6,3,7,7]]}
[null,null,"CÂMARA DOS DEPUTADOS"]
[null,null,"DEPARTAMENTO TÉCNICO"]
[null,null,"Coordenação de Planejamento e Gestão"]
[]
[null,null,"Data:",{"$f":"'Dados Gerais'!#REF!","v":{"$error":"#REF!"}}]
[null,null,"Processo:",{"$f":"'Dados Gerais'!#REF!","v":{"$error":"#REF!"}}]
[null,null,"Objeto:",{"$f":"'Dados Gerais'!#REF!","v":{"$error":"#REF!"}}]
[]
[]
[]
[null,"ADICIONAL NOTURNO SOB DEMANDA"]
[]
[]
[null,null,"CATEGORIAS",null,null,null,"HORAS / MÊS","% NOTURNA"]
[]
[null,null,null,{"$f":"HLOOKUP($C16,'Dados Gerais'!$D$5:$BK$10,6)","v":{"$error":"#N/A"}},null,null,null,0.2]
[null,null,null,{"$f":"HLOOKUP($C17,'Dados Gerais'!$D$5:$BK$10,6)","v":{"$error":"#N/A"}},null,null,null,0.2]
[]
[]
[null,null,"AJUSTE DE HORAS FICTAS",null,"AJUSTE H.NOT","HORA NORMAL","H.FICTAS/MÊS","H.ÚTEIS/MÊS"]
[]
[null,null,null,{"$f":"HLOOKUP($C22,'Dados Gerais'!$D$5:$BK$10,6)","v":{"$error":"#N/A"}},52.5,60,{"$f":"G16*(F22/E22)","v":0},{"$f":"HLOOKUP(C22,'Dados Gerais'!$D$5:$P$16,12,0)","v":{"$error":"#N/A"}}]
[null,null,null,{"$f":"HLOOKUP($C23,'Dados Gerais'!$D$5:$BK$10,6)","v":{"$error":"#N/A"}},52.5,60,{"$f":"G17*(F23/E23)","v":0},{"$f":"HLOOKUP(C23,'Dados Gerais'!$D$5:$P$16,12,0)","v":{"$error":"#N/A"}}]
[]
[]
[null,null,"VALOR DO ADICIONAL NOTURNO",null,null,"SALÁRIO MÊS","VL.H.NORMAL","ADIC.H.FICTAS"]
[]
[null,null,null,{"$f":"HLOOKUP($C28,'Dados Gerais'!$D$5:$BK$10,6)","v":{"$error":"#N/A"}},null,{"$f":"HLOOKUP(C28,'Dados Gerais'!$D$5:$P$12,8,0)","v":{"$error":"#N/A"}},{"$f":"F28/H22","v":{"$error":"#N/A"}},{"$f":"G28*(H16)","v":{"$error":"#N/A"}}]
[null,null,null,{"$f":"HLOOKUP($C29,'Dados Gerais'!$D$5:$BK$10,6)","v":{"$error":"#N/A"}},null,{"$f":"HLOOKUP(C29,'Dados Gerais'!$D$5:$P$12,8,0)","v":{"$error":"#N/A"}},{"$f":"F29/H23","v":{"$error":"#N/A"}},{"$f":"G29*(H17)","v":{"$error":"#N/A"}}]
[]
[]
[null,null,"RESUMO DO ADICIONAL NOTURNO SOB DEMANDA"]
[null,null,"TOTAIS MENSAIS",null,null,null,"PREÇO MENSAL"]
[]
[null,null,11,{"$f":"HLOOKUP($C35,'Dados Gerais'!$D$5:$BK$10,6)","v":0},null,null,{"$f":"H28*G22","v":{"$error":"#N/A"}}]
[null,null,12,{"$f":"HLOOKUP($C36,'Dados Gerais'!$D$5:$BK$10,6)","v":0},null,null,{"$f":"H29*G23","v":{"$error":"#N/A"}}]
[]
[null,null,null,null,null,"SOMATÓRIO TOTAL MENSAL",{"$f":"SUM(G35:G36)","v":{"$error":"#N/A"}}]
[null,null,null,null,null,"SOMATÓRIO TOTAL ANUAL",{"$f":"G38*12","v":{"$error":"#N/A"}}]
[]
[]
[null,null,"ENCARGOS SOCIAIS E BDI SOBRE ADICIONAL NOTURNO SOB DEMANDA"]
[null,null,"TOTAIS MENSAIS",null,null,"PERCENTUAIS","PREÇO MENSAL"]
[]
[null,null,null,"ENCARGOS SOCIAIS",null,{"$f":"'Encargos Sociais'!$E$45","v":0.72009999999999996},{"$f":"F45*G38","v":{"$error":"#N/A"}}]
[null,null,null,"BDI",null,{"$f":"BDI!$E$26","v":0.26939999999999997},{"$f":"F46*(G38+G45)","v":{"$error":"#N/A"}}]
[]
[null,null,null,null,null,"SOMATÓRIO TOTAL MENSAL",{"$f":"SUM(G45:G47)","v":{"$error":"#N/A"}}]
[null,null,null,null,null,"SOMATÓRIO TOTAL ANUAL",{"$f":"G48*12","v":{"$error":"#N/A"}}]
[]
[]
[null,null,"VALOR TOTAL ADICIONAL NOTURNO SOB DEMANDA (COM ENCARGOS SOCIAIS E BDI INCLUSOS)"]
[]
[]
[]
[null,null,null,null,null,"SOMATÓRIO TOTAL MENSAL"]
[null,null,null,null,null,"SOMATÓRIO TOTAL ANUAL",{"$f":"G56*12","v":0}]

{"sheet":"SOBREAVISO","index":29,"n_rows":51,"n_cols":10,"rows_kept":51,"cut":false,"hidden":true,"merged":[[6,3,7,7],[9,1,9,3],[10,1,10,7]]}
[null,null,"CÂMARA DOS DEPUTADOS"]
[null,null,"DEPARTAMENTO TÉCNICO"]
[null,null,"Coordenação de Planejamento e Gestão"]
[]
[null,null,"Data:",{"$f":"'Dados Gerais'!#REF!","v":{"$error":"#REF!"}}]
[null,null,"Processo:",{"$f":"'Dados Gerais'!#REF!","v":{"$error":"#REF!"}}]
[null,null,"Objeto:",{"$f":"'Dados Gerais'!#REF!","v":{"$error":"#REF!"}}]
[]
[]
[]
[null,"HORAS DE SOBREAVISO SOB DEMANDA"]
[]
[]
[null,null,"CATEGORIAS",null,null,null,"HORAS / MÊS","% NOTURNA"]
[]
[null,null,11,{"$f":"HLOOKUP($C16,'Dados Gerais'!$D$5:$BK$10,6)","v":0},null,null,1195,{"$f":"1/3","v":0.33333333333333331}]
[null,null,12,{"$f":"HLOOKUP($C17,'Dados Gerais'!$D$5:$BK$10,6)","v":0},null,null,220,{"$f":"H16","v":0.33333333333333331}]
[]
[]
[null,null,"VALOR DO SOBREAVISO",null,null,"SALÁRIO MÊS","VL.H.NORMAL","ADIC.H.FICTAS"]
[]
[null,null,11,{"$f":"HLOOKUP($C22,'Dados Gerais'!$D$5:$BK$10,6)","v":0},null,{"$f":"HLOOKUP(C22,'Dados Gerais'!$D$5:$P$12,8,0)","v":0},{"$f":"F22/220","v":0},{"$f":"G22*(H16)","v":0},null,{"$f":"G22/3","v":0}]
[null,null,12,{"$f":"HLOOKUP($C23,'Dados Gerais'!$D$5:$BK$10,6)","v":0},null,{"$f":"HLOOKUP(C23,'Dados Gerais'!$D$5:$P$12,8,0)","v":0},{"$f":"F23/220","v":0},{"$f":"G23*(H17)","v":0},null,{"$f":"G23/3","v":0}]
[]
[]
[null,null,"RESUMO DO SOBREAVISO SOB DEMANDA"]
[null,null,"TOTAIS MENSAIS",null,null,null,"PREÇO MENSAL"]
[]
[null,null,11,{"$f":"HLOOKUP($C29,'Dados Gerais'!$D$5:$BK$10,6)","v":0},null,null,{"$f":"H22*G16","v":0}]
[null,null,12,{"$f":"HLOOKUP($C30,'Dados Gerais'!$D$5:$BK$10,6)","v":0},null,null,{"$f":"H23*G17","v":0}]
[]
[null,null,null,null,null,"SOMATÓRIO TOTAL MENSAL",{"$f":"SUM(G29:G30)","v":0}]
[null,null,null,null,null,"SOMATÓRIO TOTAL ANUAL",{"$f":"G32*12","v":0}]
[]
[]
[null,null,"ENCARGOS SOCIAIS E BDI SOBRE SOBREAVISO SOB DEMANDA"]
[null,null,"TOTAIS MENSAIS",null,null,"PERCENTUAIS","PREÇO MENSAL"]
[]
[null,null,null,"ENCARGOS SOCIAIS",null,{"$f":"'Encargos Sociais'!$E$45","v":0.72009999999999996},{"$f":"F39*G32","v":0}]
[null,null,null,"BDI",null,{"$f":"BDI!$E$26","v":0.26939999999999997},{"$f":"F40*(G32+G39)","v":0}]
[]
[null,null,null,null,null,"SOMATÓRIO TOTAL MENSAL",{"$f":"SUM(G39:G41)","v":0}]
[null,null,null,null,null,"SOMATÓRIO TOTAL ANUAL",{"$f":"G42*12","v":0}]
[]
[]
[null,null,"VALOR TOTAL SOBREAVISO SOB DEMANDA (COM ENCARGOS SOCIAIS E BDI INCLUSOS)"]
[]
[]
[]
[null,null,null,null,null,"SOMATÓRIO TOTAL MENSAL",{"$f":"G32+G42","v":0}]
[null,null,null,null,null,"SOMATÓRIO TOTAL ANUAL",{"$f":"G50*12","v":0}]

{"sheet":"Horas extras_Demanda","index":30,"n_rows":77,"n_cols":8,"rows_kept":77,"cut":false,"hidden":true,"merged":[[6,3,7,7],[9,1,9,3],[10,1,10,7],[38,2,38,3]]}
[null,null,"CÂMARA DOS DEPUTADOS"]
[null,null,"DEPARTAMENTO TÉCNICO"]
[null,null,"Coordenação de Planejamento e Gestão"]
[]
[null,null,"Data:",{"$f":"'Dados Gerais'!#REF!","v":{"$error":"#REF!"}}]
[null,null,"Processo:",{"$f":"'Dados Gerais'!#REF!","v":{"$error":"#REF!"}}]
[null,null,"Objeto:",{"$f":"'Dados Gerais'!#REF!","v":{"$error":"#REF!"}}]
[]
[]
[]
[null,"HORAS EXTRAORDINÁRIAS SOB DEMANDA"]
[]
[]
[null,null,"CATEGORIAS (HORAS EXTRAS EM DIAS COMUNS E SÁBADOS)",null,null,null,"HORAS / MÊS","% HORA EXTRA"]
[]
[null,null,11,{"$f":"HLOOKUP($C16,'Dados Gerais'!$D$5:$BK$10,6)","v":0},null,null,54,1.5]
[null,null,12,{"$f":"HLOOKUP($C17,'Dados Gerais'!$D$5:$BK$10,6)","v":0},null,null,27,1.5]
[]
[]
[null,null,"VALOR DA HORA EXTRA (DIAS COMUNS E SÁBADOS)",null,"SALÁRIO MÊS","H.ÚTEIS/MÊS","VL.H.NORMAL","VL.H.EXTRA"]
[]
[null,null,11,{"$f":"HLOOKUP($C22,'Dados Gerais'!$D$5:$BK$10,6)","v":0},{"$f":"HLOOKUP($C22,'Dados Gerais'!$D$5:$P$12,8,0)","v":0},{"$f":"HLOOKUP(C22,'Dados Gerais'!$D$5:$P$16,12,0)","v":0},{"$f":"E22/F22","v":{"$error":"#DIV/0!"}},{"$f":"G22*(H16)","v":{"$error":"#DIV/0!"}}]
[null,null,12,{"$f":"HLOOKUP($C23,'Dados Gerais'!$D$5:$BK$10,6)","v":0},{"$f":"HLOOKUP($C23,'Dados Gerais'!$D$5:$P$12,8,0)","v":0},{"$f":"HLOOKUP(C23,'Dados Gerais'!$D$5:$P$16,12,0)","v":0},{"$f":"E23/F23","v":{"$error":"#DIV/0!"}},{"$f":"G23*(H17)","v":{"$error":"#DIV/0!"}}]
[]
[]
[null,null,"CATEGORIAS (HORAS EXTRAS EM DOMINGOS E FERIADOS)",null,null,null,"HORAS / MÊS","% HORA EXTRA"]
[]
[null,null,11,{"$f":"HLOOKUP($C28,'Dados Gerais'!$D$5:$BK$10,6)","v":0},null,null,18,2]
[null,null,12,{"$f":"HLOOKUP($C29,'Dados Gerais'!$D$5:$BK$10,6)","v":0},null,null,9,2]
[]
[]
[null,null,"VALOR DA HORA EXTRA (DOMINGOS E FERIADOS)",null,"SALÁRIO MÊS","H.ÚTEIS/MÊS","VL.H.NORMAL","VL.H.EXTRA"]
[]
[null,null,11,{"$f":"HLOOKUP($C34,'Dados Gerais'!$D$5:$BK$10,6)","v":0},{"$f":"HLOOKUP($C34,'Dados Gerais'!$D$5:$P$12,8,0)","v":0},{"$f":"HLOOKUP(C34,'Dados Gerais'!$D$5:$P$16,12,0)","v":0},{"$f":"E34/F34","v":{"$error":"#DIV/0!"}},{"$f":"G34*(H28)","v":{"$error":"#DIV/0!"}}]
[null,null,12,{"$f":"HLOOKUP($C35,'Dados Gerais'!$D$5:$BK$10,6)","v":0},{"$f":"HLOOKUP($C35,'Dados Gerais'!$D$5:$P$12,8,0)","v":0},{"$f":"HLOOKUP(C35,'Dados Gerais'!$D$5:$P$16,12,0)","v":0},{"$f":"E35/F35","v":{"$error":"#DIV/0!"}},{"$f":"G35*(H29)","v":{"$error":"#DIV/0!"}}]
[]
[]
[null,null,"RESUMO DO ADICIONAL DE HORA EXTRA"]
[null,null,"TOTAIS MENSAIS",null,"DIAS COMUNS E SÁBADOS","DOMINGOS E FERIADO","PREÇO MENSAL"]
[]
[null,null,11,{"$f":"HLOOKUP($C41,'Dados Gerais'!$D$5:$BK$10,6)","v":0},{"$f":"$G$16*$H$22","v":{"$error":"#DIV/0!"}},{"$f":"$H$34*$G$28","v":{"$error":"#DIV/0!"}},{"$f":"F41+E41","v":{"$error":"#DIV/0!"}}]
[null,null,12,{"$f":"HLOOKUP($C42,'Dados Gerais'!$D$5:$BK$10,6)","v":0},{"$f":"$G$17*$H$23","v":{"$error":"#DIV/0!"}},{"$f":"$H$35*$G$29","v":{"$error":"#DIV/0!"}},{"$f":"F42+E42","v":{"$error":"#DIV/0!"}}]
[]
[null,null,null,null,null,"SOMATÓRIO TOTAL MENSAL",{"$f":"SUM(G41:G42)","v":{"$error":"#DIV/0!"}}]
[null,null,null,null,null,"SOMATÓRIO TOTAL ANUAL",{"$f":"G44*12","v":{"$error":"#DIV/0!"}}]
[]
[]
[null,null,"VALOR DO AUXÍLIO TRANSPORTE (HORA EXTRA)",null,"QTDE PESSOAS","DIAS","VL.AUX.TRANS.","VL.MENSAL"]
[]
[null,null,11,{"$f":"HLOOKUP($C50,'Dados Gerais'!$D$5:$BK$10,6)","v":0},6,2,{"$f":"HLOOKUP($C$50,'Dados Gerais'!$D$5:$O$86,82,FALSE)/HLOOKUP($C$50,'Dados Gerais'!$D$5:$O$17,13,FALSE)","v":{"$error":"#DIV/0!"}},{"$f":"E50*F50*2*G50","v":{"$error":"#DIV/0!"}}]
[null,null,12,{"$f":"HLOOKUP($C51,'Dados Gerais'!$D$5:$BK$10,6)","v":0},3,2,{"$f":"HLOOKUP($C$51,'Dados Gerais'!$D$5:$O$86,82,FALSE)/HLOOKUP($C$51,'Dados Gerais'!$D$5:$O$17,13,FALSE)","v":{"$error":"#DIV/0!"}},{"$f":"E51*F51*2*G51","v":{"$error":"#DIV/0!"}}]
[]
[]
[null,null,"VALOR DO AUXÍLIO ALIMENTAÇÃO (HORA EXTRA)",null,"QTDE PESSOAS","DIAS","VL.AUX.ALIM.","VL.MENSAL"]
[]
[null,null,11,{"$f":"HLOOKUP($C56,'Dados Gerais'!$D$5:$BK$10,6)","v":0},6,{"$f":"F50","v":2},{"$f":"HLOOKUP($C$56,'Dados Gerais'!$D$5:$O$93,89,FALSE)/HLOOKUP($C$56,'Dados Gerais'!$D$5:$O$17,13,FALSE)","v":{"$error":"#NUM!"}},{"$f":"E56*F56*G56","v":{"$error":"#NUM!"}}]
[null,null,12,{"$f":"HLOOKUP($C57,'Dados Gerais'!$D$5:$BK$10,6)","v":0},3,{"$f":"F51","v":2},{"$f":"HLOOKUP($C$57,'Dados Gerais'!$D$5:$O$93,89,FALSE)/HLOOKUP($C$57,'Dados Gerais'!$D$5:$O$17,13,FALSE)","v":{"$error":"#NUM!"}},{"$f":"E57*F57*G57","v":{"$error":"#NUM!"}}]
[]
[]
[null,null,"ENCARGOS SOCIAIS AUXÍLIOS TRANSPORTE E ALIMENTAÇÃO E BDI SOBRE HORA EXTRA"]
[null,null,"TOTAIS MENSAIS",null,null,"PERCENTUAIS","PREÇO MENSAL"]
[]
[null,null,null,"ENCARGOS SOCIAIS",null,{"$f":"'Encargos Sociais'!$E$45","v":0.72009999999999996},{"$f":"F63*G44","v":{"$error":"#DIV/0!"}}]
[null,null,null,"AUXÍLIO TRANSPORTE",null,null,{"$f":"$H$50+$H$51","v":{"$error":"#DIV/0!"}}]
[null,null,null,"AUXÍLIO ALIMENTAÇÃO",null,null,{"$f":"$H$56+$H$57","v":{"$error":"#NUM!"}}]
[null,null,null,"BDI",null,{"$f":"BDI!$E$26","v":0.26939999999999997},{"$f":"F66*(G44+G63+G64+G65)","v":{"$error":"#DIV/0!"}}]
[]
[null,null,null,null,null,"SOMATÓRIO TOTAL MENSAL",{"$f":"SUM(G63:G67)","v":{"$error":"#DIV/0!"}}]
[null,null,null,null,null,"SOMATÓRIO TOTAL ANUAL",{"$f":"G68*12","v":{"$error":"#DIV/0!"}}]
[]
[]
[null,null,"VALOR TOTAL ADICIONAL HORA EXTRA SOB DEMANDA"]
[]
[]
[]
[null,null,null,null,null,"SOMATÓRIO TOTAL MENSAL"]
[null,null,null,null,null,"SOMATÓRIO TOTAL ANUAL",{"$f":"G76*12","v":0}]

{"sheet":"Não Rel - Mat Consumo","index":31,"n_rows":26,"n_cols":14,"rows_kept":26,"cut":false,"hidden":false,"merged":[[1,1,1,4],[2,1,2,13]]}
[]
[]
[null,"MATERIAIS NÃO RELACIONADOS DIRETAMENTE A UM POSTO DE TRABALHO - AQUISIÇÃO SOB DEMANDA"]
[]
[]
[null,null,"ITEM","CÓDIGO","DESCRIÇÃO","QUANT MENSAL","QUANT ANUAL","UNIDADE","CUSTO UNITÁRIO","CUSTO TOTAL","BDI (%)","PREÇO TOTAL","FONTE","REFERÊNCIA"]
[]
[null,null,1,null,"Solução para bateria (água destilada)",1,{"$f":"F8*12","v":12},"Litro",12.945,{"$f":"I8*G8","v":155.34},{"$f":"BDI!E26","v":0.26939999999999997},{"$f":"ROUND(J8*(1+K8),2)","v":197.19},"Cotação"]
[null,null,2,null,"Álcool isopropílico",0.42,{"$f":"F9*12","v":5.04},"Litro",44.7,{"$f":"I9*G9","v":225.28800000000001},{"$f":"K8","v":0.26939999999999997},{"$f":"ROUND(J9*(1+K9),2)","v":285.98},"Cotação"]
[null,null,3,null,"Estopa",2,24,"Kg",23.95,574.79999999999995,{"$f":"K9","v":0.26939999999999997},729.65,"Cotação"]
[null,null,4,null,"Óleo lubrificante",0.42,5.04,"Litro",37.064999999999998,186.80759999999998,0.26939999999999997,237.13,"Cotação"]
[null,null,5,null,"Graxa lubrificante",0.25,3,"Kg",51.195,153.58500000000001,0.26939999999999997,194.96,"Cotação"]
[null,null,6,null,"Querosene",1,12,"900 ml",17.684999999999999,212.21999999999997,0.26939999999999997,269.39,"Cotação"]
[null,null,7,null,"Pincel 1\"",0.25,3,"Peça",9.7366666666666664,29.21,0.26939999999999997,37.08,"Cotação"]
[null,null,8,null,"Rolo de espuma 9 cm",0.25,3,"Peça",10.933333333333332,32.799999999999997,0.26939999999999997,41.64,"Cotação"]
[null,null,9,null,"Esmalte sintético vermelho incêndio",0.3,3.5999999999999996,"Litro",158.24,569.66399999999999,0.26939999999999997,723.13,"Cotação"]
[null,null,10,null,"Esmalte sintético azul",0.3,3.5999999999999996,"Litro",165.745,596.6819999999999,0.26939999999999997,757.43,"Cotação"]
[null,null,11,null,"Esmalte sintético verde",0.3,3.5999999999999996,"Litro",157.78500000000003,568.02600000000007,0.26939999999999997,721.05,"Cotação"]
[null,null,12,null,"Esmalte sintético amarelo",0.3,3.5999999999999996,"Litro",164.08500000000001,590.70600000000002,0.26939999999999997,749.84,"Cotação"]
[null,null,13,null,"WD 40",1,12,"Unidade",34.525000000000006,414.30000000000007,0.26939999999999997,525.91,"Cotação"]
[null,null,14,null,"Fita veda-rosca",0.5,6,"Unidade",14,84,0.26939999999999997,106.63,"Cotação"]
[null,null,15,null,"Spray de fumaça para teste de detectores",1,12,"Lata",93.28,1119.3600000000001,0.26939999999999997,1420.92,"Cotação"]
[null,null,16,null,"Fita isolante 20 metros",0.5,6,"Unidade",8.2149999999999999,49.29,0.26939999999999997,62.57,"Cotação"]
[]
[null,null,null,null,null,null,null,null,null,null,"SOMATÓRIO TOTAL MENSAL",{"$f":"L26/12","v":588.37499999999989}]
[null,null,null,null,null,null,null,null,null,null,"SOMATÓRIO TOTAL ANUAL",{"$f":"SUM(L7:L24)","v":7060.4999999999991}]

{"sheet":"Não Rel - Mat Cons Durável","index":32,"n_rows":43,"n_cols":14,"rows_kept":43,"cut":false,"hidden":true,"merged":[[9,1,9,4],[10,1,10,13]]}
[null,null,"CÂMARA DOS DEPUTADOS"]
[null,null,"DEPARTAMENTO TÉCNICO"]
[null,null,"Coordenação de Planejamento e Gestão"]
[]
[null,null,"Data:",{"$f":"'Dados Gerais'!#REF!","v":{"$error":"#REF!"}}]
[null,null,"Processo:",{"$f":"'Dados Gerais'!#REF!","v":{"$error":"#REF!"}}]
[null,null,"Objeto:",{"$f":"'Dados Gerais'!#REF!","v":{"$error":"#REF!"}}]
[]
[]
[]
[null,"MATERIAIS DE CONSUMO PERMANENTE NÃO RELACIONADOS DIRETAMENTE A UM POSTO DE TRABALHO - AQUISIÇÃO SOB DEMANDA"]
[]
[]
[null,null,"ITEM","CÓDIGO","DESCRIÇÃO","ESTOQUE INICIAL","QUANT ANUAL","UNIDADE","CUSTO UNITÁRIO","CUSTO TOTAL","BDI (%)","PREÇO TOTAL","FONTE","REFERÊNCIA"]
[]
[null,null,1,null,null,null,180,"Unidade",null,{"$f":"I16*G16","v":0},{"$f":"BDI!E26","v":0.26939999999999997},{"$f":"ROUND(J16*(1+K16),2)","v":0},"Cotação"]
[null,null,2,null,null,null,85,"Unidade",null,{"$f":"I17*G17","v":0},{"$f":"K16","v":0.26939999999999997},{"$f":"ROUND(J17*(1+K17),2)","v":0},"Cotação"]
[null,null,3,null,null,null,5,"Unidade",null,0,{"$f":"K17","v":0.26939999999999997},0,"Cotação"]
[null,null,4,null,null,null,200,"Metro",null,0,0.26939999999999997,0,"Cotação"]
[null,null,5,null,null,null,80,"Unidade",null,0,0.26939999999999997,0,"Cotação"]
[null,null,6,null,null,null,18,"Unidade",null,0,0.26939999999999997,0,"Cotação"]
[null,null,7,null,null,null,30,"Unidade",null,0,0.26939999999999997,0,"Cotação"]
[null,null,8,null,null,null,54,"Unidade",null,0,0.26939999999999997,0,"Cotação"]
[null,null,9,null,null,null,15,"Unidade",null,0,0.26939999999999997,0,"Cotação"]
[null,null,10,null,null,null,26,"Unidade",null,0,0.26939999999999997,0,"Cotação"]
[null,null,11,null,null,null,16,"Unidade",null,0,0.26939999999999997,0,"Cotação"]
[null,null,12,null,null,null,120,"Unidade",null,0,0.26939999999999997,0,"Cotação"]
[null,null,13,null,null,null,80,"Unidade",null,0,0.26939999999999997,0,"Cotação"]
[null,null,14,null,null,null,130,"Unidade",null,0,0.26939999999999997,0,"Cotação"]
[null,null,15,null,null,null,54,"Unidade",null,0,0.26939999999999997,0,"Cotação"]
[null,null,16,null,null,null,42,"Unidade",null,0,0.26939999999999997,0,"Cotação"]
[null,null,17,null,null,null,5,"Unidade",null,0,0.26939999999999997,0,"Cotação"]
[null,null,18,null,null,null,5,"Unidade",null,0,0.26939999999999997,0,"Cotação"]
[null,null,19,null,null,null,519,"Unidade",null,0,0.26939999999999997,0,"Cotação"]
[null,null,20,null,null,null,300,"Unidade",null,0,0.26939999999999997,0,"Cotação"]
[null,null,21,null,null,null,337,"Unidade",null,0,0.26939999999999997,0,"Cotação"]
[null,null,22,null,null,null,84,"Unidade",null,0,0.26939999999999997,0,"Cotação"]
[null,null,23,null,null,null,63,"Unidade",null,0,0.26939999999999997,0,"Cotação"]
[null,null,24,null,null,null,137,"Unidade",null,0,0.26939999999999997,0,"Cotação"]
[null,null,25,null,null,null,105,"Unidade",null,0,0.26939999999999997,0,"Cotação"]
[]
[null,null,null,null,null,null,null,null,null,null,"SOMATÓRIO TOTAL MENSAL",{"$f":"L43/12","v":0}]
[null,null,null,null,null,null,null,null,null,null,"SOMATÓRIO TOTAL ANUAL",{"$f":"SUM(L15:L41)","v":0}]

{"sheet":"Não Rel - Peças de rep. sob dem","index":33,"n_rows":100,"n_cols":13,"rows_kept":100,"cut":false,"hidden":false,"merged":[[1,1,1,4],[2,1,2,12]]}
[]
[]
[null,"PEÇAS DE REPOSIÇÃO - AQUISIÇÃO SOB DEMANDA"]
[]
[]
[null,null,"ITEM","CÓDIGO","DESCRIÇÃO","QUANT ANUAL","UNIDADE","CUSTO UNITÁRIO","CUSTO TOTAL","BDI (%)","PREÇO TOTAL","FONTE","REFERÊNCIA"]
[]
[null,null,1,null,"Acionador manual tipo “quebre o vidro” endereçável, para alarme de incêndio, compatível com a central de alarme GlobalFire Junonet – Ezalpha.",2,"Unidade",525.59249999999997,{"$f":"H8*F8","v":1051.1849999999999},{"$f":"BDI!$E$26","v":0.26939999999999997},{"$f":"ROUND(I8*(1+J8),2)","v":1334.37},"Cotação"]
[null,null,2,null,"Acionador manual tipo “quebre o vidro” convencional, para alarme de incêndio.",2,"Unidade",222.27499999999998,{"$f":"H9*F9","v":444.54999999999995},{"$f":"BDI!$E$26","v":0.26939999999999997},{"$f":"ROUND(I9*(1+J9),2)","v":564.30999999999995},"Cotação"]
[null,null,3,null,"Bico de aspiração para forro para detector de aspiração VESDA, ref. E700 SP",5,"Unidade",154.37,771.85,{"$f":"BDI!$E$26","v":0.26939999999999997},979.79,"Cotação"]
[null,null,4,null,"Cartão de 03 laços para central de alarme Global Fire - Ezalpha Trident-Juno-Net, ref. 03 L TRI/ML-NET",1,"Unidade",4895.63,4895.63,{"$f":"BDI!$E$26","v":0.26939999999999997},6214.51,"Cotação"]
[null,null,5,null,"Chave para acionador manual tipo FLAP I, ref. CHAVE AM I",1,"Unidade",24.625,24.625,{"$f":"BDI!$E$26","v":0.26939999999999997},31.26,"Cotação"]
[null,null,6,null,"Controlador de sirene Global Fire – Ezalpha  , ref. LSCM1.",1,"Unidade",604.41750000000002,604.41750000000002,{"$f":"BDI!$E$26","v":0.26939999999999997},767.25,"Cotação"]
[null,null,7,null,"Base para detector óptico de fumaça marca Apolo",10,"Unidade",227.06,2270.6,{"$f":"BDI!$E$26","v":0.26939999999999997},2882.3,"Cotação"]
[null,null,8,null,"Base isoladora para detectores de fumaça marca Apolo",10,"Unidade",234.37333333333333,2343.7333333333336,{"$f":"BDI!$E$26","v":0.26939999999999997},2975.14,"Cotação"]
[null,null,9,null,"Detector de temperatura Apolo  XP95, ref. DTC 55450",5,"Unidade",424.14499999999998,2120.7249999999999,{"$f":"BDI!$E$26","v":0.26939999999999997},2692.05,"Cotação"]
[null,null,10,null,"Detector de temperatura Apolo XPLORER, ref. DTC 59455",5,"Unidade",418.75749999999999,2093.7874999999999,{"$f":"BDI!$E$26","v":0.26939999999999997},2657.85,"Cotação"]
[null,null,11,null,"Detector ótico de fumaça Apolo  XP95, ref. DOT 55650",10,"Unidade",428.39499999999998,4283.95,{"$f":"BDI!$E$26","v":0.26939999999999997},5438.05,"Cotação"]
[null,null,12,null,"Detector ótico de fumaça Apolo XPLORER, ref. DOT 59655",10,"Unidade",490.41499999999996,4904.1499999999996,{"$f":"BDI!$E$26","v":0.26939999999999997},6225.33,"Cotação"]
[null,null,13,null,"Filtro para central de aspiração Vesda, ref. VSP - 005",6,"Unidade",1170.73,7024.38,{"$f":"BDI!$E$26","v":0.26939999999999997},8916.75,"Cotação"]
[null,null,14,null,"Flap para acionador manual de alarme FLAP I, ref.  FLAP P/ AM I ",1,"Unidade",51.505000000000003,51.505000000000003,{"$f":"BDI!$E$26","v":0.26939999999999997},65.38,"Cotação"]
[null,null,15,null,"Fonte de alimentação 24V cc 1,7 Amperes, ref. PSU 1,7 A",1,"Unidade",399.4666666666667,399.4666666666667,{"$f":"BDI!$E$26","v":0.26939999999999997},507.08,"Cotação"]
[null,null,16,null,"Fonte de alimentação 24V cc  2,4 Amperes ref. PSU 2,4 A",1,"Unidade",462.28499999999997,{"$f":"H23*F23","v":462.28499999999997},{"$f":"BDI!$E$26","v":0.26939999999999997},586.82000000000005,"Cotação"]
[null,null,17,null,"Fonte de alimentação 24V cc 5,0 Amperes, ref. PSU 5,0 A",1,"Unidade",527.05500000000006,527.05500000000006,{"$f":"BDI!$E$26","v":0.26939999999999997},669.04,"Cotação"]
[null,null,18,null,"Fonte de alimentação 24V cc 7,5 Amperes, ref. PSU 7,5 A",1,"Unidade",776.95499999999993,776.95499999999993,{"$f":"BDI!$E$26","v":0.26939999999999997},986.27,"Cotação"]
[null,null,19,null,"Fonte de alimentação 24V 5A  tipo NOBREAK com saída para carga de bateria",1,"Unidade",1298.175,1298.175,{"$f":"BDI!$E$26","v":0.26939999999999997},1647.9,"Cotação"]
[null,null,20,null,"Fonte de alimentação para central de alarme GFE",1,"Unidade",765,765,{"$f":"BDI!$E$26","v":0.26939999999999997},971.09,"Cotação"]
[null,null,21,null,"Sirene audio visual - com XENON ( 2 tons ), ref. FLASHNI marca de ref. Fulleon technology.",2,"Unidade",472.66666666666669,945.33333333333337,{"$f":"BDI!$E$26","v":0.26939999999999997},1200.01,"Cotação"]
[null,null,22,null,"Indicador luminoso, com LEDs, ref. IVI II -XB 24- LED",1,"Unidade",28.4,28.4,{"$f":"BDI!$E$26","v":0.26939999999999997},36.049999999999997,"Cotação"]
[null,null,23,null,"Indicador luminoso, flash, lamp xenon, ref.  IVI II -XB 24",1,"Unidade",379.66499999999996,379.66499999999996,{"$f":"BDI!$E$26","v":0.26939999999999997},481.95,"Cotação"]
[null,null,24,null,"Unidade Input / Output XP95, marca de ref Apolo",1,"Unidade",587.88666666666666,587.88666666666666,{"$f":"BDI!$E$26","v":0.26939999999999997},746.26,"Cotação"]
[null,null,25,null,"Unidade Input/Output endereçável , marca de ref. Global Fire GFE",1,"Unidade",265.87333333333333,265.87333333333333,{"$f":"BDI!$E$26","v":0.26939999999999997},337.5,"Cotação"]
[null,null,26,null,"Interface -ADV-COMS-TCP-IP, ref. ADV-COMS-TCP-IP",1,"Unidade",4243.2749999999996,{"$f":"H33*F33","v":4243.2749999999996},{"$f":"BDI!$E$26","v":0.26939999999999997},{"$f":"ROUND(I33*(1+J33),2)","v":5386.41},"Cotação"]
[null,null,27,null,"Interface painel --- repetidor-RS 485, ref.  J-NET-INT-485-REP",0.5,"Unidade",1316.7733333333333,658.38666666666666,{"$f":"BDI!$E$26","v":0.26939999999999997},835.76,"Cotação"]
[null,null,28,null,"Interface painel --- sub painel-RS 485, ref.  J-NET-INT-485",0.5,"Unidade",1825.5666666666666,912.7833333333333,{"$f":"BDI!$E$26","v":0.26939999999999997},1158.69,"Cotação"]
[null,null,29,null,"Interface para fibra ótica, ref. J-NET-INT-FO",0.5,"Unidade",2478.87,1239.4349999999999,{"$f":"BDI!$E$26","v":0.26939999999999997},1573.34,"Cotação"]
[null,null,30,null,"Interface-ADV-COMS-FO, ref. J-NET marca de ref. Global Fire",0.5,"Unidade",2636.2033333333334,1318.1016666666667,{"$f":"BDI!$E$26","v":0.26939999999999997},1673.2,"Cotação"]
[null,null,31,null,"Interface-ADV-COMS-RS 485, ref. J-NET marca de ref. Global fire",0.5,"Unidade",1300.21,650.10500000000002,{"$f":"BDI!$E$26","v":0.26939999999999997},825.24,"Cotação"]
[null,null,32,null,"Interface/ Data Loop TCP-IP, ref. J-NET-INT-TCP-IP  marca de ref. GFE",1,"Unidade",4090.1933333333341,4090.1933333333341,{"$f":"BDI!$E$26","v":0.26939999999999997},5192.09,"Cotação"]
[null,null,33,null,"Isolador XPLORER, ref. ISO 59700, marca de ref. Apolo",1,"Unidade",247.73500000000001,247.73500000000001,{"$f":"BDI!$E$26","v":0.26939999999999997},314.47000000000003,"Cotação"]
[null,null,34,null,"Juno Net SIM CARD (TODOS ), ref. SIM CARD para central de alarme GFE marca ref. Global Fire",1,"Unidade",190.04000000000002,190.04000000000002,{"$f":"BDI!$E$26","v":0.26939999999999997},241.24,"Cotação"]
[null,null,35,null,"Mini Switch Monitor XP 95, ref. MMSU 55833 marca de ref. Apolo",1,"Unidade",474.36,474.36,{"$f":"BDI!$E$26","v":0.26939999999999997},602.15,"Cotação"]
[null,null,36,null,"Placa 08 saídas relé, s/supervisão p/ net e junior , ref. J-NET-MPX-REL",1,"Unidade",619.93333333333339,619.93333333333339,{"$f":"BDI!$E$26","v":0.26939999999999997},786.94,"Cotação"]
[null,null,37,null,"Retentor magnético convencional 24V para porta corta fogo",1,"Unidade",523.73500000000001,523.73500000000001,{"$f":"BDI!$E$26","v":0.26939999999999997},664.83,"Cotação"]
[null,null,38,null,"Detector Multisensor série XP95 Apolo",1,"Unidade",403.76,403.76,{"$f":"BDI!$E$26","v":0.26939999999999997},512.53,"Cotação"]
[null,null,39,null,"Placa endereçável para sirene convencional",1,"Unidade",638.38,638.38,{"$f":"BDI!$E$26","v":0.26939999999999997},810.36,"Cotação"]
[null,null,40,null,"Detector termovelocimétrico ZEOS da GFE",1,"Unidade",331.39499999999998,331.39499999999998,{"$f":"BDI!$E$26","v":0.26939999999999997},420.67,"Cotação"]
[null,null,41,null,"Detector de fumaça  endereçável ZEOS da GFE",1,"Unidade",331.39499999999998,331.39499999999998,{"$f":"BDI!$E$26","v":0.26939999999999997},420.67,"Cotação"]
[null,null,42,null,"Placa de conexão (conector board), ref.  J-NET-COM",1,"Unidade",1446.8274999999999,1446.8274999999999,{"$f":"BDI!$E$26","v":0.26939999999999997},1836.6,"Cotação"]
[null,null,43,null,"Placa Loop Conector,ref.  J-NET-LP-COM",1,"Unidade",4974.08,4974.08,{"$f":"BDI!$E$26","v":0.26939999999999997},6314.1,"Cotação"]
[null,null,44,null,"Placa mãe Trident ML-Net, ref. J-EXP-MB",0.5,"Unidade",5550.6550000000007,2775.3275000000003,{"$f":"BDI!$E$26","v":0.26939999999999997},3523,"Cotação"]
[null,null,45,null,"Placa mãe Trident-Net, ref. J-NET-MB+",0.5,"Unidade",10498.59,5249.2950000000001,{"$f":"BDI!$E$26","v":0.26939999999999997},6663.46,"Cotação"]
[null,null,46,null,"SIMM CARD J-NET para central Global Fire",1,"Unidade",238.41500000000002,238.41500000000002,{"$f":"BDI!$E$26","v":0.26939999999999997},302.64,"Cotação"]
[null,null,47,null,"Sirene Convencional Vulcan c/ 04 tons, ref. VULCAN - CONV",4,"Unidade",246.02499999999998,984.09999999999991,{"$f":"BDI!$E$26","v":0.26939999999999997},1249.22,"Cotação"]
[null,null,48,null,"Sirene eletrônica 06 tons 105 db/mt, ref. ROSHNI-SRV /EZA/06",1,"Unidade",324.94499999999999,324.94499999999999,{"$f":"BDI!$E$26","v":0.26939999999999997},412.49,"Cotação"]
[null,null,49,null,"Sirene Endereçável Vulcan, ref. VULCAN - END",4,"Unidade",383.88499999999999,1535.54,{"$f":"BDI!$E$26","v":0.26939999999999997},1949.21,"Cotação"]
[null,null,50,null,"Sub-Painel -Trid-Juno-Net -c/ 01laço (só placas), ref. J-NET-SP-001-AS",0.5,"Unidade",4563.0200000000004,2281.5100000000002,{"$f":"BDI!$E$26","v":0.26939999999999997},2896.15,"Cotação"]
[null,null,51,null,"Sub-Painel -Trid-Juno-Net -c/ 03laços(só placas), ref.  J-NET-SP-003-AS",0.5,"Unidade",7356.623333333333,3678.3116666666665,{"$f":"BDI!$E$26","v":0.26939999999999997},4669.25,"Cotação"]
[null,null,52,null,"Sub-Painel com 01 laço p/ JN 2,4,5,7,8,10,13 L , ref. J-NET-COM-SP01",0.5,"Unidade",4562.7733333333335,{"$f":"H59*F59","v":2281.3866666666668},{"$f":"BDI!$E$26","v":0.26939999999999997},{"$f":"ROUND(I59*(1+J59),2)","v":2895.99},"Cotação"]
[null,null,53,null,"Sensor Reed switch ",1,"Unidade",1.7000000000000002,1.7000000000000002,{"$f":"BDI!$E$26","v":0.26939999999999997},2.16,"Cotação"]
[null,null,54,null,"Lâmpada de sinalização para quadros elétricos",1,"Unidade",10.324999999999999,10.324999999999999,{"$f":"BDI!$E$26","v":0.26939999999999997},13.11,"Cotação"]
[null,null,55,null,"Bateria selada recarregável 12V 7Ah",20,"Unidade",108.7,2174,{"$f":"BDI!$E$26","v":0.26939999999999997},2759.68,"Cotação"]
[null,null,56,null,"Bateria selada recarregável 12V 9Ah",6,"Unidade",155.10500000000002,930.63000000000011,{"$f":"BDI!$E$26","v":0.26939999999999997},1181.3399999999999,"Cotação"]
[null,null,57,null,"Bico de sprinkler ½”",10,"Unidade",50.15,{"$f":"H64*F64","v":501.5},{"$f":"BDI!$E$26","v":0.26939999999999997},{"$f":"ROUND(I64*(1+J64),2)","v":636.6},"Cotação"]
[null,null,58,null,"Vidro para reposição de acionadores manuais",10,"Unidade",14.75,147.5,{"$f":"BDI!$E$26","v":0.26939999999999997},187.24,"Cotação"]
[null,null,59,null,"Manômetro com escala 1 a 10Kg/cm2",2,"Unidade",154.01499999999999,308.02999999999997,{"$f":"BDI!$E$26","v":0.26939999999999997},391.01,"Cotação"]
[null,null,60,null,"Eletroduto metálico flexível ¾” revestido em PCV cor  vermelha ou cinza.",50,"Metro",8.7600000000000016,438.00000000000006,{"$f":"BDI!$E$26","v":0.26939999999999997},556,"Cotação"]
[null,null,61,null,"Condulete de alumínio tipo caixa de ligação redonda diâmetro de 87mm  entradas de  ¾” ",20,"Unidade",38.905000000000001,778.1,{"$f":"BDI!$E$26","v":0.26939999999999997},987.72,"Cotação"]
[null,null,62,null,"Abraçadeira tipo copo de 1’",30,"Unidade ",2.8899999999999997,86.699999999999989,{"$f":"BDI!$E$26","v":0.26939999999999997},110.06,"Cotação"]
[null,null,63,null,"Abraçadeira tipo copo de ¾ ",40,"Unidade",3.145,125.8,{"$f":"BDI!$E$26","v":0.26939999999999997},159.69,"Cotação"]
[null,null,64,null,"Conector  para condulete ¾”  1 lado com rosca e o lado do Eletroduto liso.",40,"Unidade",4.335,173.4,{"$f":"BDI!$E$26","v":0.26939999999999997},220.11,"Cotação"]
[null,null,65,null,"Fio paralelo branco 2x0,5mm",50,"Metro",1.9550000000000001,97.75,{"$f":"BDI!$E$26","v":0.26939999999999997},124.08,"Cotação"]
[null,null,66,null,"Fio paralelo polarizado preto e vermelho 2x1,5mm",50,"Metro",4.8049999999999997,240.25,{"$f":"BDI!$E$26","v":0.26939999999999997},304.97000000000003,"Cotação"]
[null,null,67,null,"Tampa cega redonda de alumínio para caixa tipo condulete redonda de 87mm.",10,"Unidade",14.4,144,{"$f":"BDI!$E$26","v":0.26939999999999997},182.79,"Cotação"]
[null,null,68,null,"Cabo de instrumentação para sistema de alarme de incêndio 2x1,5mm com capa externa na cor vermelha",200,"Metro",9.004999999999999,1800.9999999999998,{"$f":"BDI!$E$26","v":0.26939999999999997},2286.19,"Cotação"]
[null,null,69,null,"Cabo de instrumentação para sistema de alarme de incêndio 2x2,5mm com capa externa na cor vermelha",100,"Metro",14.91,1491,{"$f":"BDI!$E$26","v":0.26939999999999997},1892.68,"Cotação"]
[null,null,70,null,"Cabeça de disparo completa para cilindro de FM-200",0.5,"Unidade",3055.25,1527.625,{"$f":"BDI!$E$26","v":0.26939999999999997},1939.17,"Cotação"]
[null,null,71,null,"Cabeça de comando elétrico para cilindro de CO2 de 45 Kg",0.5,"Unidade",788.5,394.25,{"$f":"BDI!$E$26","v":0.26939999999999997},500.46,"Cotação"]
[null,null,72,null,"Cabeça de discarga para cilindor de CO2 de 45Kg",1,"Unidade",788.5,788.5,{"$f":"BDI!$E$26","v":0.26939999999999997},1000.92,"Cotação"]
[null,null,73,null,"Miolo para reparo de válvula de disparo rápido para extintor de CO2.",10,"Unidade",59.894999999999996,598.94999999999993,{"$f":"BDI!$E$26","v":0.26939999999999997},760.31,"Cotação"]
[null,null,74,null,"Mini contactor WEG 7A 24V ",1,"Unidade",82.25,82.25,{"$f":"BDI!$E$26","v":0.26939999999999997},104.41,"Cotação"]
[null,null,75,null,"Chave de fluxo com retardo pneumático regulável de 0 a 70 seg., pressão de trabalho máxima de 10 Kgf/cm2",1,"Unidade",536.25,536.25,{"$f":"BDI!$E$26","v":0.26939999999999997},680.72,"Cotação"]
[null,null,76,null,"Mangueira de incêndio 38mm 15 metros com engate tipo storz 2 ½” tipo 2",4,"Unidade",559.85,2239.4,{"$f":"BDI!$E$26","v":0.26939999999999997},2842.69,"Cotação"]
[null,null,77,null,"Esguicho para mangueira de incêndio tipo regulável com engate tipo storz 2 1/2”. ",5,"Unidade",198.62,993.1,{"$f":"BDI!$E$26","v":0.26939999999999997},1260.6400000000001,"Cotação"]
[null,null,78,null,"Chuveiro automático sprinckles 68 graus de ¾’",10,"Unidade",50.16,501.59999999999997,{"$f":"BDI!$E$26","v":0.26939999999999997},636.73,"Cotação"]
[null,null,79,null,"Registro tipo  GLOBO 2½\" 45 para hidrante de incêndio",10,"Unidade",223.82999999999998,2238.2999999999997,{"$f":"BDI!$E$26","v":0.26939999999999997},2841.3,"Cotação"]
[null,null,80,null,"Válvula de retenção dupla portinhola 2",2,"Unidade",342.65,685.3,{"$f":"BDI!$E$26","v":0.26939999999999997},869.92,"Cotação"]
[null,null,81,null,"Adaptador Tipo Storz De 1.1/2 X 2.1/2pol para registro de incêndio",10,"Unidade",56.85,568.5,{"$f":"BDI!$E$26","v":0.26939999999999997},721.65,"Cotação"]
[null,null,82,null,"Adaptador tipo storz de 2.1/2 X 2.1/2pol para registro de incêndio",10,"Unidade",74.655000000000001,746.55,{"$f":"BDI!$E$26","v":0.26939999999999997},947.67,"Cotação"]
[null,null,83,null,"Pressostato com escala indicadora de pressão e diferencial, ref. L- 404 F 1102, marca Honeywell",3,"Unidade",2264.1849999999999,6792.5550000000003,{"$f":"BDI!$E$26","v":0.26939999999999997},8622.4699999999993,"Cotação"]
[null,null,84,null,"Disjuntor para Motor 50A 50KA 415V modelo ref.: GV3L50 marca de  ref. Schneider",2,"Unidade",1334.17,2668.34,{"$f":"BDI!$E$26","v":0.26939999999999997},3387.19,"Cotação"]
[null,null,85,null,"Disjuntor Magnético 32A  modelo ref. GV2LE32 marca de  ref. Schneider.",2,"Unidade",905.64499999999998,1811.29,{"$f":"BDI!$E$26","v":0.26939999999999997},2299.25,"Cotação"]
[null,null,86,null,"Disjuntor Magnético 10A  modelo ref. GV2LE32 marca de  ref. Schneider.",2,"Unidade",434.77499999999998,869.55,{"$f":"BDI!$E$26","v":0.26939999999999997},1103.81,"Cotação"]
[null,null,87,null,"Contator Trip. Tesys D Everlin 220V modelo de ref. LC1D40A marca de  ref. Schneider.",2,"Unidade",507.82,1015.64,{"$f":"BDI!$E$26","v":0.26939999999999997},1289.25,"Cotação"]
[null,null,88,null,"Contator Trip. Tesys D 18A 220V modelo de ref. LC1D18 marca de  ref. Schneider.",2,"Unidade",251.995,503.99,{"$f":"BDI!$E$26","v":0.26939999999999997},639.76,"Cotação"]
[null,null,89,null,"Bloco de Contato 3NA+1NF Frontal modelo de ref. LAND31 marca de ref. Schneider.",2,"Unidade",96.58,193.16,{"$f":"BDI!$E$26","v":0.26939999999999997},245.2,"Cotação"]
[null,null,90,null,"Tempor. 0,3s–30s 1NA/NF 110-240v modelo de ref. RE8TA31BU marca de  ref. Schneider. ",2,"Unidade",222.67333333333332,445.34666666666664,{"$f":"BDI!$E$26","v":0.26939999999999997},565.32000000000005,"Cotação"]
[]
[null,null,null,null,null,null,null,null,null,"SOMATÓRIO TOTAL MENSAL",{"$f":"K100/12","v":12441.606666666672}]
[null,null,null,null,null,null,null,null,null,"SOMATÓRIO TOTAL ANUAL",{"$f":"SUM(K7:K98)","v":149299.28000000006}]

{"sheet":"Não Rel - Serviços","index":34,"n_rows":25,"n_cols":13,"rows_kept":25,"cut":false,"hidden":false,"merged":[[1,1,1,4],[2,1,2,12]]}
[]
[]
[null,"SERVIÇOS NÃO RELACIONADOS DIRETAMENTE A UM POSTO DE TRABALHO - AQUISIÇÃO SOB DEMANDA"]
[]
[]
[null,null,"ITEM","CÓDIGO","DESCRIÇÃO","QUANT ANUAL","UNIDADE","CUSTO UNITÁRIO","CUSTO TOTAL","BDI (%)","PREÇO TOTAL","FONTE","REFERÊNCIA"]
[]
[null,null,1,null,"Conserto de motor de 10 até 20 CV, 380V trifásico, incluindo rebobinamento, troca de rolamentos  e confecção, substituição de bucha, ventoinhas,  serviço de torno e enchimento das tampas.",1,"Unidade",3675.1925000000001,{"$f":"H8*F8","v":3675.1925000000001},{"$f":"BDI!$E$26","v":0.26939999999999997},{"$f":"ROUND(I8*(1+J8),2)","v":4665.29},"Cotação"]
[null,null,2,null,"Conserto de motor de 3 até 10 CV, 380V trifásico, incluindo rebobinamento, troca de rolamentos  e confecção, substituição de bucha, ventoinhas,  serviço de torno e enchimento das tampas.",1,"Unidade",2371.9349999999999,2371.9349999999999,{"$f":"BDI!$E$26","v":0.26939999999999997},3010.93,"Cotação"]
[null,null,3,null,"Conserto de motor até 3 CV, 380V trifásico, incluindo rebobinamento, troca de rolamentos  e confecção, substituição de bucha, ventoinhas,  serviço de torno e enchimento das tampas.",2,"Unidade",1022.3,2044.6,{"$f":"BDI!$E$26","v":0.26939999999999997},2595.42,"Cotação"]
[null,null,4,null,"Conserto de bomba de incêndio tipo jockey, acionadas por motores de até 3CV, incluindo troca de selo mecânico, gaxetas, soldas, rolamentos, acoplamentos, serviços de torno e embuchamento (não inclui o serviço do motor elétrico).",1,"Unidade",489.48,489.48,{"$f":"BDI!$E$26","v":0.26939999999999997},621.35,"Cotação"]
[null,null,5,null,"Conserto de bomba de incêndio para sistemas de sprinkles e hidrantes, acionadas por motores  de 10 a 20CV, incluindo troca de selo mecânico, gaxetas, soldas, rolamentos, acoplamentos, serviços de torno e embuchamento (não inclui o serviço do motor elétrico).",1,"Unidade",1849.06,1849.06,{"$f":"BDI!$E$26","v":0.26939999999999997},2347.1999999999998,"Cotação"]
[null,null,6,null,"Rebobinamento de motor de 10 até 20 CV, 380V trifásico.",2,"Unidade",2205.1154999999999,4410.2309999999998,{"$f":"BDI!$E$26","v":0.26939999999999997},5598.35,"Cotação"]
[null,null,7,null,"Rebobinamento de motor de 3 até 10 CV, 380V trifásico.",2,"Unidade",1423.1609999999998,2846.3219999999997,{"$f":"BDI!$E$26","v":0.26939999999999997},3613.12,"Cotação"]
[null,null,8,null,"Rebobinamento de motor até 3 CV, 380V trifásico.",2,"Unidade",613.38,1226.76,{"$f":"BDI!$E$26","v":0.26939999999999997},1557.25,"Cotação"]
[null,null,9,null,"Serviço de recarga de extintor de CO2 (preço por Kilo de gás)",1800,"Kg",10,18000,{"$f":"BDI!$E$26","v":0.26939999999999997},22849.200000000001,"Cotação"]
[null,null,10,null,"Teste hidrostático em cilindro de CO2 6kg Com reparos ",30,"Unidade ",9.9,297,{"$f":"BDI!$E$26","v":0.26939999999999997},377.01,"Cotação"]
[null,null,11,null,"Teste hidrostático em cilindro de CO2 25Kg com reparos",5,"Unidade",41.25,206.25,{"$f":"BDI!$E$26","v":0.26939999999999997},261.81,"Cotação"]
[null,null,12,null,"Teste hidrostático em cilindro de CO2 45KG com reparos",100,"Unidade",170,17000,{"$f":"BDI!$E$26","v":0.26939999999999997},21579.8,"Cotação"]
[null,null,13,null,"Recarga em cilindro de gás FM200 (preço por kilo de gás) ",500,"Kg",167,83500,{"$f":"BDI!$E$26","v":0.26939999999999997},105994.9,"Cotação"]
[null,null,14,null,"Teste hidrostático em cilindro de gás FM200 incluindo o envase do gás, transporte e frete rodoviário (considerar cilindro de 50Kg)",5,"Unidade",8350,41750,{"$f":"BDI!$E$26","v":0.26939999999999997},52997.45,"Cotação"]
[null,null,15,null,"Visita de técnico especializado do fabricante central de alarme.",2,"Unidade",329.6,659.2,{"$f":"BDI!$E$26","v":0.26939999999999997},836.79,"Cotação"]
[]
[null,null,null,null,null,null,null,null,null,"SOMATÓRIO TOTAL MENSAL",{"$f":"K25/12","v":19075.48916666667}]
[null,null,null,null,null,null,null,null,null,"SOMATÓRIO TOTAL ANUAL",{"$f":"SUM(K7:K23)","v":228905.87000000002}]