{"text_format":"1","workbook":"xlsx","n_sheets":20,"sheets":["GUIA PARA PREENCHIMENTO","MODELO PROPOSTA","Remunerações","Resumo","1","2","3","4","5","6","7","8","9","Dados Gerais","Encargos Sociais","BDI - Geral","Uniformes","EPI","SREP","Not. Demanda"],"not_rendered":{"charts":0,"images":1,"macros":1,"external_links":0,"defined_names":56,"comments":0,"pivot_tables":0},"unopened":[],"bounds":{"document_bytes":16777216,"sheet_cells":100000,"rows_first":2000,"rows_last":500,"rows_between":2000,"halvings":0,"cell_chars":16384,"cell_head_chars":4096},"cells_cut":0,"cells_raw":0,"read":"whole","date_system":"1900"}

{"sheet":"GUIA PARA PREENCHIMENTO","index":0,"n_rows":5,"n_cols":1,"rows_kept":5,"cut":false,"hidden":false,"merged":[]}
["GUIA PARA PREENCHIMENTO"]
[]
["1 - Preencher apenas as guias azuis:"]
[]
["2 - Recomendamos preencher somente as células com fundo azul claro. As demais possuem fórmulas e sugerimos não alterá-las."]

{"sheet":"MODELO PROPOSTA","index":1,"n_rows":53,"n_cols":2,"rows_kept":53,"cut":false,"hidden":false,"merged":[[26,1,26,4],[26,5,26,9],[27,1,27,4],[9,1,9,9],[1,1,1,9],[4,1,4,9],[6,1,6,9],[7,1,7,9],[8,1,8,9],[25,1,25,4],[25,5,25,9],[10,1,10,9],[11,1,11,9],[12,1,12,9],[14,1,14,9],[15,1,15,9],[17,1,18,9],[19,1,19,9],[21,1,21,9],[22,1,22,9],[23,1,23,9],[27,5,27,9],[28,1,28,4],[28,5,28,9],[42,1,42,4],[42,5,42,9],[29,1,29,4],[29,5,29,9],[30,1,30,4],[30,5,30,9],[31,1,31,4],[31,5,31,9],[33,0,33,9],[32,0,32,9],[34,0,34,9],[35,0,35,9],[36,0,36,9],[37,0,37,9],[40,1,40,9],[41,1,41,4],[47,1,47,9],[48,1,48,9],[41,5,41,9],[49,1,49,9],[52,1,52,9],[43,1,43,4],[43,5,43,9],[44,1,44,9]]}
[]
[null,"MODELO DA PROPOSTA COMPLETA"]
[]
[null,"."]
[null,"I – FORMALIZAÇÃO"]
[]
[null,"PREGÃO ELETRÔNICO N. 18/22"]
[null,"OBJETO: Prestação de serviços continuados na área de operação de equipamentos de áudio, vídeo e geração de imagens para transmissão ao vivo por rádio, televisão e internet, pelo período de trinta meses."]
{"$rows_left_out":46}
{"sheet":"Remunerações","index":2,"n_rows":15,"n_cols":13,"rows_kept":15,"cut":false,"hidden":false,"merged":[[0,1,0,10]]}
[null,"QUADRO DE REMUNERAÇÕES"]
[]
[null,null,"ITEM","POSTO DE TRABALHO","QUANTIDADE","SALÁRIO","ADICIONAL DE PERICULOSIDADE","ADICIONAL DE INSALUBRIDADE","ADICIONAL NOTURNO","OUTROS","SALÁRIO COM ADICIONAIS"]
[null,null,null,"POSTO DE TRABALHO - EQUIPE DE TRABALHO"]
[null,null,1,{"$f":"HLOOKUP($C5,'Dados Gerais'!$D$6:$O$68,6)","v":"SUPERVISOR TÉCNICO OPERACIONAL"},{"$f":"HLOOKUP($C5,'Dados Gerais'!$D$6:$O$68,10)","v":2},{"$f":"HLOOKUP($C5,'Dados Gerais'!$D$6:$O$68,8)","v":12954.17},{"$f":"HLOOKUP($C5,'Dados Gerais'!$D$6:$O$68,25)","v":0},{"$f":"HLOOKUP($C5,'Dados Gerais'!$D$6:$O$68,31)","v":0},{"$f":"HLOOKUP($C5,'Dados Gerais'!$D$6:$O$68,46)","v":0},{"$f":"HLOOKUP($C5,'Dados Gerais'!$D$6:$O$68,33)","v":0},{"$f":"SUM(F5:J5)","v":12954.17},null,{"$f":"E5*K5","v":25908.34}]
[null,null,2,{"$f":"HLOOKUP($C6,'Dados Gerais'!$D$6:$O$68,6)","v":"SUPERVISOR TÉCNICO"},{"$f":"HLOOKUP($C6,'Dados Gerais'!$D$6:$O$68,10)","v":3},{"$f":"HLOOKUP($C6,'Dados Gerais'!$D$6:$O$68,8)","v":9252.98},{"$f":"HLOOKUP($C6,'Dados Gerais'!$D$6:$O$68,25)","v":0},{"$f":"HLOOKUP($C6,'Dados Gerais'!$D$6:$O$68,31)","v":0},{"$f":"HLOOKUP($C6,'Dados Gerais'!$D$6:$O$68,46)","v":0},{"$f":"HLOOKUP($C6,'Dados Gerais'!$D$6:$O$68,33)","v":0},{"$f":"SUM(F6:J6)","v":9252.98},null,{"$f":"E6*K6","v":27758.94}]
[null,null,3,{"$f":"HLOOKUP($C7,'Dados Gerais'!$D$6:$O$68,6)","v":"SUPERVISOR OPERACIONAL"},{"$f":"HLOOKUP($C7,'Dados Gerais'!$D$6:$O$68,10)","v":2},{"$f":"HLOOKUP($C7,'Dados Gerais'!$D$6:$O$68,8)","v":8894.19},{"$f":"HLOOKUP($C7,'Dados Gerais'!$D$6:$O$68,25)","v":0},{"$f":"HLOOKUP($C7,'Dados Gerais'!$D$6:$O$68,31)","v":0},{"$f":"HLOOKUP($C7,'Dados Gerais'!$D$6:$O$68,46)","v":0},{"$f":"HLOOKUP($C7,'Dados Gerais'!$D$6:$O$68,33)","v":0},8894.19,null,17788.38]
[null,null,4,{"$f":"HLOOKUP($C8,'Dados Gerais'!$D$6:$O$68,6)","v":" DIRETOR DE IMAGENS – 30H"},{"$f":"HLOOKUP($C8,'Dados Gerais'!$D$6:$O$68,10)","v":24},{"$f":"HLOOKUP($C8,'Dados Gerais'!$D$6:$O$68,8)","v":5845.04},{"$f":"HLOOKUP($C8,'Dados Gerais'!$D$6:$O$68,25)","v":0},{"$f":"HLOOKUP($C8,'Dados Gerais'!$D$6:$O$68,31)","v":0},{"$f":"HLOOKUP($C8,'Dados Gerais'!$D$6:$O$68,46)","v":0},{"$f":"HLOOKUP($C8,'Dados Gerais'!$D$6:$O$68,33)","v":0},5845.04,null,140280.95999999999]
{"$rows_left_out":8}
{"sheet":"Resumo","index":3,"n_rows":79,"n_cols":11,"rows_kept":79,"cut":false,"hidden":false,"merged":[[65,3,65,7],[2,1,2,8],[19,1,19,8],[36,1,36,8],[56,1,56,8],[70,10,71,18],[74,10,75,18],[78,10,79,18],[72,3,72,7],[76,3,76,7]]}
[]
[]
[null,"RESUMO  - TOTAIS MENSAIS - FATURA ORDINÁRIA (SEM O 13º E SEM OS ITENS SOB DEMANDA)"]
[]
[]
[null,null,"ITEM","POSTO DE TRABALHO","QUANTIDADE","PREÇO UNIT       (SEM O 13º)","DESTAQUE DO 13º","PREÇO POR EMPREGADO","PREÇO TOTAL (MENSAL)"]
[null,null,1,{"$f":"HLOOKUP(C7,'Dados Gerais'!$D$6:$L$11,6)","v":"SUPERVISOR TÉCNICO OPERACIONAL"},{"$f":"'Dados Gerais'!D$15","v":2},{"$f":"'1'!$E$115","v":24492.723823999997},0,{"$f":"G7+F7","v":24492.723823999997},{"$f":"H7*E7","v":48985.447647999994}]
[null,null,2,{"$f":"HLOOKUP(C8,'Dados Gerais'!$D$6:$L$11,6)","v":"SUPERVISOR TÉCNICO"},{"$f":"'Dados Gerais'!E$15","v":3},{"$f":"'2'!$E$115","v":17886.989215999998},0,17886.989215999998,53660.967647999991]
{"$rows_left_out":72}
{"sheet":"1","index":4,"n_rows":118,"n_cols":8,"rows_kept":118,"cut":false,"hidden":false,"merged":[[17,1,17,3],[1,1,1,5],[2,1,2,5],[4,1,4,2],[5,1,5,2],[7,1,7,3],[106,1,106,3],[39,3,39,5],[46,1,46,3],[56,1,56,3],[68,3,68,5],[74,1,74,3],[83,1,83,3]]}
[]
[null,"PLANILHA DE ESTIMATIVA DE CUSTOS"]
[null,"Padrão IN 05/2017 e IN 07/2018 - MPDG"]
[]
[null,1,null,{"$f":"HLOOKUP($B$5,'Dados Gerais'!$D$6:$L$22,6)","v":"SUPERVISOR TÉCNICO OPERACIONAL"},"QUANTIDADE",{"$f":"HLOOKUP($B$5,'Dados Gerais'!$D$6:$L$22,10)","v":2}]
[null,"CCT",null,{"$f":"HLOOKUP($B$5,'Dados Gerais'!$D$6:$L$22,16)","v":"SINRAD/DF x SEAC/DF\nCCT 2022/2022\nN.º DF000077/2022"},"DATA-BASE",{"$f":"HLOOKUP($B$5,'Dados Gerais'!$D$6:$L$22,17)","v":"2022-01-01"}]
[]
[null,"MÓDULO 1 - COMPOSIÇÃO DA REMUNERAÇÃO",null,null,null,"Valor"]
{"$rows_left_out":111}
{"sheet":"2","index":5,"n_rows":118,"n_cols":8,"rows_kept":118,"cut":false,"hidden":false,"merged":[[17,1,17,3],[1,1,1,5],[2,1,2,5],[4,1,4,2],[5,1,5,2],[7,1,7,3],[106,1,106,3],[39,3,39,5],[46,1,46,3],[56,1,56,3],[68,3,68,5],[74,1,74,3],[83,1,83,3]]}
[]
[null,"PLANILHA DE ESTIMATIVA DE CUSTOS"]
[null,"Padrão IN 05/2017 e IN 07/2018 - MPDG"]
[]
[null,2,null,{"$f":"HLOOKUP($B$5,'Dados Gerais'!$D$6:$L$22,6)","v":"SUPERVISOR TÉCNICO"},"QUANTIDADE",{"$f":"HLOOKUP($B$5,'Dados Gerais'!$D$6:$L$22,10)","v":3}]
[null,"CCT",null,{"$f":"HLOOKUP($B$5,'Dados Gerais'!$D$6:$L$22,16)","v":"SINRAD/DF x SEAC/DF\nCCT 2022/2022\nN.º DF000077/2022"},"DATA-BASE",{"$f":"HLOOKUP($B$5,'Dados Gerais'!$D$6:$L$22,17)","v":"2022-01-01"}]
[]
[null,"MÓDULO 1 - COMPOSIÇÃO DA REMUNERAÇÃO",null,null,null,"Valor"]
{"$rows_left_out":111}
{"sheet":"3","index":6,"n_rows":118,"n_cols":8,"rows_kept":118,"cut":false,"hidden":false,"merged":[[17,1,17,3],[1,1,1,5],[2,1,2,5],[4,1,4,2],[5,1,5,2],[7,1,7,3],[106,1,106,3],[39,3,39,5],[46,1,46,3],[56,1,56,3],[68,3,68,5],[74,1,74,3],[83,1,83,3]]}
[]
[null,"PLANILHA DE ESTIMATIVA DE CUSTOS"]
[null,"Padrão IN 05/2017 e IN 07/2018 - MPDG"]
[]
[null,3,null,{"$f":"HLOOKUP($B$5,'Dados Gerais'!$D$6:$L$22,6)","v":"SUPERVISOR OPERACIONAL"},"QUANTIDADE",{"$f":"HLOOKUP($B$5,'Dados Gerais'!$D$6:$L$22,10)","v":2}]
[null,"CCT",null,{"$f":"HLOOKUP($B$5,'Dados Gerais'!$D$6:$L$22,16)","v":"SINRAD/DF x SEAC/DF\nCCT 2022/2022\nN.º DF000077/2022"},"DATA-BASE",{"$f":"HLOOKUP($B$5,'Dados Gerais'!$D$6:$L$22,17)","v":"2022-01-01"}]
[]
[null,"MÓDULO 1 - COMPOSIÇÃO DA REMUNERAÇÃO",null,null,null,"Valor"]
{"$rows_left_out":111}
{"sheet":"4","index":7,"n_rows":118,"n_cols":8,"rows_kept":118,"cut":false,"hidden":false,"merged":[[17,1,17,3],[1,1,1,5],[2,1,2,5],[4,1,4,2],[5,1,5,2],[7,1,7,3],[106,1,106,3],[39,3,39,5],[46,1,46,3],[56,1,56,3],[68,3,68,5],[74,1,74,3],[83,1,83,3]]}
[]
[null,"PLANILHA DE ESTIMATIVA DE CUSTOS"]
[null,"Padrão IN 05/2017 e IN 07/2018 - MPDG"]
[]
[null,4,null,{"$f":"HLOOKUP($B$5,'Dados Gerais'!$D$6:$L$22,6)","v":" DIRETOR DE IMAGENS – 30H"},"QUANTIDADE",{"$f":"HLOOKUP($B$5,'Dados Gerais'!$D$6:$L$22,10)","v":24}]
[null,"CCT",null,{"$f":"HLOOKUP($B$5,'Dados Gerais'!$D$6:$L$22,16)","v":"SINRAD/DF x SEAC/DF\nCCT 2022/2022\nN.º DF000077/2022"},"DATA-BASE",{"$f":"HLOOKUP($B$5,'Dados Gerais'!$D$6:$L$22,17)","v":"2022-01-01"}]
[]
[null,"MÓDULO 1 - COMPOSIÇÃO DA REMUNERAÇÃO",null,null,null,"Valor"]
{"$rows_left_out":111}
{"sheet":"5","index":8,"n_rows":118,"n_cols":8,"rows_kept":118,"cut":false,"hidden":false,"merged":[[17,1,17,3],[1,1,1,5],[2,1,2,5],[4,1,4,2],[5,1,5,2],[7,1,7,3],[106,1,106,3],[39,3,39,5],[46,1,46,3],[56,1,56,3],[68,3,68,5],[74,1,74,3],[83,1,83,3]]}
[]
[null,"PLANILHA DE ESTIMATIVA DE CUSTOS"]
[null,"Padrão IN 05/2017 e IN 07/2018 - MPDG"]
[]
[null,5,null,{"$f":"HLOOKUP($B$5,'Dados Gerais'!$D$6:$L$22,6)","v":" DIRETOR DE IMAGENS – 18H"},"QUANTIDADE",{"$f":"HLOOKUP($B$5,'Dados Gerais'!$D$6:$L$22,10)","v":21}]
[null,"CCT",null,{"$f":"HLOOKUP($B$5,'Dados Gerais'!$D$6:$L$22,16)","v":"SINRAD/DF x SEAC/DF\nCCT 2022/2022\nN.º DF000077/2022"},"DATA-BASE",{"$f":"HLOOKUP($B$5,'Dados Gerais'!$D$6:$L$22,17)","v":"2022-01-01"}]
[]
[null,"MÓDULO 1 - COMPOSIÇÃO DA REMUNERAÇÃO",null,null,null,"Valor"]
{"$rows_left_out":111}
{"sheet":"6","index":9,"n_rows":118,"n_cols":8,"rows_kept":118,"cut":false,"hidden":false,"merged":[[17,1,17,3],[1,1,1,5],[2,1,2,5],[4,1,4,2],[5,1,5,2],[7,1,7,3],[106,1,106,3],[39,3,39,5],[46,1,46,3],[56,1,56,3],[68,3,68,5],[74,1,74,3],[83,1,83,3]]}
[]
[null,"PLANILHA DE ESTIMATIVA DE CUSTOS"]
[null,"Padrão IN 05/2017 e IN 07/2018 - MPDG"]
[]
[null,6,null,{"$f":"HLOOKUP($B$5,'Dados Gerais'!$D$6:$L$22,6)","v":"TÉCNICO DE SISTEMAS AUDIOVISUAIS – especialidade Sistemas e Vídeo"},"QUANTIDADE",{"$f":"HLOOKUP($B$5,'Dados Gerais'!$D$6:$L$22,10)","v":4}]
[null,"CCT",null,{"$f":"HLOOKUP($B$5,'Dados Gerais'!$D$6:$L$22,16)","v":"SINRAD/DF x SEAC/DF\nCCT 2022/2022\nN.º DF000077/2022"},"DATA-BASE",{"$f":"HLOOKUP($B$5,'Dados Gerais'!$D$6:$L$22,17)","v":"2022-01-01"}]
[]
[null,"MÓDULO 1 - COMPOSIÇÃO DA REMUNERAÇÃO",null,null,null,"Valor"]
{"$rows_left_out":111}
{"sheet":"7","index":10,"n_rows":118,"n_cols":8,"rows_kept":118,"cut":false,"hidden":false,"merged":[[17,1,17,3],[1,1,1,5],[2,1,2,5],[4,1,4,2],[5,1,5,2],[7,1,7,3],[106,1,106,3],[39,3,39,5],[46,1,46,3],[56,1,56,3],[68,3,68,5],[74,1,74,3],[83,1,83,3]]}
[]
[null,"PLANILHA DE ESTIMATIVA DE CUSTOS"]
[null,"Padrão IN 05/2017 e IN 07/2018 - MPDG"]
[]
[null,7,null,{"$f":"HLOOKUP($B$5,'Dados Gerais'!$D$6:$L$22,6)","v":"OPERADOR DE MÍDIA AUDIOVISUAL – 30H"},"QUANTIDADE",{"$f":"HLOOKUP($B$5,'Dados Gerais'!$D$6:$L$22,10)","v":34}]
[null,"CCT",null,{"$f":"HLOOKUP($B$5,'Dados Gerais'!$D$6:$L$22,16)","v":"SINRAD/DF x SEAC/DF\nCCT 2022/2022\nN.º DF000077/2022"},"DATA-BASE",{"$f":"HLOOKUP($B$5,'Dados Gerais'!$D$6:$L$22,17)","v":"2022-01-01"}]
[]
[null,"MÓDULO 1 - COMPOSIÇÃO DA REMUNERAÇÃO",null,null,null,"Valor"]
{"$rows_left_out":111}
{"sheet":"8","index":11,"n_rows":118,"n_cols":8,"rows_kept":118,"cut":false,"hidden":false,"merged":[[17,1,17,3],[1,1,1,5],[2,1,2,5],[4,1,4,2],[5,1,5,2],[7,1,7,3],[106,1,106,3],[39,3,39,5],[46,1,46,3],[56,1,56,3],[68,3,68,5],[74,1,74,3],[83,1,83,3]]}
[]
[null,"PLANILHA DE ESTIMATIVA DE CUSTOS"]
[null,"Padrão IN 05/2017 e IN 07/2018 - MPDG"]
[]
[null,8,null,{"$f":"HLOOKUP($B$5,'Dados Gerais'!$D$6:$L$22,6)","v":"OPERADOR DE MÍDIA AUDIOVISUAL – 18H"},"QUANTIDADE",{"$f":"HLOOKUP($B$5,'Dados Gerais'!$D$6:$L$22,10)","v":26}]
[null,"CCT",null,{"$f":"HLOOKUP($B$5,'Dados Gerais'!$D$6:$L$22,16)","v":"SINRAD/DF x SEAC/DF\nCCT 2022/2022\nN.º DF000077/2022"},"DATA-BASE",{"$f":"HLOOKUP($B$5,'Dados Gerais'!$D$6:$L$22,17)","v":"2022-01-01"}]
[]
[null,"MÓDULO 1 - COMPOSIÇÃO DA REMUNERAÇÃO",null,null,null,"Valor"]
{"$rows_left_out":111}
{"sheet":"9","index":12,"n_rows":118,"n_cols":8,"rows_kept":118,"cut":false,"hidden":false,"merged":[[17,1,17,3],[1,1,1,5],[2,1,2,5],[4,1,4,2],[5,1,5,2],[7,1,7,3],[106,1,106,3],[39,3,39,5],[46,1,46,3],[56,1,56,3],[68,3,68,5],[74,1,74,3],[83,1,83,3]]}
[]
[null,"PLANILHA DE ESTIMATIVA DE CUSTOS"]
[null,"Padrão IN 05/2017 e IN 07/2018 - MPDG"]
[]
[null,9,null,{"$f":"HLOOKUP($B$5,'Dados Gerais'!$D$6:$L$22,6)","v":"OPERADOR DE TRANSMISSOR – Rádio e TV - 24H"},"QUANTIDADE",{"$f":"HLOOKUP($B$5,'Dados Gerais'!$D$6:$L$22,10)","v":5}]
[null,"CCT",null,{"$f":"HLOOKUP($B$5,'Dados Gerais'!$D$6:$L$22,16)","v":"SINRAD/DF x SEAC/DF\nCCT 2022/2022\nN.º DF000077/2022"},"DATA-BASE",{"$f":"HLOOKUP($B$5,'Dados Gerais'!$D$6:$L$22,17)","v":"2022-01-01"}]
[]
[null,"MÓDULO 1 - COMPOSIÇÃO DA REMUNERAÇÃO",null,null,null,"Valor"]
{"$rows_left_out":111}
{"sheet":"Dados Gerais","index":13,"n_rows":136,"n_cols":12,"rows_kept":136,"cut":false,"hidden":false,"merged":[[3,1,3,2]]}
[]
[]
[]
[null,"INFORMAÇÕES DE ENTRADA"]
[]
[null,null,null,1,2,3,4,5,6,7,8,9]
[null,null,null,"CARGO 1","CARGO 2","CARGO 3","CARGO 4","CARGO 5","CARGO 6","CARGO 7","CARGO 8","CARGO 9"]
[null,"INFORMAÇÕES BÁSICAS"]
{"$rows_left_out":129}
{"sheet":"Encargos Sociais","index":14,"n_rows":46,"n_cols":7,"rows_kept":46,"cut":false,"hidden":false,"merged":[[2,1,2,3],[3,1,3,4]]}
[]
[]
[]
[null,"ENCARGOS SOCIAIS SOBRE A MÃO DE OBRA"]
[null,null,null,null,"Percentuais"]
[]
[null,"Referência:"]
[null,null,"SINAPI OUT/2018"]
{"$rows_left_out":39}
{"sheet":"BDI - Geral","index":15,"n_rows":27,"n_cols":7,"rows_kept":27,"cut":false,"hidden":false,"merged":[[2,1,2,3],[3,1,3,4]]}
[]
[]
[]
[null,"COMPOSIÇÃO DA TAXA DE CUSTOS INDIRETOS, TRIBUTOS E LUCRO - BDI"]
[null,"APLICAÇÃO: MÃO DE OBRA, 13º, MATERIAIS, EPC E EQUIPAMENTO DE REGISTRO DE FREQUÊNCIA",null,null,"Percentuais"]
[]
[null,"Custos Indiretos da Contratada",null,null,{"$f":"SUM(E8:E9)","v":3.1399999999999997E-2}]
[null,null,"A","Administração Central",2.5999999999999999E-2,null,"* Nota 1 - O Somatório da Administração Central com o Lucro deve ser inferior a 12%"]
{"$rows_left_out":20}
{"sheet":"Uniformes","index":16,"n_rows":19,"n_cols":130,"rows_kept":19,"cut":false,"hidden":false,"merged":[[2,1,2,3],[3,1,3,7]]}
[]
[]
[]
[null,"UNIFORMES - AQUISIÇÃO",null,null,null,null,null,null,null,null,1,null,{"$f":"K4+1","v":2},null,{"$f":"M4+1","v":3},null,{"$f":"O4+1","v":4},null,{"$f":"Q4+1","v":5},null,{"$f":"S4+1","v":6},null,{"$f":"U4+1","v":7},null,{"$f":"W4+1","v":8},null,{"$f":"Y4+1","v":9},null,{"$f":"AA4+1","v":10},null,{"$f":"AC4+1","v":11},null,{"$f":"AE4+1","v":12},null,{"$f":"AG4+1","v":13},null,{"$f":"AI4+1","v":14},null,{"$f":"AK4+1","v":15},null,{"$f":"AM4+1","v":16},null,{"$f":"AO4+1","v":17},null,{"$f":"AQ4+1","v":18},null,{"$f":"AS4+1","v":19},null,{"$f":"AU4+1","v":20},null,{"$f":"AW4+1","v":21},null,{"$f":"AY4+1","v":22},null,{"$f":"BA4+1","v":23},null,{"$f":"BC4+1","v":24},null,{"$f":"BE4+1","v":25},null,{"$f":"BG4+1","v":26},null,{"$f":"BI4+1","v":27},null,{"$f":"BK4+1","v":28},null,{"$f":"BM4+1","v":29},null,{"$f":"BO4+1","v":30},null,{"$f":"BQ4+1","v":31},null,{"$f":"BS4+1","v":32},null,{"$f":"BU4+1","v":33},null,{"$f":"BW4+1","v":34},null,{"$f":"BY4+1","v":35},null,{"$f":"CA4+1","v":36},null,{"$f":"CC4+1","v":37},null,{"$f":"CE4+1","v":38},null,{"$f":"CG4+1","v":39},null,{"$f":"CI4+1","v":40},null,{"$f":"CK4+1","v":41},null,{"$f":"CM4+1","v":42},null,{"$f":"CO4+1","v":43},null,{"$f":"CQ4+1","v":44},null,{"$f":"CS4+1","v":45},null,{"$f":"CU4+1","v":46},null,{"$f":"CW4+1","v":47},null,{"$f":"CY4+1","v":48},null,{"$f":"DA4+1","v":49},null,{"$f":"DC4+1","v":50},null,{"$f":"DE4+1","v":51},null,{"$f":"DG4+1","v":52},null,{"$f":"DI4+1","v":53},null,{"$f":"DK4+1","v":54},null,{"$f":"DM4+1","v":55},null,{"$f":"DO4+1","v":56},null,{"$f":"DQ4+1","v":57},null,{"$f":"DS4+1","v":58},null,{"$f":"DU4+1","v":59},null,{"$f":"DW4+1","v":60}]
[]
[null,null,null,null,null,null,null,null,null,null,{"$f":"ROUND(SUM(L5:L40),2)","v":0},null,{"$f":"ROUND(SUM(N5:N40),2)","v":0},null,{"$f":"ROUND(SUM(P5:P40),2)","v":0},null,{"$f":"ROUND(SUM(R5:R40),2)","v":0},null,{"$f":"ROUND(SUM(T5:T40),2)","v":0},null,{"$f":"ROUND(SUM(V5:V40),2)","v":0},null,{"$f":"ROUND(SUM(X5:X40),2)","v":0},null,{"$f":"ROUND(SUM(Z5:Z40),2)","v":0},null,{"$f":"ROUND(SUM(AB5:AB40),2)","v":983.08},null,{"$f":"ROUND(SUM(AD5:AD40),2)","v":0},null,{"$f":"ROUND(SUM(AF5:AF40),2)","v":0},null,{"$f":"ROUND(SUM(AH5:AH40),2)","v":0},null,{"$f":"ROUND(SUM(AJ5:AJ40),2)","v":0},null,{"$f":"ROUND(SUM(AL5:AL40),2)","v":0},null,{"$f":"ROUND(SUM(AN5:AN40),2)","v":0},null,{"$f":"ROUND(SUM(AP5:AP40),2)","v":0},null,{"$f":"ROUND(SUM(AR5:AR40),2)","v":0},null,{"$f":"ROUND(SUM(AT5:AT40),2)","v":0},null,{"$f":"ROUND(SUM(AV5:AV40),2)","v":0},null,{"$f":"ROUND(SUM(AX5:AX40),2)","v":0},null,{"$f":"ROUND(SUM(AZ5:AZ40),2)","v":0},null,{"$f":"ROUND(SUM(BB5:BB40),2)","v":0},null,{"$f":"ROUND(SUM(BD5:BD40),2)","v":0},null,{"$f":"ROUND(SUM(BF5:BF40),2)","v":0},null,{"$f":"ROUND(SUM(BH5:BH40),2)","v":0},null,{"$f":"ROUND(SUM(BJ5:BJ40),2)","v":0},null,{"$f":"ROUND(SUM(BL5:BL40),2)","v":0},null,{"$f":"ROUND(SUM(BN5:BN40),2)","v":0},null,{"$f":"ROUND(SUM(BP5:BP40),2)","v":0},null,{"$f":"ROUND(SUM(BR5:BR40),2)","v":0},null,{"$f":"ROUND(SUM(BT5:BT40),2)","v":0},null,{"$f":"ROUND(SUM(BV5:BV40),2)","v":0},null,{"$f":"ROUND(SUM(BX5:BX40),2)","v":0},null,{"$f":"ROUND(SUM(BZ5:BZ40),2)","v":0},null,{"$f":"ROUND(SUM(CB5:CB40),2)","v":0},null,{"$f":"ROUND(SUM(CD5:CD40),2)","v":0},null,{"$f":"ROUND(SUM(CF5:CF40),2)","v":0},null,{"$f":"ROUND(SUM(CH5:CH40),2)","v":0},null,{"$f":"ROUND(SUM(CJ5:CJ40),2)","v":0},null,{"$f":"ROUND(SUM(CL5:CL40),2)","v":0},null,{"$f":"ROUND(SUM(CN5:CN40),2)","v":0},null,{"$f":"ROUND(SUM(CP5:CP40),2)","v":0},null,{"$f":"ROUND(SUM(CR5:CR40),2)","v":0},null,{"$f":"ROUND(SUM(CT5:CT40),2)","v":0},null,{"$f":"ROUND(SUM(CV5:CV40),2)","v":0},null,{"$f":"ROUND(SUM(CX5:CX40),2)","v":0},null,{"$f":"ROUND(SUM(CZ5:CZ40),2)","v":0},null,{"$f":"ROUND(SUM(DB5:DB40),2)","v":0},null,{"$f":"ROUND(SUM(DD5:DD40),2)","v":0},null,{"$f":"ROUND(SUM(DF5:DF40),2)","v":0},null,{"$f":"ROUND(SUM(DH5:DH40),2)","v":0},null,{"$f":"ROUND(SUM(DJ5:DJ40),2)","v":0},null,{"$f":"ROUND(SUM(DL5:DL40),2)","v":0},null,{"$f":"ROUND(SUM(DN5:DN40),2)","v":0},null,{"$f":"ROUND(SUM(DP5:DP40),2)","v":0},null,{"$f":"ROUND(SUM(DR5:DR40),2)","v":0},null,{"$f":"ROUND(SUM(DT5:DT40),2)","v":0},null,{"$f":"ROUND(SUM(DV5:DV40),2)","v":0},null,{"$f":"ROUND(SUM(DX5:DX40),2)","v":0},null,{"$f":"ROUND(SUM(DZ5:DZ40),2)","v":0}]
[null,null,"CATEGORIAS",null,null,null,null,"QUANTIDADE"]
[]
{"$rows_left_out":12}
{"sheet":"EPI","index":17,"n_rows":32,"n_cols":130,"rows_kept":32,"cut":false,"hidden":false,"merged":[[2,1,2,3],[3,1,3,7]]}
[]
[]
[]
[null,"EQUIPAMENTOS DE PROTEÇÃO INDIVIDUAL - AQUISIÇÃO",null,null,null,null,null,null,null,null,1,null,{"$f":"K4+1","v":2},null,{"$f":"M4+1","v":3},null,{"$f":"O4+1","v":4},null,{"$f":"Q4+1","v":5},null,{"$f":"S4+1","v":6},null,{"$f":"U4+1","v":7},null,{"$f":"W4+1","v":8},null,{"$f":"Y4+1","v":9},null,{"$f":"AA4+1","v":10},null,{"$f":"AC4+1","v":11},null,{"$f":"AE4+1","v":12},null,{"$f":"AG4+1","v":13},null,{"$f":"AI4+1","v":14},null,{"$f":"AK4+1","v":15},null,{"$f":"AM4+1","v":16},null,{"$f":"AO4+1","v":17},null,{"$f":"AQ4+1","v":18},null,{"$f":"AS4+1","v":19},null,{"$f":"AU4+1","v":20},null,{"$f":"AW4+1","v":21},null,{"$f":"AY4+1","v":22},null,{"$f":"BA4+1","v":23},null,{"$f":"BC4+1","v":24},null,{"$f":"BE4+1","v":25},null,{"$f":"BG4+1","v":26},null,{"$f":"BI4+1","v":27},null,{"$f":"BK4+1","v":28},null,{"$f":"BM4+1","v":29},null,{"$f":"BO4+1","v":30},null,{"$f":"BQ4+1","v":31},null,{"$f":"BS4+1","v":32},null,{"$f":"BU4+1","v":33},null,{"$f":"BW4+1","v":34},null,{"$f":"BY4+1","v":35},null,{"$f":"CA4+1","v":36},null,{"$f":"CC4+1","v":37},null,{"$f":"CE4+1","v":38},null,{"$f":"CG4+1","v":39},null,{"$f":"CI4+1","v":40},null,{"$f":"CK4+1","v":41},null,{"$f":"CM4+1","v":42},null,{"$f":"CO4+1","v":43},null,{"$f":"CQ4+1","v":44},null,{"$f":"CS4+1","v":45},null,{"$f":"CU4+1","v":46},null,{"$f":"CW4+1","v":47},null,{"$f":"CY4+1","v":48},null,{"$f":"DA4+1","v":49},null,{"$f":"DC4+1","v":50},null,{"$f":"DE4+1","v":51},null,{"$f":"DG4+1","v":52},null,{"$f":"DI4+1","v":53},null,{"$f":"DK4+1","v":54},null,{"$f":"DM4+1","v":55},null,{"$f":"DO4+1","v":56},null,{"$f":"DQ4+1","v":57},null,{"$f":"DS4+1","v":58},null,{"$f":"DU4+1","v":59},null,{"$f":"DW4+1","v":60}]
[]
[null,null,null,null,null,null,null,null,null,null,{"$f":"ROUND(SUM(L8:L33),2)","v":0},null,{"$f":"ROUND(SUM(N5:N34),2)","v":144.88},null,{"$f":"ROUND(SUM(P5:P34),2)","v":0},null,{"$f":"ROUND(SUM(R5:R34),2)","v":0},null,{"$f":"ROUND(SUM(T5:T34),2)","v":0},null,{"$f":"ROUND(SUM(V5:V34),2)","v":0},null,{"$f":"ROUND(SUM(X5:X34),2)","v":0},null,{"$f":"ROUND(SUM(Z5:Z34),2)","v":0},null,{"$f":"ROUND(SUM(AB5:AB34),2)","v":205.27},null,{"$f":"ROUND(SUM(AD5:AD34),2)","v":0},null,{"$f":"ROUND(SUM(AF5:AF34),2)","v":0},null,{"$f":"ROUND(SUM(AH5:AH34),2)","v":0},null,{"$f":"ROUND(SUM(AJ5:AJ34),2)","v":0},null,{"$f":"ROUND(SUM(AL5:AL34),2)","v":0},null,{"$f":"ROUND(SUM(AN5:AN34),2)","v":0},null,{"$f":"ROUND(SUM(AP5:AP34),2)","v":0},null,{"$f":"ROUND(SUM(AR5:AR34),2)","v":0},null,{"$f":"ROUND(SUM(AT5:AT34),2)","v":0},null,{"$f":"ROUND(SUM(AV5:AV34),2)","v":0},null,{"$f":"ROUND(SUM(AX5:AX34),2)","v":0},null,{"$f":"ROUND(SUM(AZ5:AZ34),2)","v":0},null,{"$f":"ROUND(SUM(BB5:BB34),2)","v":0},null,{"$f":"ROUND(SUM(BD5:BD34),2)","v":0},null,{"$f":"ROUND(SUM(BF5:BF34),2)","v":0},null,{"$f":"ROUND(SUM(BH5:BH34),2)","v":0},null,{"$f":"ROUND(SUM(BJ5:BJ34),2)","v":0},null,{"$f":"ROUND(SUM(BL5:BL34),2)","v":0},null,{"$f":"ROUND(SUM(BN5:BN34),2)","v":0},null,{"$f":"ROUND(SUM(BP5:BP34),2)","v":0},null,{"$f":"ROUND(SUM(BR5:BR34),2)","v":0},null,{"$f":"ROUND(SUM(BT5:BT34),2)","v":0},null,{"$f":"ROUND(SUM(BV5:BV34),2)","v":0},null,{"$f":"ROUND(SUM(BX5:BX34),2)","v":0},null,{"$f":"ROUND(SUM(BZ5:BZ34),2)","v":0},null,{"$f":"ROUND(SUM(CB5:CB34),2)","v":0},null,{"$f":"ROUND(SUM(CD5:CD34),2)","v":0},null,{"$f":"ROUND(SUM(CF5:CF34),2)","v":0},null,{"$f":"ROUND(SUM(CH5:CH34),2)","v":0},null,{"$f":"ROUND(SUM(CJ5:CJ34),2)","v":0},null,{"$f":"ROUND(SUM(CL5:CL34),2)","v":0},null,{"$f":"ROUND(SUM(CN5:CN34),2)","v":0},null,{"$f":"ROUND(SUM(CP5:CP34),2)","v":0},null,{"$f":"ROUND(SUM(CR5:CR34),2)","v":0},null,{"$f":"ROUND(SUM(CT5:CT34),2)","v":0},null,{"$f":"ROUND(SUM(CV5:CV34),2)","v":0},null,{"$f":"ROUND(SUM(CX5:CX34),2)","v":0},null,{"$f":"ROUND(SUM(CZ5:CZ34),2)","v":0},null,{"$f":"ROUND(SUM(DB5:DB34),2)","v":0},null,{"$f":"ROUND(SUM(DD5:DD34),2)","v":0},null,{"$f":"ROUND(SUM(DF5:DF34),2)","v":0},null,{"$f":"ROUND(SUM(DH5:DH34),2)","v":0},null,{"$f":"ROUND(SUM(DJ5:DJ34),2)","v":0},null,{"$f":"ROUND(SUM(DL5:DL34),2)","v":0},null,{"$f":"ROUND(SUM(DN5:DN34),2)","v":0},null,{"$f":"ROUND(SUM(DP5:DP34),2)","v":0},null,{"$f":"ROUND(SUM(DR5:DR34),2)","v":0},null,{"$f":"ROUND(SUM(DT5:DT34),2)","v":0},null,{"$f":"ROUND(SUM(DV5:DV34),2)","v":0},null,{"$f":"ROUND(SUM(DX5:DX34),2)","v":0},null,{"$f":"ROUND(SUM(DZ5:DZ34),2)","v":0}]
[null,null,"CATEGORIAS",null,null,null,null,"QUANTIDADE"]
[null,null,null,null,null,null,null,null,null,null,{"$f":"IF($C8=K$4,1,0)","v":0},null,{"$f":"IF($C8=M$4,1,0)","v":0},null,{"$f":"IF($C8=O$4,1,0)","v":0},null,{"$f":"IF($C8=Q$4,1,0)","v":0},null,{"$f":"IF($C8=S$4,1,0)","v":0},null,{"$f":"IF($C8=U$4,1,0)","v":0},null,{"$f":"IF($C8=W$4,1,0)","v":0},null,{"$f":"IF($C8=Y$4,1,0)","v":0},null,{"$f":"IF($C8=AA$4,1,0)","v":0},null,{"$f":"IF($C8=AC$4,1,0)","v":0},null,{"$f":"IF($C8=AE$4,1,0)","v":0},null,{"$f":"IF($C8=AG$4,1,0)","v":0},null,{"$f":"IF($C8=AI$4,1,0)","v":0},null,{"$f":"IF($C8=AK$4,1,0)","v":0},null,{"$f":"IF($C8=AM$4,1,0)","v":0},null,{"$f":"IF($C8=AO$4,1,0)","v":0},null,{"$f":"IF($C8=AQ$4,1,0)","v":0},null,{"$f":"IF($C8=AS$4,1,0)","v":0},null,{"$f":"IF($C8=AU$4,1,0)","v":0},null,{"$f":"IF($C8=AW$4,1,0)","v":0},null,{"$f":"IF($C8=AY$4,1,0)","v":0},null,{"$f":"IF($C8=BA$4,1,0)","v":0},null,{"$f":"IF($C8=BC$4,1,0)","v":0},null,{"$f":"IF($C8=BE$4,1,0)","v":0},null,{"$f":"IF($C8=BG$4,1,0)","v":0},null,{"$f":"IF($C8=BI$4,1,0)","v":0},null,{"$f":"IF($C8=BK$4,1,0)","v":0},null,{"$f":"IF($C8=BM$4,1,0)","v":0},null,{"$f":"IF($C8=BO$4,1,0)","v":0},null,{"$f":"IF($C8=BQ$4,1,0)","v":0},null,{"$f":"IF($C8=BS$4,1,0)","v":0},null,{"$f":"IF($C8=BU$4,1,0)","v":0},null,{"$f":"IF($C8=BW$4,1,0)","v":0},null,{"$f":"IF($C8=BY$4,1,0)","v":0},null,{"$f":"IF($C8=CA$4,1,0)","v":0},null,{"$f":"IF($C8=CC$4,1,0)","v":0},null,{"$f":"IF($C8=CE$4,1,0)","v":0},null,{"$f":"IF($C8=CG$4,1,0)","v":0},null,{"$f":"IF($C8=CI$4,1,0)","v":0},null,{"$f":"IF($C8=CK$4,1,0)","v":0},null,{"$f":"IF($C8=CM$4,1,0)","v":0},null,{"$f":"IF($C8=CO$4,1,0)","v":0},null,{"$f":"IF($C8=CQ$4,1,0)","v":0},null,{"$f":"IF($C8=CS$4,1,0)","v":0},null,{"$f":"IF($C8=CU$4,1,0)","v":0},null,{"$f":"IF($C8=CW$4,1,0)","v":0},null,{"$f":"IF($C8=CY$4,1,0)","v":0},null,{"$f":"IF($C8=DA$4,1,0)","v":0},null,{"$f":"IF($C8=DC$4,1,0)","v":0},null,{"$f":"IF($C8=DE$4,1,0)","v":0},null,{"$f":"IF($C8=DG$4,1,0)","v":0},null,{"$f":"IF($C8=DI$4,1,0)","v":0},null,{"$f":"IF($C8=DK$4,1,0)","v":0},null,{"$f":"IF($C8=DM$4,1,0)","v":0},null,{"$f":"IF($C8=DO$4,1,0)","v":0},null,{"$f":"IF($C8=DQ$4,1,0)","v":0},null,{"$f":"IF($C8=DS$4,1,0)","v":0},null,{"$f":"IF($C8=DU$4,1,0)","v":0},null,{"$f":"IF($C8=DW$4,1,0)","v":0},null,{"$f":"IF($C8=DY$4,1,0)","v":0}]
{"$rows_left_out":25}
{"sheet":"SREP","index":18,"n_rows":75,"n_cols":15,"rows_kept":75,"cut":false,"hidden":false,"merged":[[2,1,2,3],[3,1,3,14]]}
[]
[]
[]
[null,"SISTEMA DE REGISTRO ELETRÔNICO DE PRESENÇA - SREP"]
[]
[]
[null,null,"PAGAMENTO DA DEPRECIAÇÃO"]
[null,"Cód.","ITEM","DESCRIÇÃO","QUANT ANUAL","CONTA SIAFI","VALOR DE AQ.","% RESIDUAL","VIDA ÚTIL","DEP. MENSAL","CUSTO TOTAL","BDI (%)","PREÇO TOTAL","FONTE","REFERÊNCIA"]
{"$rows_left_out":68}
{"sheet":"Not. Demanda","index":19,"n_rows":64,"n_cols":8,"rows_kept":64,"cut":false,"hidden":false,"merged":[[2,1,2,3],[3,1,3,7]]}
[]
[]
[]
[null,"ADICIONAL NOTURNO SOB DEMANDA"]
[]
[]
[null,null,"CATEGORIAS",null,null,null,"HORAS / MÊS","% NOTURNA"]
[]
{"$rows_left_out":56}